maven-notifications mailing list archives

Site index · List index
Message view « Date » · « Thread »
Top « Date » · « Thread »
From Hudson <Hud...@sonatype.org>
Subject Build failed in Hudson: Maven-Plugins » Maven Assembly Plugin #40
Date Mon, 23 Jun 2008 17:39:59 GMT
See http://ci.sonatype.org/job/Maven-Plugins/org.apache.maven.plugins$maven-assembly-plugin/40/changes

------------------------------------------
[...truncated 768 lines...]
Downloading: http://localhost:8081/nexus/content/groups/public/org/codehaus/plexus/plexus-velocity/1.1.3/plexus-velocity-1.1.3.pom
976b downloaded
Downloading: http://localhost:8081/nexus/content/groups/public/org/codehaus/plexus/plexus-components/1.1.5/plexus-components-1.1.5.pom
2K downloaded
Downloading: http://localhost:8081/nexus/content/groups/public/org/codehaus/plexus/plexus-resources/1.0-alpha-4/plexus-resources-1.0-alpha-4.pom
762b downloaded
Downloading: http://localhost:8081/nexus/content/groups/public/org/codehaus/plexus/plexus-components/1.1.7/plexus-components-1.1.7.pom
4K downloaded
Downloading: http://localhost:8081/nexus/content/groups/public/org/codehaus/plexus/plexus-utils/1.4.1/plexus-utils-1.4.1.jar
184K downloaded
Downloading: http://localhost:8081/nexus/content/groups/public/org/apache/maven/shared/maven-downloader/1.1/maven-downloader-1.1.jar
6K downloaded
Downloading: http://localhost:8081/nexus/content/groups/public/org/codehaus/plexus/plexus-velocity/1.1.3/plexus-velocity-1.1.3.jar
7K downloaded
Downloading: http://localhost:8081/nexus/content/groups/public/org/codehaus/plexus/plexus-resources/1.0-alpha-4/plexus-resources-1.0-alpha-4.jar
16K downloaded
[INFO] Setting property: classpath.resource.loader.class => 'org.codehaus.plexus.velocity.ContextClassLoaderResourceLoader'.
[INFO] Setting property: velocimacro.messages.on => 'false'.
[INFO] Setting property: resource.loader => 'classpath'.
[INFO] Setting property: resource.manager.logwhenfound => 'false'.
[INFO] [remote-resources:process {execution: default}]
Downloading: http://localhost:8081/nexus/content/groups/public/org/apache/apache-jar-resource-bundle/1.3/apache-jar-resource-bundle-1.3.jar
10K downloaded
[INFO] [plexus:merge-descriptors {execution: merge}]
[INFO] [resources:resources]
[INFO] Using default encoding to copy filtered resources.
Downloading: http://localhost:8081/nexus/content/groups/public/org/codehaus/plexus/plexus-compiler-api/1.5.3/plexus-compiler-api-1.5.3.pom
624b downloaded
Downloading: http://localhost:8081/nexus/content/groups/public/org/codehaus/plexus/plexus-compiler/1.5.3/plexus-compiler-1.5.3.pom
1K downloaded
Downloading: http://localhost:8081/nexus/content/groups/public/org/codehaus/plexus/plexus-compiler-manager/1.5.3/plexus-compiler-manager-1.5.3.pom
634b downloaded
Downloading: http://localhost:8081/nexus/content/groups/public/org/codehaus/plexus/plexus-compiler-javac/1.5.3/plexus-compiler-javac-1.5.3.pom
797b downloaded
Downloading: http://localhost:8081/nexus/content/groups/public/org/codehaus/plexus/plexus-compilers/1.5.3/plexus-compilers-1.5.3.pom
7K downloaded
Downloading: http://localhost:8081/nexus/content/groups/public/org/codehaus/plexus/plexus-utils/1.0.5/plexus-utils-1.0.5.pom
918b downloaded
Downloading: http://localhost:8081/nexus/content/groups/public/org/codehaus/plexus/plexus-utils/1.0.4/plexus-utils-1.0.4.jar
159K downloaded
Downloading: http://localhost:8081/nexus/content/groups/public/org/codehaus/plexus/plexus-compiler-api/1.5.3/plexus-compiler-api-1.5.3.jar
19K downloaded
Downloading: http://localhost:8081/nexus/content/groups/public/org/codehaus/plexus/plexus-compiler-manager/1.5.3/plexus-compiler-manager-1.5.3.jar
5K downloaded
Downloading: http://localhost:8081/nexus/content/groups/public/org/codehaus/plexus/plexus-compiler-javac/1.5.3/plexus-compiler-javac-1.5.3.jar
13K downloaded
[INFO] [compiler:compile]
[INFO] Compiling 80 source files to http://ci.sonatype.org/job/Maven-Plugins/org.apache.maven.plugins$maven-assembly-plugin/ws/target/classes

[INFO] [resources:testResources]
[INFO] Using default encoding to copy filtered resources.
Downloading: http://localhost:8081/nexus/content/groups/public/junit/junit/3.8.1/junit-3.8.1.jar
118K downloaded
Downloading: http://localhost:8081/nexus/content/groups/public/org/apache/maven/shared/maven-plugin-testing-tools/1.0-alpha-1/maven-plugin-testing-tools-1.0-alpha-1.jar
21K downloaded
Downloading: http://localhost:8081/nexus/content/groups/public/org/apache/maven/shared/maven-invoker/2.0.5/maven-invoker-2.0.5.jar
19K downloaded
Downloading: http://localhost:8081/nexus/content/groups/public/org/apache/maven/shared/maven-test-tools/1.0-alpha-1/maven-test-tools-1.0-alpha-1.jar
16K downloaded
Downloading: http://localhost:8081/nexus/content/groups/public/easymock/easymock/1.2_Java1.3/easymock-1.2_Java1.3.jar
35K downloaded
Downloading: http://localhost:8081/nexus/content/groups/public/jaxen/jaxen/1.0-FCS/jaxen-1.0-FCS.jar
187K downloaded
[INFO] [compiler:testCompile]
[INFO] Compiling 33 source files to http://ci.sonatype.org/job/Maven-Plugins/org.apache.maven.plugins$maven-assembly-plugin/ws/target/test-classes

Downloading: http://localhost:8081/nexus/content/groups/public/org/apache/maven/surefire/surefire-booter/2.3.1/surefire-booter-2.3.1.pom
1K downloaded
Downloading: http://localhost:8081/nexus/content/groups/public/org/apache/maven/surefire/surefire-api/2.3.1/surefire-api-2.3.1.pom
1012b downloaded
Downloading: http://localhost:8081/nexus/content/groups/public/org/apache/maven/surefire/surefire-booter/2.3.1/surefire-booter-2.3.1.jar
33K downloaded
Downloading: http://localhost:8081/nexus/content/groups/public/org/apache/maven/surefire/surefire-api/2.3.1/surefire-api-2.3.1.jar
53K downloaded
Downloading: http://localhost:8081/nexus/content/groups/public/org/codehaus/plexus/plexus-archiver/1.0-alpha-7/plexus-archiver-1.0-alpha-7.jar
138K downloaded
[INFO] [surefire:test]
Downloading: http://localhost:8081/nexus/content/groups/public/org/codehaus/plexus/plexus-container-default/1.0-alpha-8/plexus-container-default-1.0-alpha-8.jar
190K downloaded
Downloading: http://localhost:8081/nexus/content/groups/public/org/apache/maven/surefire/surefire-junit/2.3.1/surefire-junit-2.3.1.pom
646b downloaded
Downloading: http://localhost:8081/nexus/content/groups/public/org/apache/maven/surefire/surefire-providers/2.3.1/surefire-providers-2.3.1.pom
797b downloaded
Downloading: http://localhost:8081/nexus/content/groups/public/org/apache/maven/surefire/surefire-junit/2.3.1/surefire-junit-2.3.1.jar
14K downloaded
[INFO] Surefire report directory: http://ci.sonatype.org/job/Maven-Plugins/org.apache.maven.plugins$maven-assembly-plugin/ws/target/surefire-reports


-------------------------------------------------------
 T E S T S
-------------------------------------------------------
Running org.apache.maven.plugin.assembly.archive.phase.ModuleSetAssemblyPhaseTest
Tests run: 28, Failures: 0, Errors: 0, Skipped: 0, Time elapsed: 0.913 sec
Running org.apache.maven.plugin.assembly.filter.ComponentsXmlArchiverFileFilterTest
Tests run: 7, Failures: 0, Errors: 0, Skipped: 0, Time elapsed: 0.569 sec
Running org.apache.maven.plugin.assembly.archive.task.AddArtifactTaskTest
Tests run: 5, Failures: 0, Errors: 0, Skipped: 0, Time elapsed: 0.081 sec
Running org.apache.maven.plugin.assembly.utils.FilterUtilsTest
Tests run: 12, Failures: 0, Errors: 0, Skipped: 0, Time elapsed: 0.022 sec
Running org.apache.maven.plugin.assembly.archive.DefaultAssemblyArchiverTest
Tests run: 9, Failures: 0, Errors: 0, Skipped: 0, Time elapsed: 0.093 sec
Running org.apache.maven.plugin.assembly.archive.ManifestCreationFinalizerTest
Tests run: 4, Failures: 0, Errors: 0, Skipped: 0, Time elapsed: 0.048 sec
Running org.apache.maven.plugin.assembly.archive.task.AddFileSetsTaskTest
Tests run: 9, Failures: 0, Errors: 0, Skipped: 0, Time elapsed: 0.39 sec
Running org.apache.maven.plugin.assembly.utils.ProjectUtilsTest
Tests run: 5, Failures: 0, Errors: 0, Skipped: 0, Time elapsed: 0.01 sec
Running org.apache.maven.plugin.assembly.archive.phase.RepositoryAssemblyPhaseTest
Tests run: 2, Failures: 0, Errors: 0, Skipped: 0, Time elapsed: 0.079 sec
Running org.apache.maven.plugin.assembly.utils.TypeConversionUtilsTest
Tests run: 6, Failures: 0, Errors: 0, Skipped: 0, Time elapsed: 0.008 sec
Running org.apache.maven.plugin.assembly.utils.AssemblyFileUtilsTest
Tests run: 9, Failures: 0, Errors: 0, Skipped: 0, Time elapsed: 0.04 sec
Running org.apache.maven.plugin.assembly.interpolation.AssemblyInterpolatorTest
Tests run: 7, Failures: 0, Errors: 0, Skipped: 0, Time elapsed: 0.117 sec
Running org.apache.maven.plugin.assembly.archive.phase.FileItemAssemblyPhaseTest
Tests run: 6, Failures: 0, Errors: 0, Skipped: 0, Time elapsed: 0.388 sec
Running org.apache.maven.plugin.assembly.archive.phase.DependencySetAssemblyPhaseTest
Tests run: 2, Failures: 0, Errors: 0, Skipped: 0, Time elapsed: 0.033 sec
Running org.apache.maven.plugin.assembly.archive.phase.FileSetAssemblyPhaseTest
Tests run: 2, Failures: 0, Errors: 0, Skipped: 0, Time elapsed: 0.085 sec
Running org.apache.maven.plugin.assembly.archive.task.AddDependencySetsTaskTest
Tests run: 8, Failures: 0, Errors: 0, Skipped: 0, Time elapsed: 0.095 sec
Running org.apache.maven.plugin.assembly.archive.archiver.AssemblyProxyArchiverTest
Tests run: 2, Failures: 0, Errors: 0, Skipped: 0, Time elapsed: 0.031 sec
Running org.apache.maven.plugin.assembly.utils.AssemblyFormatUtilsTest
Tests run: 55, Failures: 0, Errors: 0, Skipped: 0, Time elapsed: 0.6 sec
Running org.apache.maven.plugin.assembly.utils.PropertiesInterpolationValueSourceTest
Tests run: 3, Failures: 0, Errors: 0, Skipped: 0, Time elapsed: 0.004 sec
Running org.apache.maven.plugin.assembly.archive.task.AddDirectoryTaskTest
Tests run: 4, Failures: 0, Errors: 0, Skipped: 0, Time elapsed: 0.073 sec
Running org.apache.maven.plugin.assembly.format.FileSetFormatterTest
Tests run: 8, Failures: 0, Errors: 0, Skipped: 0, Time elapsed: 0.244 sec
Running org.apache.maven.plugin.assembly.io.DefaultAssemblyReaderTest
Tests run: 24, Failures: 0, Errors: 0, Skipped: 0, Time elapsed: 0.672 sec
Running org.apache.maven.plugin.assembly.format.FileFormatterTest
Tests run: 12, Failures: 0, Errors: 0, Skipped: 0, Time elapsed: 0.325 sec
Running org.apache.maven.plugin.assembly.utils.PropertyUtilsTest
Tests run: 9, Failures: 0, Errors: 0, Skipped: 0, Time elapsed: 0.026 sec

Results :

Tests run: 238, Failures: 0, Errors: 0, Skipped: 0

[HUDSON] Recording test results
Downloading: http://localhost:8081/nexus/content/groups/public/org/apache/maven/maven-plugin-api/2.0.6/maven-plugin-api-2.0.6.pom
1K downloaded
Downloading: http://localhost:8081/nexus/content/groups/public/org/apache/maven/maven/2.0.6/maven-2.0.6.pom
8K downloaded
Downloading: http://localhost:8081/nexus/content/groups/public/org/apache/maven/maven-archiver/2.3/maven-archiver-2.3.pom
3K downloaded
Downloading: http://localhost:8081/nexus/content/groups/public/org/codehaus/plexus/plexus-archiver/1.0-alpha-9/plexus-archiver-1.0-alpha-9.pom
1K downloaded
Downloading: http://localhost:8081/nexus/content/groups/public/org/codehaus/plexus/plexus-component-api/1.0-alpha-15/plexus-component-api-1.0-alpha-15.pom
948b downloaded
Downloading: http://localhost:8081/nexus/content/groups/public/org/codehaus/plexus/plexus-io/1.0-alpha-1/plexus-io-1.0-alpha-1.pom
1K downloaded
Downloading: http://localhost:8081/nexus/content/groups/public/org/codehaus/plexus/plexus-component-api/1.0-alpha-16/plexus-component-api-1.0-alpha-16.pom
2K downloaded
Downloading: http://localhost:8081/nexus/content/groups/public/org/codehaus/plexus/plexus-containers/1.0-alpha-16/plexus-containers-1.0-alpha-16.pom
1K downloaded
Downloading: http://localhost:8081/nexus/content/groups/public/org/codehaus/plexus/plexus-utils/1.4.9/plexus-utils-1.4.9.pom
2K downloaded
Downloading: http://localhost:8081/nexus/content/groups/public/org/codehaus/plexus/plexus-utils/1.4.9/plexus-utils-1.4.9.jar
199K downloaded
Downloading: http://localhost:8081/nexus/content/groups/public/org/apache/maven/maven-archiver/2.3/maven-archiver-2.3.jar
17K downloaded
Downloading: http://localhost:8081/nexus/content/groups/public/org/codehaus/plexus/plexus-archiver/1.0-alpha-9/plexus-archiver-1.0-alpha-9.jar
153K downloaded
Downloading: http://localhost:8081/nexus/content/groups/public/org/codehaus/plexus/plexus-io/1.0-alpha-1/plexus-io-1.0-alpha-1.jar
11K downloaded
[INFO] [jar:jar]
[INFO] Building jar: http://ci.sonatype.org/job/Maven-Plugins/org.apache.maven.plugins$maven-assembly-plugin/ws/target/maven-assembly-plugin-2.2-beta-3-SNAPSHOT.jar

[INFO] [plugin:addPluginArtifactMetadata]
[INFO] [component-it:stage {execution: stage-artifact-types}]
Using target/it-build-target and target/it-build-target/classes to build IT version of plugin
Using staged plugin-pom: http://ci.sonatype.org/job/Maven-Plugins/org.apache.maven.plugins$maven-assembly-plugin/ws/maven-assembly-artifact-types/pom-testing.xml

Using IT Plugin Jar: http://ci.sonatype.org/job/Maven-Plugins/org.apache.maven.plugins$maven-assembly-plugin/ws/maven-assembly-artifact-types/target/it-build-target/maven-assembly-artifact-types-testing.jar

[INFO] Installing http://ci.sonatype.org/job/Maven-Plugins/org.apache.maven.plugins$maven-assembly-plugin/ws/maven-assembly-artifact-types/target/it-build-target/maven-assembly-artifact-types-testing.jar
 to http://ci.sonatype.org/job/Maven-Plugins/org.apache.maven.plugins$maven-assembly-plugin/ws/target/local-repository/org/apache/maven/plugins/maven-assembly-artifact-types/testing/maven-assembly-artifact-types-testing.jar

[INFO] Installing http://ci.sonatype.org/job/Maven-Plugins/org.apache.maven.plugins$maven-assembly-plugin/ws/maven-assembly-artifact-types/../pom.xml
 to http://ci.sonatype.org/job/Maven-Plugins/org.apache.maven.plugins$maven-assembly-plugin/ws/target/local-repository/org/apache/maven/plugins/maven-assembly-plugin/2.2-beta-3-SNAPSHOT/maven-assembly-plugin-2.2-beta-3-SNAPSHOT.pom

[INFO] Installing http://ci.sonatype.org/job/Maven-Plugins/org.apache.maven.plugins$maven-assembly-plugin/ws/maven-assembly-artifact-types/../../pom.xml
 to http://ci.sonatype.org/job/Maven-Plugins/org.apache.maven.plugins$maven-assembly-plugin/ws/target/local-repository/org/apache/maven/plugins/maven-plugins/12-SNAPSHOT/maven-plugins-12-SNAPSHOT.pom

[INFO] [component-it:stage {execution: stage-plugin}]
Using target/it-build-target and target/it-build-target/classes to build IT version of plugin
Using staged plugin-pom: http://ci.sonatype.org/job/Maven-Plugins/org.apache.maven.plugins$maven-assembly-plugin/ws/pom-testing.xml

Using IT Plugin Jar: http://ci.sonatype.org/job/Maven-Plugins/org.apache.maven.plugins$maven-assembly-plugin/ws/target/it-build-target/maven-assembly-plugin-testing.jar

[INFO] Installing http://ci.sonatype.org/job/Maven-Plugins/org.apache.maven.plugins$maven-assembly-plugin/ws/target/it-build-target/maven-assembly-plugin-testing.jar
 to http://ci.sonatype.org/job/Maven-Plugins/org.apache.maven.plugins$maven-assembly-plugin/ws/target/local-repository/org/apache/maven/plugins/maven-assembly-plugin/testing/maven-assembly-plugin-testing.jar

[HUDSON] Archiving http://ci.sonatype.org/job/Maven-Plugins/org.apache.maven.plugins$maven-assembly-plugin/ws/pom.xml
 to /home/j2ee-hudson/.hudson/jobs/Maven-Plugins/modules/org.apache.maven.plugins$maven-assembly-plugin/builds/2008-06-23_12-38-35/archive/org.apache.maven.plugins/maven-assembly-plugin/2.2-beta-3-SNAPSHOT/pom.xml
[HUDSON] Archiving http://ci.sonatype.org/job/Maven-Plugins/org.apache.maven.plugins$maven-assembly-plugin/ws/target/maven-assembly-plugin-2.2-beta-3-SNAPSHOT.jar
 to /home/j2ee-hudson/.hudson/jobs/Maven-Plugins/modules/org.apache.maven.plugins$maven-assembly-plugin/builds/2008-06-23_12-38-35/archive/org.apache.maven.plugins/maven-assembly-plugin/2.2-beta-3-SNAPSHOT/maven-assembly-plugin-2.2-beta-3-SNAPSHOT.jar
[INFO] Error for project: Maven Assembly Plugin (during deploy)
[INFO] ------------------------------------------------------------------------
[INFO] Failed to stage plugin with version: testing to test local repository: http://ci.sonatype.org/job/Maven-Plugins/org.apache.maven.plugins$maven-assembly-plugin/ws/target/local-repository


Embedded error: Error installing plugin artifact to target local repository: http://ci.sonatype.org/job/Maven-Plugins/org.apache.maven.plugins$maven-assembly-plugin/ws/target/local-repository

File http://ci.sonatype.org/job/Maven-Plugins/org.apache.maven.plugins$maven-assembly-plugin/ws/target/it-build-target/maven-assembly-plugin-testing.jar
 does not exist
[INFO] ------------------------------------------------------------------------
[INFO] Trace
org.apache.maven.lifecycle.LifecycleExecutionException: Failed to stage plugin with version:
testing to test local repository: http://ci.sonatype.org/job/Maven-Plugins/org.apache.maven.plugins$maven-assembly-plugin/ws/target/local-repository

	at org.apache.maven.lifecycle.DefaultLifecycleExecutor.executeGoals(DefaultLifecycleExecutor.java:583)
	at org.apache.maven.lifecycle.DefaultLifecycleExecutor.executeGoalWithLifecycle(DefaultLifecycleExecutor.java:499)
	at org.apache.maven.lifecycle.DefaultLifecycleExecutor.executeGoal(DefaultLifecycleExecutor.java:478)
	at org.apache.maven.lifecycle.DefaultLifecycleExecutor.executeGoalAndHandleFailures(DefaultLifecycleExecutor.java:330)
	at org.apache.maven.lifecycle.DefaultLifecycleExecutor.executeTaskSegments(DefaultLifecycleExecutor.java:291)
	at org.apache.maven.lifecycle.DefaultLifecycleExecutor.execute(DefaultLifecycleExecutor.java:142)
	at org.apache.maven.lifecycle.LifecycleExecutorInterceptor.execute(LifecycleExecutorInterceptor.java:42)
	at org.apache.maven.DefaultMaven.doExecute(DefaultMaven.java:336)
	at org.apache.maven.DefaultMaven.execute(DefaultMaven.java:129)
	at org.apache.maven.cli.MavenCli.main(MavenCli.java:287)
	at sun.reflect.NativeMethodAccessorImpl.invoke0(Native Method)
	at sun.reflect.NativeMethodAccessorImpl.invoke(NativeMethodAccessorImpl.java:39)
	at sun.reflect.DelegatingMethodAccessorImpl.invoke(DelegatingMethodAccessorImpl.java:25)
	at java.lang.reflect.Method.invoke(Method.java:597)
	at org.codehaus.classworlds.Launcher.launchEnhanced(Launcher.java:315)
	at org.codehaus.classworlds.Launcher.launch(Launcher.java:255)
	at hudson.maven.agent.Main.launch(Main.java:111)
	at hudson.maven.MavenBuilder.call(MavenBuilder.java:129)
	at hudson.maven.MavenBuilder.call(MavenBuilder.java:52)
	at hudson.remoting.UserRequest.perform(UserRequest.java:69)
	at hudson.remoting.UserRequest.perform(UserRequest.java:23)
	at hudson.remoting.Request$2.run(Request.java:200)
	at java.util.concurrent.Executors$RunnableAdapter.call(Executors.java:441)
	at java.util.concurrent.FutureTask$Sync.innerRun(FutureTask.java:303)
	at java.util.concurrent.FutureTask.run(FutureTask.java:138)
	at java.util.concurrent.ThreadPoolExecutor$Worker.runTask(ThreadPoolExecutor.java:885)
	at java.util.concurrent.ThreadPoolExecutor$Worker.run(ThreadPoolExecutor.java:907)
	at java.lang.Thread.run(Thread.java:619)
Caused by: org.apache.maven.plugin.MojoExecutionException: Failed to stage plugin with version:
testing to test local repository: http://ci.sonatype.org/job/Maven-Plugins/org.apache.maven.plugins$maven-assembly-plugin/ws/target/local-repository

	at org.apache.maven.plugin.componentit.StagingBuildMojo.execute(StagingBuildMojo.java:99)
	at org.apache.maven.plugin.DefaultPluginManager.executeMojo(DefaultPluginManager.java:451)
	at hudson.maven.agent.PluginManagerInterceptor.executeMojo(PluginManagerInterceptor.java:136)
	at org.apache.maven.lifecycle.DefaultLifecycleExecutor.executeGoals(DefaultLifecycleExecutor.java:558)
	... 27 more
Caused by: org.apache.maven.shared.test.plugin.TestToolsException: Error installing plugin
artifact to target local repository: http://ci.sonatype.org/job/Maven-Plugins/org.apache.maven.plugins$maven-assembly-plugin/ws/target/local-repository

	at org.apache.maven.shared.test.plugin.RepositoryTool.createLocalRepositoryFromComponentProject(RepositoryTool.java:203)
	at org.apache.maven.shared.test.plugin.ComponentTestTool.prepareForTesting(ComponentTestTool.java:182)
	at org.apache.maven.shared.test.plugin.ComponentTestTool.prepareComponentForUnitTestingWithMavenBuilds(ComponentTestTool.java:121)
	at org.apache.maven.plugin.componentit.StagingBuildMojo.execute(StagingBuildMojo.java:90)
	... 30 more
Caused by: org.apache.maven.artifact.installer.ArtifactInstallationException: Error installing
artifact: File http://ci.sonatype.org/job/Maven-Plugins/org.apache.maven.plugins$maven-assembly-plugin/ws/target/it-build-target/maven-assembly-plugin-testing.jar
 does not exist
	at org.apache.maven.artifact.installer.DefaultArtifactInstaller.install(DefaultArtifactInstaller.java:87)
	at org.apache.maven.shared.test.plugin.RepositoryTool.createLocalRepositoryFromComponentProject(RepositoryTool.java:199)
	... 33 more
Caused by: java.io.IOException: File http://ci.sonatype.org/job/Maven-Plugins/org.apache.maven.plugins$maven-assembly-plugin/ws/target/it-build-target/maven-assembly-plugin-testing.jar
 does not exist
	at hidden.org.codehaus.plexus.util.FileUtils.copyFile(FileUtils.java:922)
	at org.apache.maven.artifact.installer.DefaultArtifactInstaller.install(DefaultArtifactInstaller.java:73)
	... 34 more
[INFO] ------------------------------------------------------------------------
[INFO] BUILD ERRORS
[INFO] ------------------------------------------------------------------------
[INFO] Total time: 1 minute 21 seconds
[INFO] Finished at: Mon Jun 23 12:39:59 CDT 2008
[INFO] Final Memory: 57M/236M
[INFO] ------------------------------------------------------------------------


Mime
View raw message