maven-notifications mailing list archives

Site index · List index
Message view « Date » · « Thread »
Top « Date » · « Thread »
From Hudson <Hud...@sonatype.org>
Subject Build failed in Hudson: Maven-2.1.x #172
Date Sat, 28 Jun 2008 15:17:18 GMT
See http://ci.sonatype.org/job/Maven-2.1.x/172/changes

Changes:

[vsiveton] o merged r672527 (MNG-3634: Improve the maven model to change the order of the
POM elements)

------------------------------------------
[...truncated 174 lines...]

Tests run: 0, Failures: 0, Errors: 0, Skipped: 0

[INFO] [jar:jar]
[INFO] Building jar: http://ci.sonatype.org/job/Maven-2.1.x/ws/maven-2.1.x/maven-reporting-api/target/maven-reporting-api-2.1-SNAPSHOT.jar

[INFO] [install:install]
[INFO] Installing http://ci.sonatype.org/job/Maven-2.1.x/ws/maven-2.1.x/maven-reporting-api/target/maven-reporting-api-2.1-SNAPSHOT.jar
 to /home/j2ee-hudson/repos/Maven-2.1.x/org/apache/maven/maven-reporting-api/2.1-SNAPSHOT/maven-reporting-api-2.1-SNAPSHOT.jar
[INFO] [deploy:deploy]
altDeploymentRepository = null
[INFO] Retrieving previous build number from apache.snapshots
Uploading: http://localhost:8081/nexus/content/repositories/maven.snapshots/org/apache/maven/maven-reporting-api/2.1-SNAPSHOT/maven-reporting-api-2.1-20080628.151701-169.jar
9K uploaded
[INFO] Uploading project information for maven-reporting-api 2.1-20080628.151701-169
[INFO] Retrieving previous metadata from apache.snapshots
[INFO] Uploading repository metadata for: 'artifact org.apache.maven:maven-reporting-api'
[INFO] Retrieving previous metadata from apache.snapshots
[INFO] Uploading repository metadata for: 'snapshot org.apache.maven:maven-reporting-api:2.1-SNAPSHOT'
[INFO] ------------------------------------------------------------------------
[INFO] Building Maven Model
[INFO]    task-segment: [clean, deploy]
[INFO] ------------------------------------------------------------------------
[INFO] [clean:clean]
[INFO] Deleting directory http://ci.sonatype.org/job/Maven-2.1.x/ws/maven-2.1.x/maven-model/target

[INFO] [enforcer:enforce {execution: enforce-jdk-15}]
[WARNING] DEPRECATED [model]: Use models instead
[INFO] [modello:java {execution: standard}]
[INFO] outputDirectory: http://ci.sonatype.org/job/Maven-2.1.x/ws/maven-2.1.x/maven-model/target/generated-sources/modello

[INFO] Working on model: src/main/mdo/maven.mdo
[INFO] Generating current version: 4.0.0
[WARNING] DEPRECATED [model]: Use models instead
[INFO] [modello:xpp3-reader {execution: standard}]
[INFO] outputDirectory: http://ci.sonatype.org/job/Maven-2.1.x/ws/maven-2.1.x/maven-model/target/generated-sources/modello

[INFO] Working on model: src/main/mdo/maven.mdo
[INFO] Generating current version: 4.0.0
[WARNING] DEPRECATED [model]: Use models instead
[INFO] [modello:xpp3-writer {execution: standard}]
[INFO] outputDirectory: http://ci.sonatype.org/job/Maven-2.1.x/ws/maven-2.1.x/maven-model/target/generated-sources/modello

[INFO] Working on model: src/main/mdo/maven.mdo
[INFO] Generating current version: 4.0.0
[INFO] [remote-resources:process {execution: default}]
[INFO] [resources:resources]
[INFO] Using default encoding to copy filtered resources.
[INFO] [compiler:compile]
[INFO] Compiling 46 source files to http://ci.sonatype.org/job/Maven-2.1.x/ws/maven-2.1.x/maven-model/target/classes

[INFO] [resources:testResources]
[INFO] Using default encoding to copy filtered resources.
[INFO] [compiler:testCompile]
[INFO] No sources to compile
[INFO] [surefire:test]
[INFO] Surefire report directory: http://ci.sonatype.org/job/Maven-2.1.x/ws/maven-2.1.x/maven-model/target/surefire-reports


-------------------------------------------------------
 T E S T S
-------------------------------------------------------
There are no tests to run.

Results :

Tests run: 0, Failures: 0, Errors: 0, Skipped: 0

[INFO] [jar:jar]
[INFO] Building jar: http://ci.sonatype.org/job/Maven-2.1.x/ws/maven-2.1.x/maven-model/target/maven-model-2.1-SNAPSHOT.jar

[INFO] [install:install]
[INFO] Installing http://ci.sonatype.org/job/Maven-2.1.x/ws/maven-2.1.x/maven-model/target/maven-model-2.1-SNAPSHOT.jar
 to /home/j2ee-hudson/repos/Maven-2.1.x/org/apache/maven/maven-model/2.1-SNAPSHOT/maven-model-2.1-SNAPSHOT.jar
[INFO] [deploy:deploy]
altDeploymentRepository = null
[INFO] Retrieving previous build number from apache.snapshots
Uploading: http://localhost:8081/nexus/content/repositories/maven.snapshots/org/apache/maven/maven-model/2.1-SNAPSHOT/maven-model-2.1-20080628.151701-191.jar
90K uploaded
[INFO] Retrieving previous metadata from apache.snapshots
[INFO] Uploading repository metadata for: 'artifact org.apache.maven:maven-model'
[INFO] Retrieving previous metadata from apache.snapshots
[INFO] Uploading repository metadata for: 'snapshot org.apache.maven:maven-model:2.1-SNAPSHOT'
[INFO] Uploading project information for maven-model 2.1-20080628.151701-191
[INFO] ------------------------------------------------------------------------
[INFO] Building Maven Profile Model
[INFO]    task-segment: [clean, deploy]
[INFO] ------------------------------------------------------------------------
[INFO] [clean:clean]
[INFO] Deleting directory http://ci.sonatype.org/job/Maven-2.1.x/ws/maven-2.1.x/maven-profile/target

[INFO] [enforcer:enforce {execution: enforce-jdk-15}]
[WARNING] DEPRECATED [model]: Use models instead
[INFO] [modello:java {execution: standard}]
[INFO] outputDirectory: http://ci.sonatype.org/job/Maven-2.1.x/ws/maven-2.1.x/maven-profile/target/generated-sources/modello

[INFO] Working on model: src/main/mdo/profiles.mdo
[INFO] Generating current version: 1.0.0
[WARNING] DEPRECATED [model]: Use models instead
[INFO] [modello:xpp3-reader {execution: standard}]
[INFO] outputDirectory: http://ci.sonatype.org/job/Maven-2.1.x/ws/maven-2.1.x/maven-profile/target/generated-sources/modello

[INFO] Working on model: src/main/mdo/profiles.mdo
[INFO] Generating current version: 1.0.0
[WARNING] DEPRECATED [model]: Use models instead
[INFO] [modello:xpp3-writer {execution: standard}]
[INFO] outputDirectory: http://ci.sonatype.org/job/Maven-2.1.x/ws/maven-2.1.x/maven-profile/target/generated-sources/modello

[INFO] Working on model: src/main/mdo/profiles.mdo
[INFO] Generating current version: 1.0.0
[INFO] [remote-resources:process {execution: default}]
[INFO] [resources:resources]
[INFO] Using default encoding to copy filtered resources.
[INFO] [compiler:compile]
[INFO] Compiling 15 source files to http://ci.sonatype.org/job/Maven-2.1.x/ws/maven-2.1.x/maven-profile/target/classes

[INFO] [resources:testResources]
[INFO] Using default encoding to copy filtered resources.
[INFO] [compiler:testCompile]
[INFO] No sources to compile
[INFO] [surefire:test]
[INFO] Surefire report directory: http://ci.sonatype.org/job/Maven-2.1.x/ws/maven-2.1.x/maven-profile/target/surefire-reports


-------------------------------------------------------
 T E S T S
-------------------------------------------------------
There are no tests to run.

Results :

Tests run: 0, Failures: 0, Errors: 0, Skipped: 0

[INFO] [jar:jar]
[INFO] Building jar: http://ci.sonatype.org/job/Maven-2.1.x/ws/maven-2.1.x/maven-profile/target/maven-profile-2.1-SNAPSHOT.jar

[INFO] [install:install]
[INFO] Installing http://ci.sonatype.org/job/Maven-2.1.x/ws/maven-2.1.x/maven-profile/target/maven-profile-2.1-SNAPSHOT.jar
 to /home/j2ee-hudson/repos/Maven-2.1.x/org/apache/maven/maven-profile/2.1-SNAPSHOT/maven-profile-2.1-SNAPSHOT.jar
[INFO] [deploy:deploy]
altDeploymentRepository = null
[INFO] Retrieving previous build number from apache.snapshots
Uploading: http://localhost:8081/nexus/content/repositories/maven.snapshots/org/apache/maven/maven-profile/2.1-SNAPSHOT/maven-profile-2.1-20080628.151701-188.jar
34K uploaded
[INFO] Retrieving previous metadata from apache.snapshots
[INFO] Uploading repository metadata for: 'snapshot org.apache.maven:maven-profile:2.1-SNAPSHOT'
[INFO] Uploading project information for maven-profile 2.1-20080628.151701-188
[INFO] Retrieving previous metadata from apache.snapshots
[INFO] Uploading repository metadata for: 'artifact org.apache.maven:maven-profile'
[INFO] ------------------------------------------------------------------------
[INFO] Building Maven Plugin API
[INFO]    task-segment: [clean, deploy]
[INFO] ------------------------------------------------------------------------
[INFO] [clean:clean]
[INFO] Deleting directory http://ci.sonatype.org/job/Maven-2.1.x/ws/maven-2.1.x/maven-plugin-api/target

[INFO] snapshot org.apache.maven.artifact:maven-artifact:3.0-SNAPSHOT: checking for updates
from central
[INFO] snapshot org.apache.maven.artifact:maven-artifact:3.0-SNAPSHOT: checking for updates
from codehaus.snapshots
[INFO] snapshot org.apache.maven.artifact:maven-artifact:3.0-SNAPSHOT: checking for updates
from apache.snapshots
[INFO] [enforcer:enforce {execution: enforce-jdk-15}]
[WARNING] DEPRECATED [model]: Use models instead
[INFO] [modello:java {execution: standard}]
[INFO] outputDirectory: http://ci.sonatype.org/job/Maven-2.1.x/ws/maven-2.1.x/maven-plugin-api/target/generated-sources/modello

[INFO] Working on model: src/main/mdo/lifecycle.mdo
[INFO] Generating current version: 1.0.0
[WARNING] DEPRECATED [model]: Use models instead
[INFO] [modello:xpp3-reader {execution: standard}]
[INFO] outputDirectory: http://ci.sonatype.org/job/Maven-2.1.x/ws/maven-2.1.x/maven-plugin-api/target/generated-sources/modello

[INFO] Working on model: src/main/mdo/lifecycle.mdo
[INFO] Generating current version: 1.0.0
[WARNING] DEPRECATED [model]: Use models instead
[INFO] [modello:xpp3-writer {execution: standard}]
[INFO] outputDirectory: http://ci.sonatype.org/job/Maven-2.1.x/ws/maven-2.1.x/maven-plugin-api/target/generated-sources/modello

[INFO] Working on model: src/main/mdo/lifecycle.mdo
[INFO] Generating current version: 1.0.0
[INFO] [remote-resources:process {execution: default}]
[INFO] [resources:resources]
[INFO] Using default encoding to copy filtered resources.
[INFO] [compiler:compile]
[INFO] Compiling 23 source files to http://ci.sonatype.org/job/Maven-2.1.x/ws/maven-2.1.x/maven-plugin-api/target/classes

[INFO] [resources:testResources]
[INFO] Using default encoding to copy filtered resources.
[INFO] [compiler:testCompile]
[INFO] Compiling 1 source file to http://ci.sonatype.org/job/Maven-2.1.x/ws/maven-2.1.x/maven-plugin-api/target/test-classes

[INFO] [surefire:test]
[INFO] Surefire report directory: http://ci.sonatype.org/job/Maven-2.1.x/ws/maven-2.1.x/maven-plugin-api/target/surefire-reports


-------------------------------------------------------
 T E S T S
-------------------------------------------------------
Running org.apache.maven.plugin.lifecycle.LifecycleXpp3ReaderTest
Tests run: 1, Failures: 0, Errors: 0, Skipped: 0, Time elapsed: 0.066 sec

Results :

Tests run: 1, Failures: 0, Errors: 0, Skipped: 0

[INFO] [jar:jar]
[INFO] Building jar: http://ci.sonatype.org/job/Maven-2.1.x/ws/maven-2.1.x/maven-plugin-api/target/maven-plugin-api-2.1-SNAPSHOT.jar

[INFO] [install:install]
[INFO] Installing http://ci.sonatype.org/job/Maven-2.1.x/ws/maven-2.1.x/maven-plugin-api/target/maven-plugin-api-2.1-SNAPSHOT.jar
 to /home/j2ee-hudson/repos/Maven-2.1.x/org/apache/maven/maven-plugin-api/2.1-SNAPSHOT/maven-plugin-api-2.1-SNAPSHOT.jar
[INFO] [deploy:deploy]
altDeploymentRepository = null
[INFO] Retrieving previous build number from apache.snapshots
Uploading: http://localhost:8081/nexus/content/repositories/maven.snapshots/org/apache/maven/maven-plugin-api/2.1-SNAPSHOT/maven-plugin-api-2.1-20080628.151701-185.jar
42K uploaded
[INFO] Retrieving previous metadata from apache.snapshots
[INFO] Uploading repository metadata for: 'artifact org.apache.maven:maven-plugin-api'
[INFO] Retrieving previous metadata from apache.snapshots
[INFO] Uploading repository metadata for: 'snapshot org.apache.maven:maven-plugin-api:2.1-SNAPSHOT'
[INFO] Uploading project information for maven-plugin-api 2.1-20080628.151701-185
[INFO] ------------------------------------------------------------------------
[INFO] Building Maven Project Builder
[INFO]    task-segment: [clean, deploy]
[INFO] ------------------------------------------------------------------------
[INFO] [clean:clean]
[INFO] Deleting directory http://ci.sonatype.org/job/Maven-2.1.x/ws/maven-2.1.x/maven-project/target

[INFO] [enforcer:enforce {execution: enforce-jdk-15}]
[INFO] [remote-resources:process {execution: default}]
[INFO] [resources:resources]
[INFO] Using default encoding to copy filtered resources.
[INFO] [compiler:compile]
[INFO] Compiling 74 source files to http://ci.sonatype.org/job/Maven-2.1.x/ws/maven-2.1.x/maven-project/target/classes

[INFO] ------------------------------------------------------------------------
[ERROR] BUILD FAILURE
[INFO] ------------------------------------------------------------------------
[INFO] Compilation failure

http://ci.sonatype.org/job/Maven-2.1.x/ws/maven-2.1.x/maven-project/src/main/java/org/apache/maven/profiles/injection/DefaultProfileInjector.java
:[362,50] cannot find symbol
symbol  : method getDistributionManagement()
location: class org.apache.maven.model.Profile

http://ci.sonatype.org/job/Maven-2.1.x/ws/maven-2.1.x/maven-project/src/main/java/org/apache/maven/project/ModelUtils.java
:[619,16] cannot find symbol
symbol  : method getDistributionManagement()
location: class org.apache.maven.model.Profile


[INFO] ------------------------------------------------------------------------
[INFO] Trace
org.apache.maven.BuildFailureException: Compilation failure
	at org.apache.maven.lifecycle.DefaultLifecycleExecutor.executeGoals(DefaultLifecycleExecutor.java:579)
	at org.apache.maven.lifecycle.DefaultLifecycleExecutor.executeGoalWithLifecycle(DefaultLifecycleExecutor.java:499)
	at org.apache.maven.lifecycle.DefaultLifecycleExecutor.executeGoal(DefaultLifecycleExecutor.java:478)
	at org.apache.maven.lifecycle.DefaultLifecycleExecutor.executeGoalAndHandleFailures(DefaultLifecycleExecutor.java:330)
	at org.apache.maven.lifecycle.DefaultLifecycleExecutor.executeTaskSegments(DefaultLifecycleExecutor.java:291)
	at org.apache.maven.lifecycle.DefaultLifecycleExecutor.execute(DefaultLifecycleExecutor.java:142)
	at org.apache.maven.DefaultMaven.doExecute(DefaultMaven.java:336)
	at org.apache.maven.DefaultMaven.execute(DefaultMaven.java:129)
	at org.apache.maven.cli.MavenCli.main(MavenCli.java:287)
	at sun.reflect.NativeMethodAccessorImpl.invoke0(Native Method)
	at sun.reflect.NativeMethodAccessorImpl.invoke(NativeMethodAccessorImpl.java:39)
	at sun.reflect.DelegatingMethodAccessorImpl.invoke(DelegatingMethodAccessorImpl.java:25)
	at java.lang.reflect.Method.invoke(Method.java:585)
	at org.codehaus.classworlds.Launcher.launchEnhanced(Launcher.java:315)
	at org.codehaus.classworlds.Launcher.launch(Launcher.java:255)
	at org.codehaus.classworlds.Launcher.mainWithExitCode(Launcher.java:430)
	at org.codehaus.classworlds.Launcher.main(Launcher.java:375)
Caused by: org.apache.maven.plugin.CompilationFailureException: Compilation failure
	at org.apache.maven.plugin.AbstractCompilerMojo.execute(AbstractCompilerMojo.java:516)
	at org.apache.maven.plugin.CompilerMojo.execute(CompilerMojo.java:114)
	at org.apache.maven.plugin.DefaultPluginManager.executeMojo(DefaultPluginManager.java:451)
	at org.apache.maven.lifecycle.DefaultLifecycleExecutor.executeGoals(DefaultLifecycleExecutor.java:558)
	... 16 more
[INFO] ------------------------------------------------------------------------
[INFO] Total time: 21 seconds
[INFO] Finished at: Sat Jun 28 10:17:17 CDT 2008
[INFO] Final Memory: 50M/417M
[INFO] ------------------------------------------------------------------------


Mime
View raw message