maven-notifications mailing list archives

Site index · List index
Message view « Date » · « Thread »
Top « Date » · « Thread »
From Hudson <Hud...@sonatype.org>
Subject Build failed in Hudson: Maven-2.0.x » Maven Artifact #332
Date Thu, 04 Sep 2008 13:35:12 GMT
See http://ci.sonatype.org/job/Maven-2.0.x/org.apache.maven$maven-artifact/332/changes

------------------------------------------
[INFO] ------------------------------------------------------------------------
[INFO] Building Maven Artifact
[INFO]    task-segment: [clean, deploy]
[INFO] ------------------------------------------------------------------------
[INFO] [clean:clean]
[INFO] Deleting directory http://ci.sonatype.org/job/Maven-2.0.x/org.apache.maven$maven-artifact/ws/target

[INFO] Deleting directory http://ci.sonatype.org/job/Maven-2.0.x/org.apache.maven$maven-artifact/ws/target/classes

[INFO] Deleting directory http://ci.sonatype.org/job/Maven-2.0.x/org.apache.maven$maven-artifact/ws/target/test-classes

[INFO] Deleting directory http://ci.sonatype.org/job/Maven-2.0.x/org.apache.maven$maven-artifact/ws/target/site

[INFO] [remote-resources:process {execution: default}]
[INFO] [resources:resources]
[INFO] Using encoding: 'UTF-8' to copy filtered resources.
[INFO] [compiler:compile]
[INFO] Compiling 64 source files to http://ci.sonatype.org/job/Maven-2.0.x/org.apache.maven$maven-artifact/ws/target/classes

[HUDSON] Archiving http://ci.sonatype.org/job/Maven-2.0.x/org.apache.maven$maven-artifact/ws/pom.xml
 to /home/j2ee-hudson/.hudson/jobs/Maven-2.0.x/modules/org.apache.maven$maven-artifact/builds/2008-09-04_08-34-52/archive/org.apache.maven/maven-artifact/2.0.10-SNAPSHOT/pom.xml
[INFO] ------------------------------------------------------------------------
[ERROR] BUILD FAILURE
[INFO] ------------------------------------------------------------------------
[INFO] Compilation failure

http://ci.sonatype.org/job/Maven-2.0.x/org.apache.maven$maven-artifact/ws/src/main/java/org/apache/maven/artifact/resolver/DefaultArtifactCollector.java
:[349,85] cannot find symbol
symbol  : variable childRemoteRepositories
location: class org.apache.maven.artifact.resolver.DefaultArtifactCollector

http://ci.sonatype.org/job/Maven-2.0.x/org.apache.maven$maven-artifact/ws/src/main/java/org/apache/maven/artifact/resolver/DefaultArtifactCollector.java
:[368,76] cannot find symbol
symbol  : variable childRemoteRepositories
location: class org.apache.maven.artifact.resolver.DefaultArtifactCollector

http://ci.sonatype.org/job/Maven-2.0.x/org.apache.maven$maven-artifact/ws/src/main/java/org/apache/maven/artifact/resolver/DefaultArtifactCollector.java
:[373,44] cannot find symbol
symbol  : variable childRemoteRepositories
location: class org.apache.maven.artifact.resolver.DefaultArtifactCollector

http://ci.sonatype.org/job/Maven-2.0.x/org.apache.maven$maven-artifact/ws/src/main/java/org/apache/maven/artifact/resolver/DefaultArtifactCollector.java
:[384,110] cannot find symbol
symbol  : variable childRemoteRepositories
location: class org.apache.maven.artifact.resolver.DefaultArtifactCollector


[INFO] ------------------------------------------------------------------------
[INFO] Trace
org.apache.maven.BuildFailureException: Compilation failure
	at org.apache.maven.lifecycle.DefaultLifecycleExecutor.executeGoals(DefaultLifecycleExecutor.java:579)
	at org.apache.maven.lifecycle.DefaultLifecycleExecutor.executeGoalWithLifecycle(DefaultLifecycleExecutor.java:499)
	at org.apache.maven.lifecycle.DefaultLifecycleExecutor.executeGoal(DefaultLifecycleExecutor.java:478)
	at org.apache.maven.lifecycle.DefaultLifecycleExecutor.executeGoalAndHandleFailures(DefaultLifecycleExecutor.java:330)
	at org.apache.maven.lifecycle.DefaultLifecycleExecutor.executeTaskSegments(DefaultLifecycleExecutor.java:291)
	at org.apache.maven.lifecycle.DefaultLifecycleExecutor.execute(DefaultLifecycleExecutor.java:142)
	at org.apache.maven.lifecycle.LifecycleExecutorInterceptor.execute(LifecycleExecutorInterceptor.java:42)
	at org.apache.maven.DefaultMaven.doExecute(DefaultMaven.java:336)
	at org.apache.maven.DefaultMaven.execute(DefaultMaven.java:129)
	at org.apache.maven.cli.MavenCli.main(MavenCli.java:287)
	at sun.reflect.NativeMethodAccessorImpl.invoke0(Native Method)
	at sun.reflect.NativeMethodAccessorImpl.invoke(NativeMethodAccessorImpl.java:39)
	at sun.reflect.DelegatingMethodAccessorImpl.invoke(DelegatingMethodAccessorImpl.java:25)
	at java.lang.reflect.Method.invoke(Method.java:597)
	at org.codehaus.classworlds.Launcher.launchEnhanced(Launcher.java:315)
	at org.codehaus.classworlds.Launcher.launch(Launcher.java:255)
	at hudson.maven.agent.Main.launch(Main.java:133)
	at hudson.maven.MavenBuilder.call(MavenBuilder.java:139)
	at hudson.maven.MavenModuleSetBuild$Builder.call(MavenModuleSetBuild.java:543)
	at hudson.maven.MavenModuleSetBuild$Builder.call(MavenModuleSetBuild.java:489)
	at hudson.remoting.UserRequest.perform(UserRequest.java:69)
	at hudson.remoting.UserRequest.perform(UserRequest.java:23)
	at hudson.remoting.Request$2.run(Request.java:213)
	at java.util.concurrent.Executors$RunnableAdapter.call(Executors.java:441)
	at java.util.concurrent.FutureTask$Sync.innerRun(FutureTask.java:303)
	at java.util.concurrent.FutureTask.run(FutureTask.java:138)
	at java.util.concurrent.ThreadPoolExecutor$Worker.runTask(ThreadPoolExecutor.java:885)
	at java.util.concurrent.ThreadPoolExecutor$Worker.run(ThreadPoolExecutor.java:907)
	at java.lang.Thread.run(Thread.java:619)
Caused by: org.apache.maven.plugin.CompilationFailureException: Compilation failure
	at org.apache.maven.plugin.AbstractCompilerMojo.execute(AbstractCompilerMojo.java:516)
	at org.apache.maven.plugin.CompilerMojo.execute(CompilerMojo.java:114)
	at org.apache.maven.plugin.DefaultPluginManager.executeMojo(DefaultPluginManager.java:451)
	at hudson.maven.agent.PluginManagerInterceptor.executeMojo(PluginManagerInterceptor.java:159)
	at org.apache.maven.lifecycle.DefaultLifecycleExecutor.executeGoals(DefaultLifecycleExecutor.java:558)
	... 28 more
[INFO] ------------------------------------------------------------------------
[INFO] Total time: 14 seconds
[INFO] Finished at: Thu Sep 04 08:35:12 CDT 2008
[INFO] Final Memory: 35M/427M
[INFO] ------------------------------------------------------------------------


Mime
View raw message