maven-notifications mailing list archives

Site index · List index
Message view « Date » · « Thread »
Top « Date » · « Thread »
From Hudson <Hud...@sonatype.org>
Subject Build failed in Hudson: mercury #100
Date Fri, 03 Oct 2008 18:03:13 GMT
See http://ci.sonatype.org/job/mercury/100/changes

Changes:

[ogusakov] preparing a release

[ogusakov] preparing release

[ogusakov] preparing a release

[ogusakov] preparing a release

------------------------------------------
[...truncated 15179 lines...]
	at org.apache.maven.surefire.suite.AbstractDirectoryTestSuite.execute(AbstractDirectoryTestSuite.java:127)
	at org.apache.maven.surefire.Surefire.run(Surefire.java:177)
	at sun.reflect.NativeMethodAccessorImpl.invoke0(Native Method)
	at sun.reflect.NativeMethodAccessorImpl.invoke(NativeMethodAccessorImpl.java:39)
	at sun.reflect.DelegatingMethodAccessorImpl.invoke(DelegatingMethodAccessorImpl.java:25)
	at java.lang.reflect.Method.invoke(Method.java:585)
	at org.apache.maven.surefire.booter.SurefireBooter.runSuitesInProcess(SurefireBooter.java:338)
	at org.apache.maven.surefire.booter.SurefireBooter.main(SurefireBooter.java:997)

Running org.apache.maven.mercury.repository.tests.LocalRepositoryReaderM2Test
query a:a:3::jar->[a:a:4::jar, a:a:3::jar]
Expected exception: org.apache.maven.mercury.repository.api.RepositoryException: Verifier
for .asc is mandatory, but file http://ci.sonatype.org/job/mercury/ws/mercury/mercury-it/./target/test-classes/repo/a/a/3/a-3.jar.asc
 does not exist
Expected exception: org.apache.maven.mercury.repository.api.RepositoryException: Signature
".asc": verification failed for file http://ci.sonatype.org/job/mercury/ws/mercury/mercury-it/./target/test-classes/repo/a/a/2/a-2.jar

Tests run: 13, Failures: 0, Errors: 0, Skipped: 0, Time elapsed: 0.223 sec
Running org.apache.maven.mercury.repository.tests.RemoteRepositoryReaderM2Test
./target/test-classes/repo
Oct 3, 2008 1:03:10 PM sun.reflect.NativeMethodAccessorImpl invoke0
INFO: jetty-6.1.12.rc2
Oct 3, 2008 1:03:10 PM sun.reflect.NativeMethodAccessorImpl invoke0
INFO: Started SocketConnector@0.0.0.0:36052
Oct 3, 2008 1:03:10 PM org.apache.maven.mercury.repository.remote.m2.RemoteRepositoryReaderM2
<init>
INFO: temporary repository  folder set to /tmp/repo
./target/test-classes/repo
Oct 3, 2008 1:03:10 PM sun.reflect.NativeMethodAccessorImpl invoke0
INFO: jetty-6.1.12.rc2
Oct 3, 2008 1:03:10 PM sun.reflect.NativeMethodAccessorImpl invoke0
INFO: Started SocketConnector@0.0.0.0:36922
Oct 3, 2008 1:03:10 PM org.apache.maven.mercury.repository.remote.m2.RemoteRepositoryReaderM2
<init>
INFO: temporary repository  folder set to /tmp/repo
./target/test-classes/repo
Oct 3, 2008 1:03:10 PM sun.reflect.NativeMethodAccessorImpl invoke0
INFO: jetty-6.1.12.rc2
Oct 3, 2008 1:03:10 PM sun.reflect.NativeMethodAccessorImpl invoke0
INFO: Started SocketConnector@0.0.0.0:49764
Oct 3, 2008 1:03:10 PM org.apache.maven.mercury.repository.remote.m2.RemoteRepositoryReaderM2
<init>
INFO: temporary repository  folder set to /tmp/repo
./target/test-classes/repo
Oct 3, 2008 1:03:10 PM sun.reflect.NativeMethodAccessorImpl invoke0
INFO: jetty-6.1.12.rc2
Oct 3, 2008 1:03:10 PM sun.reflect.NativeMethodAccessorImpl invoke0
INFO: Started SocketConnector@0.0.0.0:59599
Oct 3, 2008 1:03:10 PM org.apache.maven.mercury.repository.remote.m2.RemoteRepositoryReaderM2
<init>
INFO: temporary repository  folder set to /tmp/repo
./target/test-classes/repo
Oct 3, 2008 1:03:10 PM sun.reflect.NativeMethodAccessorImpl invoke0
INFO: jetty-6.1.12.rc2
Oct 3, 2008 1:03:10 PM sun.reflect.NativeMethodAccessorImpl invoke0
INFO: Started SocketConnector@0.0.0.0:55057
Oct 3, 2008 1:03:10 PM org.apache.maven.mercury.repository.remote.m2.RemoteRepositoryReaderM2
<init>
INFO: temporary repository  folder set to /tmp/repo
query a:a:3::jar->[a:a:3::jar, a:a:4::jar]
./target/test-classes/repo
Oct 3, 2008 1:03:11 PM sun.reflect.NativeMethodAccessorImpl invoke0
INFO: jetty-6.1.12.rc2
Oct 3, 2008 1:03:11 PM sun.reflect.NativeMethodAccessorImpl invoke0
INFO: Started SocketConnector@0.0.0.0:58455
Oct 3, 2008 1:03:11 PM org.apache.maven.mercury.repository.remote.m2.RemoteRepositoryReaderM2
<init>
INFO: temporary repository  folder set to /tmp/repo
./target/test-classes/repo
Oct 3, 2008 1:03:11 PM sun.reflect.NativeMethodAccessorImpl invoke0
INFO: jetty-6.1.12.rc2
Oct 3, 2008 1:03:11 PM sun.reflect.NativeMethodAccessorImpl invoke0
INFO: Started SocketConnector@0.0.0.0:46733
Oct 3, 2008 1:03:11 PM org.apache.maven.mercury.repository.remote.m2.RemoteRepositoryReaderM2
<init>
INFO: temporary repository  folder set to /tmp/repo
./target/test-classes/repo
Oct 3, 2008 1:03:11 PM sun.reflect.NativeMethodAccessorImpl invoke0
INFO: jetty-6.1.12.rc2
Oct 3, 2008 1:03:11 PM sun.reflect.GeneratedMethodAccessor5 invoke
INFO: Started SocketConnector@0.0.0.0:46438
Oct 3, 2008 1:03:11 PM org.apache.maven.mercury.repository.remote.m2.RemoteRepositoryReaderM2
<init>
INFO: temporary repository  folder set to /tmp/repo
./target/test-classes/repo
Oct 3, 2008 1:03:11 PM sun.reflect.GeneratedMethodAccessor5 invoke
INFO: jetty-6.1.12.rc2
Oct 3, 2008 1:03:11 PM sun.reflect.GeneratedMethodAccessor5 invoke
INFO: Started SocketConnector@0.0.0.0:50503
Oct 3, 2008 1:03:11 PM org.apache.maven.mercury.repository.remote.m2.RemoteRepositoryReaderM2
<init>
INFO: temporary repository  folder set to /tmp/repo
./target/test-classes/repo
Oct 3, 2008 1:03:11 PM sun.reflect.GeneratedMethodAccessor5 invoke
INFO: jetty-6.1.12.rc2
Oct 3, 2008 1:03:11 PM sun.reflect.GeneratedMethodAccessor5 invoke
INFO: Started SocketConnector@0.0.0.0:33786
Oct 3, 2008 1:03:11 PM org.apache.maven.mercury.repository.remote.m2.RemoteRepositoryReaderM2
<init>
INFO: temporary repository  folder set to /tmp/repo
./target/test-classes/repo
Oct 3, 2008 1:03:11 PM sun.reflect.GeneratedMethodAccessor5 invoke
INFO: jetty-6.1.12.rc2
Oct 3, 2008 1:03:11 PM sun.reflect.GeneratedMethodAccessor5 invoke
INFO: Started SocketConnector@0.0.0.0:54532
Oct 3, 2008 1:03:11 PM org.apache.maven.mercury.repository.remote.m2.RemoteRepositoryReaderM2
<init>
INFO: temporary repository  folder set to /tmp/repo
./target/test-classes/repo
Oct 3, 2008 1:03:11 PM sun.reflect.GeneratedMethodAccessor5 invoke
INFO: jetty-6.1.12.rc2
Oct 3, 2008 1:03:11 PM sun.reflect.GeneratedMethodAccessor5 invoke
INFO: Started SocketConnector@0.0.0.0:53170
Oct 3, 2008 1:03:11 PM org.apache.maven.mercury.repository.remote.m2.RemoteRepositoryReaderM2
<init>
INFO: temporary repository  folder set to /tmp/repo
./target/test-classes/repo
Oct 3, 2008 1:03:11 PM sun.reflect.GeneratedMethodAccessor5 invoke
INFO: jetty-6.1.12.rc2
Oct 3, 2008 1:03:11 PM sun.reflect.GeneratedMethodAccessor5 invoke
INFO: Started SocketConnector@0.0.0.0:55080
Oct 3, 2008 1:03:11 PM org.apache.maven.mercury.repository.remote.m2.RemoteRepositoryReaderM2
<init>
INFO: temporary repository  folder set to /tmp/repo
./target/test-classes/repo
Oct 3, 2008 1:03:11 PM sun.reflect.GeneratedMethodAccessor5 invoke
INFO: jetty-6.1.12.rc2
Oct 3, 2008 1:03:11 PM sun.reflect.GeneratedMethodAccessor5 invoke
INFO: Started SocketConnector@0.0.0.0:60554
Oct 3, 2008 1:03:11 PM org.apache.maven.mercury.repository.remote.m2.RemoteRepositoryReaderM2
<init>
INFO: temporary repository  folder set to /tmp/repo
Expected Exceptions: {a:a:3::jar=org.apache.maven.mercury.repository.api.RepositoryException:
[org.apache.maven.mercury.spi.http.client.HttpClientException: java.lang.Exception: Mandatory
checksum file not found /repo/a/a/3/a-3.jar.asc for [http://localhost:60554/repo/a/a/3/a-3.jar
<=> /tmp/repo/a/a/3/a-3.jar]]}
./target/test-classes/repo
Oct 3, 2008 1:03:11 PM sun.reflect.GeneratedMethodAccessor5 invoke
INFO: jetty-6.1.12.rc2
Oct 3, 2008 1:03:11 PM sun.reflect.GeneratedMethodAccessor5 invoke
INFO: Started SocketConnector@0.0.0.0:53550
Oct 3, 2008 1:03:11 PM org.apache.maven.mercury.repository.remote.m2.RemoteRepositoryReaderM2
<init>
INFO: temporary repository  folder set to /tmp/repo
Expected Exceptions: {a:a:2::jar=org.apache.maven.mercury.repository.api.RepositoryException:
[org.apache.maven.mercury.spi.http.client.HttpClientException: Checksum failed for [http://localhost:53550/repo/a/a/2/a-2.jar
<=> /tmp/repo/a/a/2/a-2.jar]]}
./target/test-classes/repo
Oct 3, 2008 1:03:11 PM sun.reflect.GeneratedMethodAccessor5 invoke
INFO: jetty-6.1.12.rc2
Oct 3, 2008 1:03:11 PM sun.reflect.GeneratedMethodAccessor5 invoke
INFO: Started SocketConnector@0.0.0.0:41468
Oct 3, 2008 1:03:11 PM org.apache.maven.mercury.repository.remote.m2.RemoteRepositoryReaderM2
<init>
INFO: temporary repository  folder set to /tmp/repo
Tests run: 16, Failures: 0, Errors: 0, Skipped: 0, Time elapsed: 1.131 sec
Running org.apache.maven.mercury.repository.tests.ReadWriteTest
./target/test-classes/repo
Oct 3, 2008 1:03:11 PM sun.reflect.GeneratedMethodAccessor5 invoke
INFO: jetty-6.1.12.rc2
Oct 3, 2008 1:03:11 PM sun.reflect.GeneratedMethodAccessor5 invoke
INFO: Started SocketConnector@0.0.0.0:60954
Oct 3, 2008 1:03:11 PM org.apache.maven.mercury.repository.remote.m2.RemoteRepositoryReaderM2
<init>
INFO: temporary repository  folder set to /tmp/repo
Oct 3, 2008 1:03:11 PM org.apache.maven.mercury.repository.tests.ReadWriteTest setUp
INFO: local repo is in /tmp/local897repo
added 4
Oct 3, 2008 1:03:11 PM org.apache.maven.mercury.repository.tests.ReadWriteTest testOneArtifact
INFO: a:a:jar:4:compile - pom length is 467
./target/test-classes/repo
Oct 3, 2008 1:03:12 PM sun.reflect.GeneratedMethodAccessor5 invoke
INFO: jetty-6.1.12.rc2
Oct 3, 2008 1:03:12 PM sun.reflect.GeneratedMethodAccessor5 invoke
INFO: Started SocketConnector@0.0.0.0:55749
Oct 3, 2008 1:03:12 PM org.apache.maven.mercury.repository.remote.m2.RemoteRepositoryReaderM2
<init>
INFO: temporary repository  folder set to /tmp/repo
Oct 3, 2008 1:03:12 PM org.apache.maven.mercury.repository.tests.ReadWriteTest setUp
INFO: local repo is in /tmp/local899repo
added 4
Oct 3, 2008 1:03:12 PM org.apache.maven.mercury.repository.tests.ReadWriteTest testOneArtifactWithClassifier
INFO: a:a:jar:sources:4:compile - pom length is 467
Tests run: 2, Failures: 0, Errors: 0, Skipped: 0, Time elapsed: 0.309 sec
Running org.apache.maven.mercury.repository.tests.LocalRepositoryWriterM2Test
Oct 3, 2008 1:03:12 PM org.apache.maven.mercury.repository.tests.AbstractRepositoryWriterM2Test
setUp
INFO: Binary size is 159630 bytes
skipping
Oct 3, 2008 1:03:12 PM org.apache.maven.mercury.repository.tests.AbstractRepositoryWriterM2Test
setUp
INFO: Binary size is 159630 bytes
skipping
Oct 3, 2008 1:03:12 PM org.apache.maven.mercury.repository.tests.AbstractRepositoryWriterM2Test
setUp
INFO: Binary size is 159630 bytes
added 2.0.9
Oct 3, 2008 1:03:12 PM org.apache.maven.mercury.repository.tests.AbstractRepositoryWriterM2Test
setUp
INFO: Binary size is 159630 bytes
added 2.0.9-20080805.215925-8
Oct 3, 2008 1:03:12 PM org.apache.maven.mercury.repository.tests.AbstractRepositoryWriterM2Test
setUp
INFO: Binary size is 159630 bytes
added 2.0.9-SNAPSHOT
Tests run: 5, Failures: 0, Errors: 0, Skipped: 0, Time elapsed: 0.303 sec

Results :

Tests in error: 
  testWriteContentionMultipleArtifacts(org.apache.maven.mercury.repository.tests.RemoteRepositoryWriterM2NexusTest)
  testWriteContentionSingleArtifact(org.apache.maven.mercury.repository.tests.RemoteRepositoryWriterM2NexusTest)
  testWriteArtifact(org.apache.maven.mercury.repository.tests.RemoteRepositoryWriterM2NexusTest)
  testWriteSnapshotAsTS(org.apache.maven.mercury.repository.tests.RemoteRepositoryWriterM2NexusTest)
  testWriteSnapshot(org.apache.maven.mercury.repository.tests.RemoteRepositoryWriterM2NexusTest)

Tests run: 41, Failures: 0, Errors: 5, Skipped: 0

[INFO] Stopping plexus application.
Requesting Shutdown on Port 33002...
org.sonatype.appbooter.ctl.AppBooterServiceException: Failed to connect to plexus application
for shutdown.
	at org.sonatype.appbooter.AbstractForkedAppBooter.stop(AbstractForkedAppBooter.java:452)
	at org.sonatype.appbooter.AbstractForkedAppBooter.shutdown(AbstractForkedAppBooter.java:486)
	at org.apache.maven.mercury.repository.tests.Nexus$1.run(Nexus.java:50)
Caused by: org.sonatype.appbooter.ctl.ControlConnectionException
	at org.sonatype.appbooter.ctl.ControllerClient.sendControlMessage(ControllerClient.java:214)
	at org.sonatype.appbooter.ctl.ControllerClient.shutdown(ControllerClient.java:149)
	at org.sonatype.appbooter.AbstractForkedAppBooter.stop(AbstractForkedAppBooter.java:448)
	... 2 more
Caused by: java.net.ConnectException: Connection refused
	at java.net.PlainSocketImpl.socketConnect(Native Method)
	at java.net.PlainSocketImpl.doConnect(PlainSocketImpl.java:333)
	at java.net.PlainSocketImpl.connectToAddress(PlainSocketImpl.java:195)
	at java.net.PlainSocketImpl.connect(PlainSocketImpl.java:182)
	at java.net.SocksSocketImpl.connect(SocksSocketImpl.java:366)
	at java.net.Socket.connect(Socket.java:519)
	at java.net.Socket.connect(Socket.java:469)
	at java.net.Socket.<init>(Socket.java:366)
	at java.net.Socket.<init>(Socket.java:208)
	at org.sonatype.appbooter.ctl.ControllerClient.sendControlMessage(ControllerClient.java:208)
	... 4 more
[INFO] ------------------------------------------------------------------------
[ERROR] BUILD FAILURE
[INFO] ------------------------------------------------------------------------
[INFO] There are test failures.

Please refer to http://ci.sonatype.org/job/mercury/ws/mercury/mercury-it/target/surefire-reports
 for the individual test results.
[INFO] ------------------------------------------------------------------------
[INFO] Trace
org.apache.maven.BuildFailureException: There are test failures.

Please refer to http://ci.sonatype.org/job/mercury/ws/mercury/mercury-it/target/surefire-reports
 for the individual test results.
	at org.apache.maven.lifecycle.DefaultLifecycleExecutor.executeGoals(DefaultLifecycleExecutor.java:579)
	at org.apache.maven.lifecycle.DefaultLifecycleExecutor.executeGoalWithLifecycle(DefaultLifecycleExecutor.java:499)
	at org.apache.maven.lifecycle.DefaultLifecycleExecutor.executeGoal(DefaultLifecycleExecutor.java:478)
	at org.apache.maven.lifecycle.DefaultLifecycleExecutor.executeGoalAndHandleFailures(DefaultLifecycleExecutor.java:330)
	at org.apache.maven.lifecycle.DefaultLifecycleExecutor.executeTaskSegments(DefaultLifecycleExecutor.java:291)
	at org.apache.maven.lifecycle.DefaultLifecycleExecutor.execute(DefaultLifecycleExecutor.java:142)
	at org.apache.maven.DefaultMaven.doExecute(DefaultMaven.java:336)
	at org.apache.maven.DefaultMaven.execute(DefaultMaven.java:129)
	at org.apache.maven.cli.MavenCli.main(MavenCli.java:287)
	at sun.reflect.NativeMethodAccessorImpl.invoke0(Native Method)
	at sun.reflect.NativeMethodAccessorImpl.invoke(NativeMethodAccessorImpl.java:39)
	at sun.reflect.DelegatingMethodAccessorImpl.invoke(DelegatingMethodAccessorImpl.java:25)
	at java.lang.reflect.Method.invoke(Method.java:585)
	at org.codehaus.classworlds.Launcher.launchEnhanced(Launcher.java:315)
	at org.codehaus.classworlds.Launcher.launch(Launcher.java:255)
	at org.codehaus.classworlds.Launcher.mainWithExitCode(Launcher.java:430)
	at org.codehaus.classworlds.Launcher.main(Launcher.java:375)
Caused by: org.apache.maven.plugin.MojoFailureException: There are test failures.

Please refer to http://ci.sonatype.org/job/mercury/ws/mercury/mercury-it/target/surefire-reports
 for the individual test results.
	at org.apache.maven.plugin.surefire.SurefirePlugin.execute(SurefirePlugin.java:530)
	at org.apache.maven.plugin.DefaultPluginManager.executeMojo(DefaultPluginManager.java:451)
	at org.apache.maven.lifecycle.DefaultLifecycleExecutor.executeGoals(DefaultLifecycleExecutor.java:558)
	... 16 more
[INFO] ------------------------------------------------------------------------
[INFO] Total time: 3 minutes 9 seconds
[INFO] Finished at: Fri Oct 03 13:03:12 CDT 2008
[INFO] Final Memory: 68M/156M
[INFO] ------------------------------------------------------------------------


Mime
View raw message