maven-notifications mailing list archives

Site index · List index
Message view « Date » · « Thread »
Top « Date » · « Thread »
From Hudson <Hud...@sonatype.org>
Subject Build failed in Hudson: maven-core-integration-testing » 1.5,ubuntu #20
Date Sun, 26 Oct 2008 01:02:37 GMT
See http://grid.sonatype.com/ci/job/maven-core-integration-testing/./jdk=1.5,label=ubuntu/20/changes

Changes:

[brett] now that 2.1.0-M1 is released, use it as a more descriptive lower bound

[Benjamin Bentmann] o Deleted it0126
  (This was originally meant to test MJAR-75 which is now checked over in the plugin project.
The only core part in this game was the resolution of active project artifacts from the reactor
which is already captured by the IT for MNG-2921.)

[Benjamin Bentmann] o Suppressed needless INFO log noise from Jetty

[Benjamin Bentmann] o Restored original intention of it0120, i.e. merely captured MNG-2921,
and decoupled it from production plugins
  (The test was changed in r572208 to also capture MNG-2871 which is however a substantially
different issue)
o Added dedicated IT for MNG-2871

------------------------------------------
[...truncated 28 lines...]
AU        core-it-suite/src/test/resources/mng-2921/pom.xml
A         core-it-suite/src/test/resources/mng-2921/consumer
AU        core-it-suite/src/test/resources/mng-2921/consumer/pom.xml
A         core-it-suite/src/test/resources/mng-2871
A         core-it-suite/src/test/resources/mng-2871/ejbs
A         core-it-suite/src/test/resources/mng-2871/ejbs/target
A         core-it-suite/src/test/resources/mng-2871/ejbs/target/classes
AU        core-it-suite/src/test/resources/mng-2871/ejbs/target/classes/test.properties
AU        core-it-suite/src/test/resources/mng-2871/ejbs/pom.xml
AU        core-it-suite/src/test/resources/mng-2871/pom.xml
A         core-it-suite/src/test/resources/mng-2871/consumer
AU        core-it-suite/src/test/resources/mng-2871/consumer/pom.xml
At revision 707923
[maven-its] $ mvn -Dlabel=ubuntu -Djdk=1.5 clean install -B -e
+ Error stacktraces are turned on.
[INFO] Scanning for projects...
[INFO] Reactor build order: 
[INFO]   Maven Integration Testing
[INFO]   Maven Integration Test Helper Library
[INFO]   Maven Integration Tests :: Plugins
[INFO]   Maven Integration Tests :: Core Plugin Stubs
[INFO]   Maven Integration Test Plugin :: Maven Surefire Plugin Stub
[INFO]   Maven Integration Test Plugin :: Maven JAR Plugin Stub
[INFO]   Maven Integration Tests
[INFO]   Maven Integration Test Plugin :: Artifact
[INFO]   Maven Integration Test Plugin :: Class Loader :: Dependency A
[INFO]   Maven Integration Test Plugin :: Class Loader :: Dependency B
[INFO]   Maven Integration Test Plugin :: Class Loader
[INFO]   Maven Integration Test Plugin :: Class Loader :: Aggregator
[INFO]   Maven Integration Test Plugin :: Configuration
[INFO]   Maven Integration Test Plugin :: Context Passing
[INFO]   Maven Integration Test Plugin :: Maven Clean Plugin Stub
[INFO]   Maven Integration Test Plugin :: Maven Compiler Plugin Stub
[INFO]   Maven Integration Test Plugin :: Maven Deploy Plugin Stub
[INFO]   Maven Integration Test Plugin :: Maven EAR Plugin Stub
[INFO]   Maven Integration Test Plugin :: Maven EJB Plugin Stub
[INFO]   Maven Integration Test Plugin :: Maven Install Plugin Stub
[INFO]   Maven Integration Test Plugin :: Maven Javadoc Plugin Stub
[INFO]   Maven Integration Test Plugin :: Maven Plugin Plugin Stub
[INFO]   Maven Integration Test Plugin :: Maven RAR Plugin Stub
[INFO]   Maven Integration Test Plugin :: Maven Resources Plugin Stub
[INFO]   Maven Integration Test Plugin :: Maven Site Plugin Stub
[INFO]   Maven Integration Test Plugin :: Maven Source Plugin Stub
[INFO]   Maven Integration Test Plugin :: Maven WAR Plugin Stub
[INFO]   Maven Integration Test Plugin :: Dependency Resolution
[INFO]   Maven Integration Test Plugin :: Expression
[INFO]   Maven Integration Test Plugin :: File
[INFO]   Maven Integration Test Plugin :: Fork
[INFO]   Maven Integration Test Plugin :: Envar
[INFO]   Maven Integration Test Plugin :: Interpolated POM Configuration
[INFO]   Maven Integration Test Plugin :: Loadable
[INFO]   Maven Core Integration Test Plugin
[INFO]   Maven Integration Test Plugin :: Packaging
[INFO]   Maven Integration Test Plugin :: Parameter Implementation
[INFO]   Maven Integration Test Plugin :: Project Interpolation
[INFO]   Maven Integration Test Plugin :: Setter
[INFO]   Maven Integration Test Plugin :: Site
[INFO]   Maven Integration Test Plugin :: Touch
[INFO]   Maven Integration Test Plugin :: Uses Properties Plugin
[INFO]   Maven Integration Test Plugin :: Uses Wagon Plugin
[INFO]   Maven Integration Test Plugin :: This plugin should contain the mojos needed by all
tests.
[INFO]   Unnamed - org.apache.maven.its.plugins:maven-it-plugin-plexus-utils-11:maven-plugin:2.1-SNAPSHOT
[INFO]   Unnamed - org.apache.maven.its.plugins:maven-it-plugin-plexus-utils-new:maven-plugin:2.1-SNAPSHOT
[INFO]   Maven Integration Test Wagon
[INFO]   Maven Integration Test Support Artifacts
[INFO]   Unnamed - org.apache.maven.its:core-integration-testing-parent:pom:2.1-SNAPSHOT
[INFO] ------------------------------------------------------------------------
[INFO] Building Maven Integration Testing
[INFO]    task-segment: [clean, install]
[INFO] ------------------------------------------------------------------------
[INFO] [clean:clean]
[INFO] Deleting directory /home/hudson/workspace/maven-core-integration-testing/jdk/1.5/label/ubuntu/maven-its/core-it-support/target
[INFO] Setting property: classpath.resource.loader.class => 'org.codehaus.plexus.velocity.ContextClassLoaderResourceLoader'.
[INFO] Setting property: velocimacro.messages.on => 'false'.
[INFO] Setting property: resource.loader => 'classpath'.
[INFO] Setting property: resource.manager.logwhenfound => 'false'.
[INFO] [remote-resources:process {execution: default}]
[INFO] [site:attach-descriptor]
[INFO] [install:install]
[INFO] Installing /home/hudson/workspace/maven-core-integration-testing/jdk/1.5/label/ubuntu/maven-its/core-it-support/pom.xml
to /home/hudson/.m2/repository/org/apache/maven/its/core-integration-testing/2.1-SNAPSHOT/core-integration-testing-2.1-SNAPSHOT.pom
[INFO] ------------------------------------------------------------------------
[INFO] Building Maven Integration Test Helper Library
[INFO]    task-segment: [clean, install]
[INFO] ------------------------------------------------------------------------
[INFO] [clean:clean]
[INFO] Deleting directory /home/hudson/workspace/maven-core-integration-testing/jdk/1.5/label/ubuntu/maven-its/core-it-support/maven-it-helper/target
[INFO] [remote-resources:process {execution: default}]
[INFO] [resources:resources]
[INFO] Using encoding: 'UTF-8' to copy filtered resources.
[INFO] [compiler:compile]
[INFO] Compiling 1 source file to /home/hudson/workspace/maven-core-integration-testing/jdk/1.5/label/ubuntu/maven-its/core-it-support/maven-it-helper/target/classes
[INFO] [resources:testResources]
[INFO] Using encoding: 'UTF-8' to copy filtered resources.
[INFO] [compiler:testCompile]
[INFO] No sources to compile
[INFO] [surefire:test]
[INFO] Surefire report directory: /home/hudson/workspace/maven-core-integration-testing/jdk/1.5/label/ubuntu/maven-its/core-it-support/maven-it-helper/target/surefire-reports

-------------------------------------------------------
 T E S T S
-------------------------------------------------------
There are no tests to run.

Results :

Tests run: 0, Failures: 0, Errors: 0, Skipped: 0

[INFO] [jar:jar]
[INFO] Building jar: /home/hudson/workspace/maven-core-integration-testing/jdk/1.5/label/ubuntu/maven-its/core-it-support/maven-it-helper/target/maven-it-helper-2.1-SNAPSHOT.jar
[INFO] [install:install]
[INFO] Installing /home/hudson/workspace/maven-core-integration-testing/jdk/1.5/label/ubuntu/maven-its/core-it-support/maven-it-helper/target/maven-it-helper-2.1-SNAPSHOT.jar
to /home/hudson/.m2/repository/org/apache/maven/its/maven-it-helper/2.1-SNAPSHOT/maven-it-helper-2.1-SNAPSHOT.jar
[INFO] ------------------------------------------------------------------------
[INFO] Building Maven Integration Tests :: Plugins
[INFO]    task-segment: [clean, install]
[INFO] ------------------------------------------------------------------------
[INFO] [clean:clean]
[INFO] Deleting directory /home/hudson/workspace/maven-core-integration-testing/jdk/1.5/label/ubuntu/maven-its/core-it-support/core-it-plugins/target
[INFO] [remote-resources:process {execution: default}]
[INFO] [site:attach-descriptor]
[INFO] [install:install]
[INFO] Installing /home/hudson/workspace/maven-core-integration-testing/jdk/1.5/label/ubuntu/maven-its/core-it-support/core-it-plugins/pom.xml
to /home/hudson/.m2/repository/org/apache/maven/its/plugins/maven-it-plugins/2.1-SNAPSHOT/maven-it-plugins-2.1-SNAPSHOT.pom
[INFO] ------------------------------------------------------------------------
[INFO] Building Maven Integration Tests :: Core Plugin Stubs
[INFO]    task-segment: [clean, install]
[INFO] ------------------------------------------------------------------------
[INFO] [clean:clean]
[INFO] Deleting directory /home/hudson/workspace/maven-core-integration-testing/jdk/1.5/label/ubuntu/maven-its/core-it-support/core-it-plugins/maven-it-plugin-core-stubs/target
[INFO] [remote-resources:process {execution: default}]
[INFO] [site:attach-descriptor]
[INFO] [install:install]
[INFO] Installing /home/hudson/workspace/maven-core-integration-testing/jdk/1.5/label/ubuntu/maven-its/core-it-support/core-it-plugins/maven-it-plugin-core-stubs/pom.xml
to /home/hudson/.m2/repository/org/apache/maven/its/plugins/maven-it-plugin-core-stubs/2.1-SNAPSHOT/maven-it-plugin-core-stubs-2.1-SNAPSHOT.pom
[INFO] ------------------------------------------------------------------------
[INFO] Building Maven Integration Test Plugin :: Maven Surefire Plugin Stub
[INFO]    task-segment: [clean, install]
[INFO] ------------------------------------------------------------------------
[INFO] [clean:clean]
[INFO] Deleting directory /home/hudson/workspace/maven-core-integration-testing/jdk/1.5/label/ubuntu/maven-its/core-it-support/core-it-plugins/maven-it-plugin-core-stubs/maven-surefire-plugin/target
[INFO] [plugin:descriptor]
[INFO] Using 2 extractors.
[INFO] Applying extractor for language: java
[INFO] Extractor for language: java found 1 mojo descriptors.
[INFO] Applying extractor for language: bsh
[INFO] Extractor for language: bsh found 0 mojo descriptors.
[INFO] [remote-resources:process {execution: default}]
[INFO] [resources:resources]
[INFO] Using encoding: 'UTF-8' to copy filtered resources.
[INFO] [compiler:compile]
[INFO] Compiling 1 source file to /home/hudson/workspace/maven-core-integration-testing/jdk/1.5/label/ubuntu/maven-its/core-it-support/core-it-plugins/maven-it-plugin-core-stubs/maven-surefire-plugin/target/classes
[INFO] [resources:testResources]
[INFO] Using encoding: 'UTF-8' to copy filtered resources.
[INFO] [compiler:testCompile]
[INFO] Not compiling test sources
[INFO] [surefire:test]
[INFO] Tests are skipped.
[INFO] [jar:jar]
[INFO] Building jar: /home/hudson/workspace/maven-core-integration-testing/jdk/1.5/label/ubuntu/maven-its/core-it-support/core-it-plugins/maven-it-plugin-core-stubs/maven-surefire-plugin/target/maven-surefire-plugin-0.1-stub-SNAPSHOT.jar
[INFO] [plugin:addPluginArtifactMetadata]
[INFO] [install:install]
[INFO] Installing /home/hudson/workspace/maven-core-integration-testing/jdk/1.5/label/ubuntu/maven-its/core-it-support/core-it-plugins/maven-it-plugin-core-stubs/maven-surefire-plugin/target/maven-surefire-plugin-0.1-stub-SNAPSHOT.jar
to /home/hudson/.m2/repository/org/apache/maven/plugins/maven-surefire-plugin/0.1-stub-SNAPSHOT/maven-surefire-plugin-0.1-stub-SNAPSHOT.jar
[INFO] [plugin:updateRegistry]
[INFO] ------------------------------------------------------------------------
[INFO] Building Maven Integration Test Plugin :: Maven JAR Plugin Stub
[INFO]    task-segment: [clean, install]
[INFO] ------------------------------------------------------------------------
[INFO] [clean:clean]
[INFO] Deleting directory /home/hudson/workspace/maven-core-integration-testing/jdk/1.5/label/ubuntu/maven-its/core-it-support/core-it-plugins/maven-it-plugin-core-stubs/maven-jar-plugin/target
[INFO] [plugin:descriptor]
[INFO] Using 2 extractors.
[INFO] Applying extractor for language: java
[INFO] Extractor for language: java found 1 mojo descriptors.
[INFO] Applying extractor for language: bsh
[INFO] Extractor for language: bsh found 0 mojo descriptors.
[INFO] [remote-resources:process {execution: default}]
[INFO] [resources:resources]
[INFO] Using encoding: 'UTF-8' to copy filtered resources.
[INFO] [compiler:compile]
[INFO] Compiling 1 source file to /home/hudson/workspace/maven-core-integration-testing/jdk/1.5/label/ubuntu/maven-its/core-it-support/core-it-plugins/maven-it-plugin-core-stubs/maven-jar-plugin/target/classes
[INFO] [resources:testResources]
[INFO] Using encoding: 'UTF-8' to copy filtered resources.
[INFO] [compiler:testCompile]
[INFO] Not compiling test sources
[INFO] [surefire:test]
[INFO] Tests are skipped.
[INFO] [jar:jar]
[INFO] Building jar: /home/hudson/workspace/maven-core-integration-testing/jdk/1.5/label/ubuntu/maven-its/core-it-support/core-it-plugins/maven-it-plugin-core-stubs/maven-jar-plugin/target/maven-jar-plugin-0.1-stub-SNAPSHOT.jar
[INFO] [plugin:addPluginArtifactMetadata]
[INFO] [install:install]
[INFO] Installing /home/hudson/workspace/maven-core-integration-testing/jdk/1.5/label/ubuntu/maven-its/core-it-support/core-it-plugins/maven-it-plugin-core-stubs/maven-jar-plugin/target/maven-jar-plugin-0.1-stub-SNAPSHOT.jar
to /home/hudson/.m2/repository/org/apache/maven/plugins/maven-jar-plugin/0.1-stub-SNAPSHOT/maven-jar-plugin-0.1-stub-SNAPSHOT.jar
[INFO] [plugin:updateRegistry]
[INFO] ------------------------------------------------------------------------
[INFO] Building Maven Integration Tests
[INFO]    task-segment: [clean, install]
[INFO] ------------------------------------------------------------------------
[INFO] [clean:clean]
[INFO] Deleting directory /home/hudson/workspace/maven-core-integration-testing/jdk/1.5/label/ubuntu/maven-its/core-it-suite/target
[INFO] [remote-resources:process {execution: default}]
[INFO] [resources:resources]
[INFO] Using encoding: 'UTF-8' to copy filtered resources.
[INFO] [compiler:compile]
[INFO] No sources to compile
[INFO] [resources:testResources]
[INFO] Using encoding: 'UTF-8' to copy filtered resources.
[INFO] [compiler:testCompile]
[INFO] Compiling 205 source files to /home/hudson/workspace/maven-core-integration-testing/jdk/1.5/label/ubuntu/maven-its/core-it-suite/target/test-classes
[INFO] ------------------------------------------------------------------------
[ERROR] BUILD FAILURE
[INFO] ------------------------------------------------------------------------
[INFO] Compilation failure

/home/hudson/workspace/maven-core-integration-testing/jdk/1.5/label/ubuntu/maven-its/core-it-suite/src/test/java/org/apache/maven/it/MavenITmng2790Test.java:[62,30]
cannot find symbol
symbol  : method getArtifactMetadataPath(java.lang.String,java.lang.String,java.lang.String)
location: class org.apache.maven.it.Verifier

/home/hudson/workspace/maven-core-integration-testing/jdk/1.5/label/ubuntu/maven-its/core-it-suite/src/test/java/org/apache/maven/it/MavenITmng2790Test.java:[64,30]
cannot find symbol
symbol  : method getArtifactMetadataPath(java.lang.String,java.lang.String)
location: class org.apache.maven.it.Verifier


[INFO] ------------------------------------------------------------------------
[INFO] Trace
org.apache.maven.BuildFailureException: Compilation failure
	at org.apache.maven.lifecycle.DefaultLifecycleExecutor.executeGoals(DefaultLifecycleExecutor.java:697)
	at org.apache.maven.lifecycle.DefaultLifecycleExecutor.executeGoalWithLifecycle(DefaultLifecycleExecutor.java:538)
	at org.apache.maven.lifecycle.DefaultLifecycleExecutor.executeGoal(DefaultLifecycleExecutor.java:517)
	at org.apache.maven.lifecycle.DefaultLifecycleExecutor.executeGoalAndHandleFailures(DefaultLifecycleExecutor.java:369)
	at org.apache.maven.lifecycle.DefaultLifecycleExecutor.executeTaskSegments(DefaultLifecycleExecutor.java:330)
	at org.apache.maven.lifecycle.DefaultLifecycleExecutor.execute(DefaultLifecycleExecutor.java:181)
	at org.apache.maven.DefaultMaven.doExecute(DefaultMaven.java:336)
	at org.apache.maven.DefaultMaven.execute(DefaultMaven.java:129)
	at org.apache.maven.cli.MavenCli.main(MavenCli.java:302)
	at sun.reflect.NativeMethodAccessorImpl.invoke0(Native Method)
	at sun.reflect.NativeMethodAccessorImpl.invoke(NativeMethodAccessorImpl.java:39)
	at sun.reflect.DelegatingMethodAccessorImpl.invoke(DelegatingMethodAccessorImpl.java:25)
	at java.lang.reflect.Method.invoke(Method.java:585)
	at org.codehaus.classworlds.Launcher.launchEnhanced(Launcher.java:315)
	at org.codehaus.classworlds.Launcher.launch(Launcher.java:255)
	at org.codehaus.classworlds.Launcher.mainWithExitCode(Launcher.java:430)
	at org.codehaus.classworlds.Launcher.main(Launcher.java:375)
Caused by: org.apache.maven.plugin.CompilationFailureException: Compilation failure
	at org.apache.maven.plugin.AbstractCompilerMojo.execute(AbstractCompilerMojo.java:516)
	at org.apache.maven.plugin.TestCompilerMojo.execute(TestCompilerMojo.java:102)
	at org.apache.maven.plugin.DefaultPluginManager.executeMojo(DefaultPluginManager.java:458)
	at org.apache.maven.lifecycle.DefaultLifecycleExecutor.executeGoals(DefaultLifecycleExecutor.java:676)
	... 16 more
[INFO] ------------------------------------------------------------------------
[INFO] Total time: 15 seconds
[INFO] Finished at: Sat Oct 25 19:02:36 GMT-06:00 2008
[INFO] Final Memory: 27M/79M
[INFO] ------------------------------------------------------------------------


Mime
View raw message