maven-notifications mailing list archives

Site index · List index
Message view « Date » · « Thread »
Top « Date » · « Thread »
From Hudson <Hud...@sonatype.org>
Subject Build failed in Hudson: maven-core-integration-testing #201
Date Tue, 14 Oct 2008 21:04:10 GMT
See http://ci.sonatype.org/job/maven-core-integration-testing/201/changes

Changes:

[Benjamin Bentmann] o Added consistency checks for class loaders to catch the cause for MNG-1898
at its base

[Benjamin Bentmann] o Added some more ITs to check POM interpolation

------------------------------------------
started
Updating https://svn.apache.org/repos/asf/maven/core-integration-testing/trunk
U         core-it-suite/src/test/java/org/apache/maven/it/IntegrationTestSuite.java
AU        core-it-suite/src/test/java/org/apache/maven/it/MavenIT0139Test.java
AU        core-it-suite/src/test/java/org/apache/maven/it/MavenIT0140Test.java
AU        core-it-suite/src/test/java/org/apache/maven/it/MavenIT0141Test.java
A         core-it-suite/src/test/resources/it0140
A         core-it-suite/src/test/resources/it0140/child
AU        core-it-suite/src/test/resources/it0140/child/pom.xml
AU        core-it-suite/src/test/resources/it0140/pom.xml
A         core-it-suite/src/test/resources/it0141
A         core-it-suite/src/test/resources/it0141/child
AU        core-it-suite/src/test/resources/it0141/child/pom.xml
AU        core-it-suite/src/test/resources/it0141/pom.xml
A         core-it-suite/src/test/resources/it0139
A         core-it-suite/src/test/resources/it0139/child
AU        core-it-suite/src/test/resources/it0139/child/pom.xml
AU        core-it-suite/src/test/resources/it0139/pom.xml
U         core-it-support/core-it-plugins/maven-it-plugin-class-loader/maven-it-plugin-class-loader/src/main/java/org/apache/maven/plugin/coreit/LoadMojo.java
At revision 704681
[maven-its] $ mvn clean deploy -B -U -e -Dmaven.repo.local=/home/j2ee-hudson/repos/core-its
+ Error stacktraces are turned on.
[INFO] Scanning for projects...
[INFO] Reactor build order: 
[INFO]   Maven Integration Testing
[INFO]   Maven Integration Test Helper Library
[INFO]   Maven Integration Tests :: Plugins
[INFO]   Maven Integration Tests :: Core Plugin Stubs
[INFO]   Maven Integration Test Plugin :: Maven Surefire Plugin Stub
[INFO]   Maven Integration Test Plugin :: Maven JAR Plugin Stub
[INFO]   Maven Integration Tests
[INFO]   Maven Integration Test Plugin :: Artifact
[INFO]   Maven Integration Test Plugin :: Class Loader :: Dependency A
[INFO]   Maven Integration Test Plugin :: Class Loader :: Dependency B
[INFO]   Maven Integration Test Plugin :: Class Loader
[INFO]   Maven Integration Test Plugin :: Class Loader :: Aggregator
[INFO]   Maven Integration Test Plugin :: Configuration
[INFO]   Maven Integration Test Plugin :: Context Passing
[INFO]   Maven Integration Test Plugin :: Maven Clean Plugin Stub
[INFO]   Maven Integration Test Plugin :: Maven Compiler Plugin Stub
[INFO]   Maven Integration Test Plugin :: Maven Deploy Plugin Stub
[INFO]   Maven Integration Test Plugin :: Maven EAR Plugin Stub
[INFO]   Maven Integration Test Plugin :: Maven EJB Plugin Stub
[INFO]   Maven Integration Test Plugin :: Maven Install Plugin Stub
[INFO]   Maven Integration Test Plugin :: Maven Javadoc Plugin Stub
[INFO]   Maven Integration Test Plugin :: Maven Plugin Plugin Stub
[INFO]   Maven Integration Test Plugin :: Maven RAR Plugin Stub
[INFO]   Maven Integration Test Plugin :: Maven Resources Plugin Stub
[INFO]   Maven Integration Test Plugin :: Maven Site Plugin Stub
[INFO]   Maven Integration Test Plugin :: Maven Source Plugin Stub
[INFO]   Maven Integration Test Plugin :: Maven WAR Plugin Stub
[INFO]   Maven Integration Test Plugin :: Dependency Resolution
[INFO]   Maven Integration Test Plugin :: Expression
[INFO]   Maven Integration Test Plugin :: File
[INFO]   Maven Integration Test Plugin :: Fork
[INFO]   Maven Integration Test Plugin :: Envar
[INFO]   Maven Integration Test Plugin :: Interpolated POM Configuration
[INFO]   Maven Integration Test Plugin :: Loadable
[INFO]   Maven Core Integration Test Plugin
[INFO]   Maven Integration Test Plugin :: Packaging
[INFO]   Maven Integration Test Plugin :: Parameter Implementation
[INFO]   Maven Integration Test Plugin :: Project Interpolation
[INFO]   Maven Integration Test Plugin :: Setter
[INFO]   Maven Integration Test Plugin :: Site
[INFO]   Maven Integration Test Plugin :: Touch
[INFO]   Maven Integration Test Plugin :: Uses Properties Plugin
[INFO]   Maven Integration Test Plugin :: Uses Wagon Plugin
[INFO]   Maven Integration Test Plugin :: This plugin should contain the mojos needed by all
tests.
[INFO]   Maven Integration Test Wagon
[INFO]   Maven Integration Test Support Artifacts
[INFO]   Unnamed - org.apache.maven.its:core-integration-testing-parent:pom:2.1-SNAPSHOT
[INFO] ------------------------------------------------------------------------
[INFO] Building Maven Integration Testing
[INFO]    task-segment: [clean, deploy]
[INFO] ------------------------------------------------------------------------
[INFO] [clean:clean]
[INFO] Deleting directory http://ci.sonatype.org/job/maven-core-integration-testing/ws/maven-its/core-it-support/target

[INFO] Setting property: classpath.resource.loader.class => 'org.codehaus.plexus.velocity.ContextClassLoaderResourceLoader'.
[INFO] Setting property: velocimacro.messages.on => 'false'.
[INFO] Setting property: resource.loader => 'classpath'.
[INFO] Setting property: resource.manager.logwhenfound => 'false'.
[INFO] [remote-resources:process {execution: default}]
[INFO] [site:attach-descriptor]
[INFO] [install:install]
[INFO] Installing http://ci.sonatype.org/job/maven-core-integration-testing/ws/maven-its/core-it-support/pom.xml
 to /home/j2ee-hudson/repos/core-its/org/apache/maven/its/core-integration-testing/2.1-SNAPSHOT/core-integration-testing-2.1-SNAPSHOT.pom
[INFO] [deploy:deploy]
altDeploymentRepository = null
[INFO] Retrieving previous build number from apache.snapshots
[INFO] ------------------------------------------------------------------------
[ERROR] BUILD ERROR
[INFO] ------------------------------------------------------------------------
[INFO] Error retrieving previous build number for artifact 'org.apache.maven.its:core-integration-testing:pom':
repository metadata for: 'snapshot org.apache.maven.its:core-integration-testing:2.1-SNAPSHOT'
could not be retrieved from repository: apache.snapshots due to an error: Error transferring
file

Server returned HTTP response code: 500 for URL: http://localhost:8081/content/repositories/maven.snapshots/org/apache/maven/its/core-integration-testing/2.1-SNAPSHOT/maven-metadata.xml
[INFO] ------------------------------------------------------------------------
[INFO] Trace
org.apache.maven.lifecycle.LifecycleExecutionException: Error retrieving previous build number
for artifact 'org.apache.maven.its:core-integration-testing:pom': repository metadata for:
'snapshot org.apache.maven.its:core-integration-testing:2.1-SNAPSHOT' could not be retrieved
from repository: apache.snapshots due to an error: Error transferring file
	at org.apache.maven.lifecycle.DefaultLifecycleExecutor.executeGoals(DefaultLifecycleExecutor.java:583)
	at org.apache.maven.lifecycle.DefaultLifecycleExecutor.executeGoalWithLifecycle(DefaultLifecycleExecutor.java:499)
	at org.apache.maven.lifecycle.DefaultLifecycleExecutor.executeGoal(DefaultLifecycleExecutor.java:478)
	at org.apache.maven.lifecycle.DefaultLifecycleExecutor.executeGoalAndHandleFailures(DefaultLifecycleExecutor.java:330)
	at org.apache.maven.lifecycle.DefaultLifecycleExecutor.executeTaskSegments(DefaultLifecycleExecutor.java:291)
	at org.apache.maven.lifecycle.DefaultLifecycleExecutor.execute(DefaultLifecycleExecutor.java:142)
	at org.apache.maven.DefaultMaven.doExecute(DefaultMaven.java:336)
	at org.apache.maven.DefaultMaven.execute(DefaultMaven.java:129)
	at org.apache.maven.cli.MavenCli.main(MavenCli.java:287)
	at sun.reflect.NativeMethodAccessorImpl.invoke0(Native Method)
	at sun.reflect.NativeMethodAccessorImpl.invoke(NativeMethodAccessorImpl.java:39)
	at sun.reflect.DelegatingMethodAccessorImpl.invoke(DelegatingMethodAccessorImpl.java:25)
	at java.lang.reflect.Method.invoke(Method.java:324)
	at org.codehaus.classworlds.Launcher.launchEnhanced(Launcher.java:315)
	at org.codehaus.classworlds.Launcher.launch(Launcher.java:255)
	at org.codehaus.classworlds.Launcher.mainWithExitCode(Launcher.java:430)
	at org.codehaus.classworlds.Launcher.main(Launcher.java:375)
Caused by: org.apache.maven.plugin.MojoExecutionException: Error retrieving previous build
number for artifact 'org.apache.maven.its:core-integration-testing:pom': repository metadata
for: 'snapshot org.apache.maven.its:core-integration-testing:2.1-SNAPSHOT' could not be retrieved
from repository: apache.snapshots due to an error: Error transferring file
	at org.apache.maven.plugin.deploy.DeployMojo.execute(DeployMojo.java:174)
	at org.apache.maven.plugin.DefaultPluginManager.executeMojo(DefaultPluginManager.java:451)
	at org.apache.maven.lifecycle.DefaultLifecycleExecutor.executeGoals(DefaultLifecycleExecutor.java:558)
	... 16 more
Caused by: org.apache.maven.artifact.deployer.ArtifactDeploymentException: Error retrieving
previous build number for artifact 'org.apache.maven.its:core-integration-testing:pom': repository
metadata for: 'snapshot org.apache.maven.its:core-integration-testing:2.1-SNAPSHOT' could
not be retrieved from repository: apache.snapshots due to an error: Error transferring file
	at org.apache.maven.artifact.transform.SnapshotTransformation.transformForDeployment(SnapshotTransformation.java:106)
	at org.apache.maven.artifact.transform.DefaultArtifactTransformationManager.transformForDeployment(DefaultArtifactTransformationManager.java:78)
	at org.apache.maven.artifact.deployer.DefaultArtifactDeployer.deploy(DefaultArtifactDeployer.java:71)
	at org.apache.maven.plugin.deploy.DeployMojo.execute(DeployMojo.java:152)
	... 18 more
Caused by: org.apache.maven.artifact.repository.metadata.RepositoryMetadataResolutionException:
repository metadata for: 'snapshot org.apache.maven.its:core-integration-testing:2.1-SNAPSHOT'
could not be retrieved from repository: apache.snapshots due to an error: Error transferring
file
	at org.apache.maven.artifact.repository.metadata.DefaultRepositoryMetadataManager.resolveAlways(DefaultRepositoryMetadataManager.java:352)
	at org.apache.maven.artifact.transform.SnapshotTransformation.resolveLatestSnapshotBuildNumber(SnapshotTransformation.java:161)
	at org.apache.maven.artifact.transform.SnapshotTransformation.transformForDeployment(SnapshotTransformation.java:100)
	... 21 more
Caused by: org.apache.maven.wagon.TransferFailedException: Error transferring file
	at org.apache.maven.wagon.providers.http.LightweightHttpWagon.fillInputData(LightweightHttpWagon.java:104)
	at org.apache.maven.wagon.StreamWagon.get(StreamWagon.java:68)
	at org.apache.maven.artifact.manager.DefaultWagonManager.getRemoteFile(DefaultWagonManager.java:470)
	at org.apache.maven.artifact.manager.DefaultWagonManager.getArtifactMetadataFromDeploymentRepository(DefaultWagonManager.java:379)
	at org.apache.maven.artifact.repository.metadata.DefaultRepositoryMetadataManager.getArtifactMetadataFromDeploymentRepository(DefaultRepositoryMetadataManager.java:380)
	at org.apache.maven.artifact.repository.metadata.DefaultRepositoryMetadataManager.resolveAlways(DefaultRepositoryMetadataManager.java:348)
	... 23 more
Caused by: java.io.IOException: Server returned HTTP response code: 500 for URL: http://localhost:8081/content/repositories/maven.snapshots/org/apache/maven/its/core-integration-testing/2.1-SNAPSHOT/maven-metadata.xml
	at sun.net.www.protocol.http.HttpURLConnection.getInputStream(HttpURLConnection.java:794)
	at org.apache.maven.wagon.providers.http.LightweightHttpWagon.fillInputData(LightweightHttpWagon.java:83)
	... 28 more
[INFO] ------------------------------------------------------------------------
[INFO] Total time: 1 minute 50 seconds
[INFO] Finished at: Tue Oct 14 16:04:10 CDT 2008
[INFO] Final Memory: 18M/32M
[INFO] ------------------------------------------------------------------------


Mime
View raw message