maven-notifications mailing list archives

Site index · List index
Message view « Date » · « Thread »
Top « Date » · « Thread »
From Hudson <Hud...@sonatype.org>
Subject Build failed in Hudson: mercury #90
Date Wed, 01 Oct 2008 17:48:12 GMT
See http://ci.sonatype.org/job/mercury/90/changes

Changes:

[ogusakov] adjusted poms

[ogusakov] removed dav:http and dav:https handlers. They are processed by wagon APIs and handler
is dav

------------------------------------------
[...truncated 5905 lines...]
	at org.mortbay.jetty.HttpConnection.handleRequest(HttpConnection.java:502)
	at org.mortbay.jetty.HttpConnection$RequestHandler.content(HttpConnection.java:840)
	at org.mortbay.jetty.HttpParser.parseNext(HttpParser.java:744)
	at org.mortbay.jetty.HttpParser.parseAvailable(HttpParser.java:211)
	at org.mortbay.jetty.HttpConnection.handle(HttpConnection.java:377)
	at org.mortbay.jetty.bio.SocketConnector$Connection.run(SocketConnector.java:228)
	at org.mortbay.thread.QueuedThreadPool$PoolThread.run(QueuedThreadPool.java:497)
Caused by: java.io.IOException: Server returned HTTP response code: 401 for URL: http://localhost:37168/maven2/repo/file5.jpg
	at sun.net.www.protocol.http.HttpURLConnection.getInputStream(HttpURLConnection.java:1170)
	at java.net.HttpURLConnection.getResponseCode(HttpURLConnection.java:367)
	at org.mortbay.servlet.ProxyServlet.service(ProxyServlet.java:204)
	... 14 more
Oct 1, 2008 12:48:08 PM sun.reflect.GeneratedMethodAccessor3 invoke
INFO: res Server: Jetty(6.1.12.rc2)
Oct 1, 2008 12:48:08 PM sun.reflect.GeneratedMethodAccessor3 invoke
INFO: res null: HTTP/1.1 401 Unauthorized
Oct 1, 2008 12:48:08 PM sun.reflect.GeneratedMethodAccessor3 invoke
INFO: res WWW-Authenticate: basic realm="foorealm"
Oct 1, 2008 12:48:08 PM sun.reflect.GeneratedMethodAccessor3 invoke
INFO: res Content-Length: 0
Oct 1, 2008 12:48:08 PM sun.reflect.GeneratedMethodAccessor3 invoke
INFO: res Server: Jetty(6.1.12.rc2)
Oct 1, 2008 12:48:08 PM sun.reflect.GeneratedMethodAccessor3 invoke
INFO: URL=http://localhost:37168/maven2/repo/file0.txt
Oct 1, 2008 12:48:08 PM sun.reflect.GeneratedMethodAccessor3 invoke
INFO: req Content-Type: application/octet-stream
Oct 1, 2008 12:48:08 PM sun.reflect.GeneratedMethodAccessor3 invoke
INFO: req Jetty-Batch-Id: 799245560327773626
Oct 1, 2008 12:48:08 PM sun.reflect.GeneratedMethodAccessor3 invoke
INFO: req Host: localhost:37168
Oct 1, 2008 12:48:08 PM sun.reflect.GeneratedMethodAccessor3 invoke
INFO: req Authorization: basic Zm9vOmJhcg==
Oct 1, 2008 12:48:08 PM sun.reflect.GeneratedMethodAccessor3 invoke
INFO: URL=http://localhost:37168/maven2/repo/file5.jpg
Oct 1, 2008 12:48:08 PM sun.reflect.GeneratedMethodAccessor3 invoke
INFO: req Content-Type: application/octet-stream
Oct 1, 2008 12:48:08 PM sun.reflect.GeneratedMethodAccessor3 invoke
INFO: req Jetty-Batch-Id: 799245560327773626
Oct 1, 2008 12:48:08 PM sun.reflect.GeneratedMethodAccessor3 invoke
INFO: req Host: localhost:37168
Oct 1, 2008 12:48:08 PM sun.reflect.GeneratedMethodAccessor3 invoke
INFO: req Authorization: basic Zm9vOmJhcg==
Oct 1, 2008 12:48:08 PM sun.reflect.GeneratedMethodAccessor3 invoke
INFO: response = 201
Oct 1, 2008 12:48:08 PM sun.reflect.GeneratedMethodAccessor3 invoke
INFO: res null: HTTP/1.1 201 Created
Oct 1, 2008 12:48:08 PM sun.reflect.GeneratedMethodAccessor3 invoke
INFO: res Transfer-Encoding: chunked
Oct 1, 2008 12:48:08 PM sun.reflect.GeneratedMethodAccessor3 invoke
INFO: res Server: Jetty(6.1.12.rc2)
Oct 1, 2008 12:48:08 PM org.apache.maven.mercury.spi.http.client.SecureSender send
INFO: Set proxy localhost:40645 on destination
Set proxy localhost:40645 on destination
Oct 1, 2008 12:48:08 PM sun.reflect.GeneratedMethodAccessor3 invoke
INFO: URL=http://localhost:37168/maven2/repo/file5.jpg.sha1
Oct 1, 2008 12:48:08 PM sun.reflect.GeneratedMethodAccessor3 invoke
INFO: req Content-Type: application/octet-stream
Oct 1, 2008 12:48:08 PM sun.reflect.GeneratedMethodAccessor3 invoke
INFO: req Jetty-Batch-Id: 799245560327773626
Oct 1, 2008 12:48:08 PM sun.reflect.GeneratedMethodAccessor3 invoke
INFO: req Host: localhost:37168
Oct 1, 2008 12:48:08 PM sun.reflect.GeneratedMethodAccessor3 invoke
INFO: req Content-Length: 40
Oct 1, 2008 12:48:08 PM sun.reflect.GeneratedMethodAccessor3 invoke
INFO: req Authorization: basic Zm9vOmJhcg==
Oct 1, 2008 12:48:08 PM sun.reflect.GeneratedMethodAccessor3 invoke
INFO: response = 201
Oct 1, 2008 12:48:08 PM sun.reflect.GeneratedMethodAccessor3 invoke
INFO: res null: HTTP/1.1 201 Created
Oct 1, 2008 12:48:08 PM sun.reflect.GeneratedMethodAccessor3 invoke
INFO: res Transfer-Encoding: chunked
Oct 1, 2008 12:48:08 PM sun.reflect.GeneratedMethodAccessor3 invoke
INFO: res Server: Jetty(6.1.12.rc2)
Oct 1, 2008 12:48:08 PM sun.reflect.GeneratedMethodAccessor3 invoke
INFO: response = 201
Oct 1, 2008 12:48:08 PM sun.reflect.GeneratedMethodAccessor3 invoke
INFO: res null: HTTP/1.1 201 Created
Oct 1, 2008 12:48:08 PM sun.reflect.GeneratedMethodAccessor3 invoke
INFO: res Transfer-Encoding: chunked
Oct 1, 2008 12:48:08 PM sun.reflect.GeneratedMethodAccessor3 invoke
INFO: res Server: Jetty(6.1.12.rc2)
Oct 1, 2008 12:48:08 PM org.apache.maven.mercury.spi.http.client.SecureSender send
INFO: Set proxy localhost:40645 on destination
Set proxy localhost:40645 on destination
Oct 1, 2008 12:48:08 PM sun.reflect.GeneratedMethodAccessor3 invoke
INFO: URL=http://localhost:37168/maven2/repo/file0.txt.sha1
Oct 1, 2008 12:48:08 PM sun.reflect.GeneratedMethodAccessor3 invoke
INFO: req Content-Type: application/octet-stream
Oct 1, 2008 12:48:08 PM sun.reflect.GeneratedMethodAccessor3 invoke
INFO: req Jetty-Batch-Id: 799245560327773626
Oct 1, 2008 12:48:08 PM sun.reflect.GeneratedMethodAccessor3 invoke
INFO: req Host: localhost:37168
Oct 1, 2008 12:48:08 PM sun.reflect.GeneratedMethodAccessor3 invoke
INFO: req Content-Length: 40
Oct 1, 2008 12:48:08 PM sun.reflect.GeneratedMethodAccessor3 invoke
INFO: req Authorization: basic Zm9vOmJhcg==
Oct 1, 2008 12:48:08 PM sun.reflect.GeneratedMethodAccessor3 invoke
INFO: response = 201
Oct 1, 2008 12:48:08 PM sun.reflect.GeneratedMethodAccessor3 invoke
INFO: res null: HTTP/1.1 201 Created
Oct 1, 2008 12:48:08 PM sun.reflect.GeneratedMethodAccessor3 invoke
INFO: res Transfer-Encoding: chunked
Oct 1, 2008 12:48:08 PM sun.reflect.GeneratedMethodAccessor3 invoke
INFO: res Server: Jetty(6.1.12.rc2)
Destroyed /tmp/deployerTestFiles19225.tmp
Tests run: 4, Failures: 0, Errors: 0, Skipped: 0, Time elapsed: 1.355 sec
Running org.apache.maven.mercury.spi.http.client.JettyDeployerTest
Oct 1, 2008 12:48:08 PM sun.reflect.GeneratedMethodAccessor3 invoke
INFO: jetty-6.1.12.rc2
Oct 1, 2008 12:48:08 PM sun.reflect.GeneratedMethodAccessor3 invoke
INFO: Started SocketConnector@0.0.0.0:38360
Basedir = /tmp/deployerTestFiles19229.tmp
Destroyed /tmp/deployerTestFiles19229.tmp
Oct 1, 2008 12:48:08 PM sun.reflect.GeneratedMethodAccessor3 invoke
INFO: jetty-6.1.12.rc2
Oct 1, 2008 12:48:08 PM sun.reflect.GeneratedMethodAccessor3 invoke
INFO: Started SocketConnector@0.0.0.0:41517
Destroyed /tmp/deployerTestFiles19231.tmp
Oct 1, 2008 12:48:09 PM sun.reflect.GeneratedMethodAccessor3 invoke
INFO: jetty-6.1.12.rc2
Oct 1, 2008 12:48:09 PM sun.reflect.GeneratedMethodAccessor3 invoke
INFO: Started SocketConnector@0.0.0.0:55592
Destroyed /tmp/deployerTestFiles19237.tmp
Oct 1, 2008 12:48:09 PM sun.reflect.GeneratedMethodAccessor3 invoke
INFO: jetty-6.1.12.rc2
Oct 1, 2008 12:48:09 PM sun.reflect.GeneratedMethodAccessor3 invoke
INFO: Started SocketConnector@0.0.0.0:38799
Destroyed /tmp/deployerTestFiles19240.tmp
Tests run: 4, Failures: 0, Errors: 1, Skipped: 0, Time elapsed: 0.989 sec <<< FAILURE!
testUploadOKWithChecksums(org.apache.maven.mercury.spi.http.client.JettyDeployerTest)  Time
elapsed: 0.122 sec  <<< ERROR!
java.lang.NumberFormatException: -1
	at org.mortbay.util.TypeUtil.parseInt(TypeUtil.java:380)
	at org.mortbay.jetty.HttpURI.getPort(HttpURI.java:438)
	at org.mortbay.jetty.client.HttpExchange.setURL(HttpExchange.java:210)
	at org.apache.maven.mercury.spi.http.client.FileExchange.<init>(FileExchange.java:72)
	at org.apache.maven.mercury.spi.http.client.deploy.FilePutExchange.<init>(FilePutExchange.java:68)
	at org.apache.maven.mercury.spi.http.client.deploy.DeploymentTarget$1.<init>(DeploymentTarget.java:222)
	at org.apache.maven.mercury.spi.http.client.deploy.DeploymentTarget.deployLocalFile(DeploymentTarget.java:212)
	at org.apache.maven.mercury.spi.http.client.deploy.DeploymentTarget.updateState(DeploymentTarget.java:196)
	at org.apache.maven.mercury.spi.http.client.deploy.DeploymentTarget.deploy(DeploymentTarget.java:172)
	at org.apache.maven.mercury.spi.http.client.deploy.DefaultDeployer.deploy(DefaultDeployer.java:229)
	at org.apache.maven.mercury.spi.http.client.deploy.DefaultDeployer.deploy(DefaultDeployer.java:132)
	at org.apache.maven.mercury.spi.http.client.JettyDeployerTest.testUploadOKWithChecksums(JettyDeployerTest.java:210)

Running org.apache.maven.mercury.spi.http.client.AuthenticatingJettyRetrieverTest
Oct 1, 2008 12:48:09 PM sun.reflect.GeneratedMethodAccessor3 invoke
INFO: jetty-6.1.12.rc2
Oct 1, 2008 12:48:09 PM sun.reflect.GeneratedMethodAccessor3 invoke
INFO: Started SocketConnector@0.0.0.0:42599
Oct 1, 2008 12:48:09 PM sun.reflect.GeneratedMethodAccessor3 invoke
INFO: jetty-6.1.12.rc2
Oct 1, 2008 12:48:09 PM sun.reflect.GeneratedMethodAccessor3 invoke
INFO: Started SocketConnector@0.0.0.0:44731
Oct 1, 2008 12:48:09 PM sun.reflect.GeneratedMethodAccessor3 invoke
INFO: jetty-6.1.12.rc2
Oct 1, 2008 12:48:09 PM sun.reflect.GeneratedMethodAccessor3 invoke
INFO: Started SocketConnector@0.0.0.0:54614
Oct 1, 2008 12:48:10 PM sun.reflect.GeneratedMethodAccessor3 invoke
INFO: jetty-6.1.12.rc2
Oct 1, 2008 12:48:10 PM sun.reflect.GeneratedMethodAccessor3 invoke
INFO: Started SocketConnector@0.0.0.0:49619
Oct 1, 2008 12:48:10 PM sun.reflect.GeneratedMethodAccessor3 invoke
INFO: jetty-6.1.12.rc2
Oct 1, 2008 12:48:10 PM sun.reflect.GeneratedMethodAccessor3 invoke
INFO: Started SocketConnector@0.0.0.0:60415
Oct 1, 2008 12:48:10 PM sun.reflect.GeneratedMethodAccessor3 invoke
INFO: jetty-6.1.12.rc2
Oct 1, 2008 12:48:10 PM sun.reflect.GeneratedMethodAccessor3 invoke
INFO: Started SocketConnector@0.0.0.0:41691
Oct 1, 2008 12:48:10 PM sun.reflect.GeneratedMethodAccessor3 invoke
INFO: jetty-6.1.12.rc2
Oct 1, 2008 12:48:10 PM sun.reflect.GeneratedMethodAccessor3 invoke
INFO: Started SocketConnector@0.0.0.0:36785
Oct 1, 2008 12:48:10 PM sun.reflect.GeneratedMethodAccessor3 invoke
INFO: jetty-6.1.12.rc2
Oct 1, 2008 12:48:10 PM sun.reflect.GeneratedMethodAccessor3 invoke
INFO: Started SocketConnector@0.0.0.0:34044
Tests run: 8, Failures: 0, Errors: 0, Skipped: 0, Time elapsed: 0.915 sec
Running org.apache.maven.mercury.spi.http.client.SecureJettyDeployerTest
Oct 1, 2008 12:48:10 PM sun.reflect.GeneratedMethodAccessor3 invoke
INFO: jetty-6.1.12.rc2
Oct 1, 2008 12:48:10 PM sun.reflect.GeneratedMethodAccessor3 invoke
INFO: Started SslSocketConnector@0.0.0.0:51914
Basedir = /tmp/deployerTestFiles19260.tmp
Destroyed /tmp/deployerTestFiles19260.tmp
Oct 1, 2008 12:48:11 PM sun.reflect.GeneratedMethodAccessor3 invoke
INFO: jetty-6.1.12.rc2
Oct 1, 2008 12:48:11 PM sun.reflect.GeneratedMethodAccessor3 invoke
INFO: Started SslSocketConnector@0.0.0.0:53492
Destroyed /tmp/deployerTestFiles19273.tmp
Oct 1, 2008 12:48:11 PM sun.reflect.GeneratedMethodAccessor3 invoke
INFO: jetty-6.1.12.rc2
Oct 1, 2008 12:48:11 PM sun.reflect.GeneratedMethodAccessor3 invoke
INFO: Started SslSocketConnector@0.0.0.0:41970
Destroyed /tmp/deployerTestFiles19280.tmp
Oct 1, 2008 12:48:11 PM sun.reflect.GeneratedMethodAccessor3 invoke
INFO: jetty-6.1.12.rc2
Oct 1, 2008 12:48:11 PM sun.reflect.GeneratedMethodAccessor3 invoke
INFO: Started SslSocketConnector@0.0.0.0:48100
Destroyed /tmp/deployerTestFiles19283.tmp
Tests run: 4, Failures: 0, Errors: 0, Skipped: 0, Time elapsed: 1.47 sec

Results :

Tests in error: 
  testUploadOKWithChecksums(org.apache.maven.mercury.spi.http.client.JettyDeployerTest)

Tests run: 43, Failures: 0, Errors: 1, Skipped: 0

[INFO] ------------------------------------------------------------------------
[ERROR] BUILD FAILURE
[INFO] ------------------------------------------------------------------------
[INFO] There are test failures.

Please refer to http://ci.sonatype.org/job/mercury/ws/mercury/mercury-transport/mercury-transport-http/target/surefire-reports
 for the individual test results.
[INFO] ------------------------------------------------------------------------
[INFO] Trace
org.apache.maven.BuildFailureException: There are test failures.

Please refer to http://ci.sonatype.org/job/mercury/ws/mercury/mercury-transport/mercury-transport-http/target/surefire-reports
 for the individual test results.
	at org.apache.maven.lifecycle.DefaultLifecycleExecutor.executeGoals(DefaultLifecycleExecutor.java:579)
	at org.apache.maven.lifecycle.DefaultLifecycleExecutor.executeGoalWithLifecycle(DefaultLifecycleExecutor.java:499)
	at org.apache.maven.lifecycle.DefaultLifecycleExecutor.executeGoal(DefaultLifecycleExecutor.java:478)
	at org.apache.maven.lifecycle.DefaultLifecycleExecutor.executeGoalAndHandleFailures(DefaultLifecycleExecutor.java:330)
	at org.apache.maven.lifecycle.DefaultLifecycleExecutor.executeTaskSegments(DefaultLifecycleExecutor.java:291)
	at org.apache.maven.lifecycle.DefaultLifecycleExecutor.execute(DefaultLifecycleExecutor.java:142)
	at org.apache.maven.DefaultMaven.doExecute(DefaultMaven.java:336)
	at org.apache.maven.DefaultMaven.execute(DefaultMaven.java:129)
	at org.apache.maven.cli.MavenCli.main(MavenCli.java:287)
	at sun.reflect.NativeMethodAccessorImpl.invoke0(Native Method)
	at sun.reflect.NativeMethodAccessorImpl.invoke(NativeMethodAccessorImpl.java:39)
	at sun.reflect.DelegatingMethodAccessorImpl.invoke(DelegatingMethodAccessorImpl.java:25)
	at java.lang.reflect.Method.invoke(Method.java:585)
	at org.codehaus.classworlds.Launcher.launchEnhanced(Launcher.java:315)
	at org.codehaus.classworlds.Launcher.launch(Launcher.java:255)
	at org.codehaus.classworlds.Launcher.mainWithExitCode(Launcher.java:430)
	at org.codehaus.classworlds.Launcher.main(Launcher.java:375)
Caused by: org.apache.maven.plugin.MojoFailureException: There are test failures.

Please refer to http://ci.sonatype.org/job/mercury/ws/mercury/mercury-transport/mercury-transport-http/target/surefire-reports
 for the individual test results.
	at org.apache.maven.plugin.surefire.SurefirePlugin.execute(SurefirePlugin.java:530)
	at org.apache.maven.plugin.DefaultPluginManager.executeMojo(DefaultPluginManager.java:451)
	at org.apache.maven.lifecycle.DefaultLifecycleExecutor.executeGoals(DefaultLifecycleExecutor.java:558)
	... 16 more
[INFO] ------------------------------------------------------------------------
[INFO] Total time: 1 minute 3 seconds
[INFO] Finished at: Wed Oct 01 12:48:12 CDT 2008
[INFO] Final Memory: 44M/123M
[INFO] ------------------------------------------------------------------------


Mime
View raw message