maven-notifications mailing list archives

Site index · List index
Message view « Date » · « Thread »
Top « Date » · « Thread »
From Hudson <Hud...@sonatype.org>
Subject Build failed in Hudson: plugins-IT-with-maven-2.0.x » Maven Changelog Plugin #3
Date Fri, 10 Oct 2008 22:28:12 GMT
See http://ci.sonatype.org/job/plugins-IT-with-maven-2.0.x/org.apache.maven.plugins$maven-changelog-plugin/3/changes

------------------------------------------
[INFO] ------------------------------------------------------------------------
[INFO] Building Maven Changelog Plugin
[INFO]    task-segment: [clean, deploy]
[INFO] ------------------------------------------------------------------------
[INFO] [clean:clean]
[INFO] Deleting directory http://ci.sonatype.org/job/plugins-IT-with-maven-2.0.x/org.apache.maven.plugins$maven-changelog-plugin/ws/target

Downloading: http://repository.sonatype.org:8081/content/groups/public/doxia/doxia-sink-api/1.0-alpha-5/doxia-sink-api-1.0-alpha-5.pom
1K downloaded
Downloading: http://repository.sonatype.org:8081/content/groups/public/org/apache/maven/scm/maven-scm-api/1.0/maven-scm-api-1.0.pom
603b downloaded
Downloading: http://repository.sonatype.org:8081/content/groups/public/org/apache/maven/scm/maven-scm/1.0/maven-scm-1.0.pom
5K downloaded
Downloading: http://repository.sonatype.org:8081/content/groups/public/org/apache/maven/scm/maven-scm-manager-plexus/1.0/maven-scm-manager-plexus-1.0.pom
999b downloaded
Downloading: http://repository.sonatype.org:8081/content/groups/public/org/apache/maven/scm/maven-scm-managers/1.0/maven-scm-managers-1.0.pom
1K downloaded
Downloading: http://repository.sonatype.org:8081/content/groups/public/org/apache/maven/scm/maven-scm-provider-bazaar/1.0/maven-scm-provider-bazaar-1.0.pom
1K downloaded
Downloading: http://repository.sonatype.org:8081/content/groups/public/org/apache/maven/scm/maven-scm-providers/1.0/maven-scm-providers-1.0.pom
3K downloaded
Downloading: http://repository.sonatype.org:8081/content/groups/public/regexp/regexp/1.3/regexp-1.3.pom
145b downloaded
Downloading: http://repository.sonatype.org:8081/content/groups/public/org/apache/maven/scm/maven-scm-provider-clearcase/1.0/maven-scm-provider-clearcase-1.0.pom
1K downloaded
Downloading: http://repository.sonatype.org:8081/content/groups/public/org/apache/maven/scm/maven-scm-provider-hg/1.0/maven-scm-provider-hg-1.0.pom
1K downloaded
Downloading: http://repository.sonatype.org:8081/content/groups/public/org/apache/maven/scm/maven-scm-provider-cvsexe/1.0/maven-scm-provider-cvsexe-1.0.pom
1K downloaded
Downloading: http://repository.sonatype.org:8081/content/groups/public/org/apache/maven/scm/maven-scm-providers-cvs/1.0/maven-scm-providers-cvs-1.0.pom
1K downloaded
Downloading: http://repository.sonatype.org:8081/content/groups/public/org/apache/maven/scm/maven-scm-provider-cvs-commons/1.0/maven-scm-provider-cvs-commons-1.0.pom
1K downloaded
Downloading: http://repository.sonatype.org:8081/content/groups/public/org/apache/maven/scm/maven-scm-provider-cvsjava/1.0/maven-scm-provider-cvsjava-1.0.pom
1K downloaded
Downloading: http://repository.sonatype.org:8081/content/groups/public/org/netbeans/lib/cvsclient/20060125/cvsclient-20060125.pom
459b downloaded
Downloading: http://repository.sonatype.org:8081/content/groups/public/ch/ethz/ganymed/ganymed-ssh2/build210/ganymed-ssh2-build210.pom
710b downloaded
Downloading: http://repository.sonatype.org:8081/content/groups/public/org/apache/maven/scm/maven-scm-provider-local/1.0/maven-scm-provider-local-1.0.pom
1K downloaded
Downloading: http://repository.sonatype.org:8081/content/groups/public/org/apache/maven/scm/maven-scm-provider-perforce/1.0/maven-scm-provider-perforce-1.0.pom
1K downloaded
Downloading: http://repository.sonatype.org:8081/content/groups/public/org/apache/maven/scm/maven-scm-provider-starteam/1.0/maven-scm-provider-starteam-1.0.pom
1K downloaded
Downloading: http://repository.sonatype.org:8081/content/groups/public/org/apache/maven/scm/maven-scm-provider-svnexe/1.0/maven-scm-provider-svnexe-1.0.pom
1K downloaded
Downloading: http://repository.sonatype.org:8081/content/groups/public/org/apache/maven/scm/maven-scm-providers-svn/1.0/maven-scm-providers-svn-1.0.pom
1K downloaded
Downloading: http://repository.sonatype.org:8081/content/groups/public/org/apache/maven/scm/maven-scm-provider-svn-commons/1.0/maven-scm-provider-svn-commons-1.0.pom
1K downloaded
Downloading: http://repository.sonatype.org:8081/content/groups/public/org/apache/maven/scm/maven-scm-provider-synergy/1.0/maven-scm-provider-synergy-1.0.pom
817b downloaded
Downloading: http://repository.sonatype.org:8081/content/groups/public/org/apache/maven/scm/maven-scm-provider-vss/1.0/maven-scm-provider-vss-1.0.pom
1K downloaded
Downloading: http://repository.sonatype.org:8081/content/groups/public/org/apache/maven/shared/maven-plugin-testing-harness/1.0/maven-plugin-testing-harness-1.0.pom
5K downloaded
Downloading: http://repository.sonatype.org:8081/content/groups/public/org/apache/maven/maven-project/2.0/maven-project-2.0.jar
102K downloaded
Downloading: http://repository.sonatype.org:8081/content/groups/public/org/apache/maven/maven-profile/2.0/maven-profile-2.0.jar
29K downloaded
Downloading: http://repository.sonatype.org:8081/content/groups/public/org/apache/maven/maven-model/2.0/maven-model-2.0.jar
76K downloaded
Downloading: http://repository.sonatype.org:8081/content/groups/public/org/codehaus/plexus/plexus-container-default/1.0-alpha-8/plexus-container-default-1.0-alpha-8.jar
190K downloaded
Downloading: http://repository.sonatype.org:8081/content/groups/public/org/apache/maven/maven-artifact-manager/2.0/maven-artifact-manager-2.0.jar
49K downloaded
Downloading: http://repository.sonatype.org:8081/content/groups/public/org/apache/maven/maven-repository-metadata/2.0/maven-repository-metadata-2.0.jar
20K downloaded
Downloading: http://repository.sonatype.org:8081/content/groups/public/org/apache/maven/maven-artifact/2.0/maven-artifact-2.0.jar
76K downloaded
Downloading: http://repository.sonatype.org:8081/content/groups/public/org/apache/maven/wagon/wagon-provider-api/1.0-alpha-5/wagon-provider-api-1.0-alpha-5.jar
50K downloaded
Downloading: http://repository.sonatype.org:8081/content/groups/public/doxia/doxia-sink-api/1.0-alpha-5/doxia-sink-api-1.0-alpha-5.jar
4K downloaded
Downloading: http://repository.sonatype.org:8081/content/groups/public/org/apache/maven/maven-plugin-api/2.0/maven-plugin-api-2.0.jar
9K downloaded
Downloading: http://repository.sonatype.org:8081/content/groups/public/org/apache/maven/maven-settings/2.0/maven-settings-2.0.jar
42K downloaded
Downloading: http://repository.sonatype.org:8081/content/groups/public/org/apache/maven/scm/maven-scm-api/1.0/maven-scm-api-1.0.jar
80K downloaded
Downloading: http://repository.sonatype.org:8081/content/groups/public/org/apache/maven/scm/maven-scm-manager-plexus/1.0/maven-scm-manager-plexus-1.0.jar
9K downloaded
Downloading: http://repository.sonatype.org:8081/content/groups/public/org/apache/maven/scm/maven-scm-provider-bazaar/1.0/maven-scm-provider-bazaar-1.0.jar
45K downloaded
Downloading: http://repository.sonatype.org:8081/content/groups/public/regexp/regexp/1.3/regexp-1.3.jar
24K downloaded
Downloading: http://repository.sonatype.org:8081/content/groups/public/org/apache/maven/scm/maven-scm-provider-clearcase/1.0/maven-scm-provider-clearcase-1.0.jar
57K downloaded
Downloading: http://repository.sonatype.org:8081/content/groups/public/org/apache/maven/scm/maven-scm-provider-hg/1.0/maven-scm-provider-hg-1.0.jar
49K downloaded
Downloading: http://repository.sonatype.org:8081/content/groups/public/org/apache/maven/scm/maven-scm-provider-cvsexe/1.0/maven-scm-provider-cvsexe-1.0.jar
24K downloaded
Downloading: http://repository.sonatype.org:8081/content/groups/public/org/apache/maven/scm/maven-scm-provider-cvs-commons/1.0/maven-scm-provider-cvs-commons-1.0.jar
66K downloaded
Downloading: http://repository.sonatype.org:8081/content/groups/public/org/apache/maven/scm/maven-scm-provider-cvsjava/1.0/maven-scm-provider-cvsjava-1.0.jar
38K downloaded
Downloading: http://repository.sonatype.org:8081/content/groups/public/org/netbeans/lib/cvsclient/20060125/cvsclient-20060125.jar
604K downloaded
Downloading: http://repository.sonatype.org:8081/content/groups/public/ch/ethz/ganymed/ganymed-ssh2/build210/ganymed-ssh2-build210.jar
239K downloaded
Downloading: http://repository.sonatype.org:8081/content/groups/public/org/apache/maven/scm/maven-scm-provider-local/1.0/maven-scm-provider-local-1.0.jar
39K downloaded
Downloading: http://repository.sonatype.org:8081/content/groups/public/org/apache/maven/scm/maven-scm-provider-perforce/1.0/maven-scm-provider-perforce-1.0.jar
61K downloaded
Downloading: http://repository.sonatype.org:8081/content/groups/public/org/apache/maven/scm/maven-scm-provider-starteam/1.0/maven-scm-provider-starteam-1.0.jar
67K downloaded
Downloading: http://repository.sonatype.org:8081/content/groups/public/org/apache/maven/scm/maven-scm-provider-svnexe/1.0/maven-scm-provider-svnexe-1.0.jar
56K downloaded
Downloading: http://repository.sonatype.org:8081/content/groups/public/org/apache/maven/scm/maven-scm-provider-svn-commons/1.0/maven-scm-provider-svn-commons-1.0.jar
35K downloaded
Downloading: http://repository.sonatype.org:8081/content/groups/public/org/apache/maven/scm/maven-scm-provider-synergy/1.0/maven-scm-provider-synergy-1.0.jar
48K downloaded
Downloading: http://repository.sonatype.org:8081/content/groups/public/org/apache/maven/scm/maven-scm-provider-vss/1.0/maven-scm-provider-vss-1.0.jar
53K downloaded
Downloading: http://repository.sonatype.org:8081/content/groups/public/org/apache/maven/shared/maven-plugin-testing-harness/1.0/maven-plugin-testing-harness-1.0.jar
21K downloaded
[INFO] [enforcer:enforce {execution: ensure-no-container-api}]
[INFO] [plugin:helpmojo {execution: generated-helpmojo}]
[INFO] Using 2 extractors.
[INFO] Applying extractor for language: java
[INFO] Extractor for language: java found 3 mojo descriptors.
[INFO] Applying extractor for language: bsh
[INFO] Extractor for language: bsh found 0 mojo descriptors.
[INFO] [plugin:descriptor]
[INFO] Using 2 extractors.
[INFO] Applying extractor for language: java
[INFO] Extractor for language: java found 4 mojo descriptors.
[INFO] Applying extractor for language: bsh
[INFO] Extractor for language: bsh found 0 mojo descriptors.
[INFO] [remote-resources:process {execution: default}]
[INFO] [resources:resources]
[INFO] Using encoding: 'UTF-8' to copy filtered resources.
[INFO] [compiler:compile]
[INFO] Compiling 7 source files to http://ci.sonatype.org/job/plugins-IT-with-maven-2.0.x/org.apache.maven.plugins$maven-changelog-plugin/ws/target/classes

[INFO] [resources:testResources]
[INFO] Using encoding: 'UTF-8' to copy filtered resources.
[INFO] [compiler:testCompile]
[INFO] Compiling 15 source files to http://ci.sonatype.org/job/plugins-IT-with-maven-2.0.x/org.apache.maven.plugins$maven-changelog-plugin/ws/target/test-classes

[INFO] [surefire:test]
[INFO] Surefire report directory: http://ci.sonatype.org/job/plugins-IT-with-maven-2.0.x/org.apache.maven.plugins$maven-changelog-plugin/ws/target/surefire-reports


-------------------------------------------------------
 T E S T S
-------------------------------------------------------
Running org.apache.maven.plugin.changelog.FileActivityComparatorTest
Tests run: 3, Failures: 0, Errors: 0, Skipped: 0, Time elapsed: 0.031 sec
Running org.apache.maven.plugin.changelog.FileActivityReportTest
[INFO] Using existing changelog.xml...
Tests run: 2, Failures: 0, Errors: 0, Skipped: 0, Time elapsed: 1.134 sec
Running org.apache.maven.plugin.changelog.ChangeLogReportTest
[INFO] Generating changed sets xml to: http://ci.sonatype.org/job/plugins-IT-with-maven-2.0.x/org.apache.maven.plugins$maven-changelog-plugin/ws/target/test-harness/4/changelog.xml

[INFO] Generating changed sets xml to: http://ci.sonatype.org/job/plugins-IT-with-maven-2.0.x/org.apache.maven.plugins$maven-changelog-plugin/ws/target/test-harness/5/changelog.xml

[ERROR] Provider message:
[ERROR] Provider Stub Error Message
[ERROR] Command output:
[ERROR] Provider Stub Commandline
[INFO] Using existing changelog.xml...
[INFO] Generating changed sets xml to: http://ci.sonatype.org/job/plugins-IT-with-maven-2.0.x/org.apache.maven.plugins$maven-changelog-plugin/ws/target/test-harness/8/changelog.xml

[INFO] Generating changed sets xml to: http://ci.sonatype.org/job/plugins-IT-with-maven-2.0.x/org.apache.maven.plugins$maven-changelog-plugin/ws/target/test-harness/9/changelog.xml

[INFO] Generating changed sets xml to: http://ci.sonatype.org/job/plugins-IT-with-maven-2.0.x/org.apache.maven.plugins$maven-changelog-plugin/ws/target/test-harness/10/changelog.xml

[INFO] Generating changed sets xml to: http://ci.sonatype.org/job/plugins-IT-with-maven-2.0.x/org.apache.maven.plugins$maven-changelog-plugin/ws/target/test-harness/11/changelog.xml

[INFO] Generating changed sets xml to: http://ci.sonatype.org/job/plugins-IT-with-maven-2.0.x/org.apache.maven.plugins$maven-changelog-plugin/ws/target/test-harness/12/changelog.xml

[INFO] Generating changed sets xml to: http://ci.sonatype.org/job/plugins-IT-with-maven-2.0.x/org.apache.maven.plugins$maven-changelog-plugin/ws/target/test-harness/13/changelog.xml

[INFO] Generating changed sets xml to: http://ci.sonatype.org/job/plugins-IT-with-maven-2.0.x/org.apache.maven.plugins$maven-changelog-plugin/ws/target/test-harness/14/changelog.xml

[INFO] Generating changed sets xml to: http://ci.sonatype.org/job/plugins-IT-with-maven-2.0.x/org.apache.maven.plugins$maven-changelog-plugin/ws/target/test-harness/15/changelog.xml

Tests run: 13, Failures: 0, Errors: 0, Skipped: 0, Time elapsed: 1.472 sec
Running org.apache.maven.plugin.changelog.ChangeLogTest
Tests run: 1, Failures: 0, Errors: 0, Skipped: 0, Time elapsed: 0.008 sec
Running org.apache.maven.plugin.changelog.DeveloperActivityReportTest
[INFO] Using existing changelog.xml...
Tests run: 2, Failures: 0, Errors: 0, Skipped: 0, Time elapsed: 0.261 sec

Results :

Tests run: 21, Failures: 0, Errors: 0, Skipped: 0

[HUDSON] Recording test results
[INFO] [jar:jar]
[INFO] Building jar: http://ci.sonatype.org/job/plugins-IT-with-maven-2.0.x/org.apache.maven.plugins$maven-changelog-plugin/ws/target/maven-changelog-plugin-2.2-SNAPSHOT.jar

[INFO] [plugin:addPluginArtifactMetadata]
[INFO] [invoker:install {execution: integration-test}]
[INFO] Installing http://ci.sonatype.org/job/plugins-IT-with-maven-2.0.x/org.apache.maven.plugins$maven-changelog-plugin/ws/pom.xml
 to http://ci.sonatype.org/job/plugins-IT-with-maven-2.0.x/org.apache.maven.plugins$maven-changelog-plugin/ws/target/local-repo/org/apache/maven/plugins/maven-changelog-plugin/2.2-SNAPSHOT/maven-changelog-plugin-2.2-SNAPSHOT.pom

[INFO] Installing http://ci.sonatype.org/job/plugins-IT-with-maven-2.0.x/org.apache.maven.plugins$maven-changelog-plugin/ws/target/maven-changelog-plugin-2.2-SNAPSHOT.jar
 to http://ci.sonatype.org/job/plugins-IT-with-maven-2.0.x/org.apache.maven.plugins$maven-changelog-plugin/ws/target/local-repo/org/apache/maven/plugins/maven-changelog-plugin/2.2-SNAPSHOT/maven-changelog-plugin-2.2-SNAPSHOT.jar

[INFO] [invoker:run {execution: integration-test}]
[INFO] Building: minimal-pom/pom.xml
[INFO] ...FAILED[code=1]. See http://ci.sonatype.org/job/plugins-IT-with-maven-2.0.x/org.apache.maven.plugins$maven-changelog-plugin/ws/target/it/minimal-pom/build.log
 for details.
[INFO] 

---------------------------------------
Execution Summary:
Builds Passing: 0
Builds Failing: 1
---------------------------------------

The following builds failed:

*  minimal-pom/pom.xml

[HUDSON] Archiving http://ci.sonatype.org/job/plugins-IT-with-maven-2.0.x/org.apache.maven.plugins$maven-changelog-plugin/ws/pom.xml
 to /home/hudson/.hudson/jobs/plugins-IT-with-maven-2.0.x/modules/org.apache.maven.plugins$maven-changelog-plugin/builds/2008-10-10_16-38-25/archive/org.apache.maven.plugins/maven-changelog-plugin/2.2-SNAPSHOT/pom.xml
[HUDSON] Archiving http://ci.sonatype.org/job/plugins-IT-with-maven-2.0.x/org.apache.maven.plugins$maven-changelog-plugin/ws/target/maven-changelog-plugin-2.2-SNAPSHOT.jar
 to /home/hudson/.hudson/jobs/plugins-IT-with-maven-2.0.x/modules/org.apache.maven.plugins$maven-changelog-plugin/builds/2008-10-10_16-38-25/archive/org.apache.maven.plugins/maven-changelog-plugin/2.2-SNAPSHOT/maven-changelog-plugin-2.2-SNAPSHOT.jar


Mime
View raw message