maven-notifications mailing list archives

Site index · List index
Message view « Date » · « Thread »
Top « Date » · « Thread »
From Hudson <Hud...@sonatype.org>
Subject Build failed in Hudson: Archetype #53
Date Sun, 12 Oct 2008 23:52:01 GMT
See http://ci.sonatype.org/job/Archetype/53/changes

Changes:

[rafale] Fixing dependency issue

------------------------------------------
[...truncated 1109 lines...]
24K downloaded
Downloading: http://localhost:8081/content/groups/public/org/codehaus/plexus/plexus-interactivity-api/1.0-alpha-5/plexus-interactivity-api-1.0-alpha-5.jar
13K downloaded
Downloading: http://localhost:8081/content/groups/public/org/apache/maven/maven-plugin-descriptor/2.0.8/maven-plugin-descriptor-2.0.8.jar
36K downloaded
Downloading: http://localhost:8081/content/groups/public/org/apache/maven/maven-monitor/2.0.8/maven-monitor-2.0.8.jar
10K downloaded
Downloading: http://localhost:8081/content/groups/public/org/apache/maven/wagon/wagon-ssh/1.0-beta-2/wagon-ssh-1.0-beta-2.jar
23K downloaded
Downloading: http://localhost:8081/content/groups/public/com/jcraft/jsch/0.1.27/jsch-0.1.27.jar
119K downloaded
Downloading: http://localhost:8081/content/groups/public/net/sourceforge/jchardet/jchardet/1.0/jchardet-1.0.jar
25K downloaded
Downloading: http://localhost:8081/content/groups/public/commons-collections/commons-collections/3.2.1/commons-collections-3.2.1.jar
561K downloaded
Downloading: http://localhost:8081/content/groups/public/org/codehaus/cargo/cargo-core-api-container/1.0-alpha-6/cargo-core-api-container-1.0-alpha-6.jar
83K downloaded
Downloading: http://localhost:8081/content/groups/public/org/codehaus/cargo/cargo-core-api-module/1.0-alpha-6/cargo-core-api-module-1.0-alpha-6.jar
238K downloaded
Downloading: http://localhost:8081/content/groups/public/org/codehaus/cargo/cargo-core-api-util/1.0-alpha-6/cargo-core-api-util-1.0-alpha-6.jar
23K downloaded
Downloading: http://localhost:8081/content/groups/public/ant/ant/1.6.5/ant-1.6.5.jar
1009K downloaded
Downloading: http://localhost:8081/content/groups/public/jaxen/jaxen/1.0-FCS/jaxen-1.0-FCS.jar
187K downloaded
Downloading: http://localhost:8081/content/groups/public/org/apache/geronimo/specs/geronimo-j2ee-deployment_1.1_spec/1.0/geronimo-j2ee-deployment_1.1_spec-1.0.jar
23K downloaded
Downloading: http://localhost:8081/content/groups/public/org/codehaus/cargo/cargo-core-api-generic/1.0-alpha-6/cargo-core-api-generic-1.0-alpha-6.jar
40K downloaded
Downloading: http://localhost:8081/content/groups/public/commons-discovery/commons-discovery/0.4/commons-discovery-0.4.jar
74K downloaded
Downloading: http://localhost:8081/content/groups/public/commons-logging/commons-logging/1.0.3/commons-logging-1.0.3.jar
30K downloaded
Downloading: http://localhost:8081/content/groups/public/org/codehaus/cargo/cargo-core-container-jetty/1.0-alpha-6/cargo-core-container-jetty-1.0-alpha-6.jar
44K downloaded
Downloading: http://localhost:8081/content/groups/public/org/mortbay/jetty/jetty/6.1.11/jetty-6.1.11.jar
488K downloaded
Downloading: http://localhost:8081/content/groups/public/org/mortbay/jetty/servlet-api-2.5/6.1.11/servlet-api-2.5-6.1.11.jar
129K downloaded
Downloading: http://localhost:8081/content/groups/public/org/apache/maven/wagon/wagon-http/1.0-beta-2/wagon-http-1.0-beta-2.jar
14K downloaded
Downloading: http://localhost:8081/content/groups/public/commons-httpclient/commons-httpclient/2.0.2/commons-httpclient-2.0.2.jar
220K downloaded
[INFO] [remote-resources:process {execution: default}]
[INFO] [resources:resources]
[INFO] Using encoding: 'UTF-8' to copy filtered resources.
[INFO] [compiler:compile]
[INFO] Compiling 87 source files to http://ci.sonatype.org/job/Archetype/ws/trunk/archetype-common/target/classes

[INFO] [plexus:descriptor {execution: default}]
[INFO] Discovered 14 component descriptors(s)
[INFO] [resources:testResources]
[INFO] Using encoding: 'UTF-8' to copy filtered resources.
Downloading: http://localhost:8081/content/groups/public/org/apache/maven/shared/file-management/1.1/file-management-1.1.pom
2K downloaded
Downloading: http://localhost:8081/content/groups/public/org/apache/maven/shared/maven-shared-io/1.0/maven-shared-io-1.0.pom
2K downloaded
Downloading: http://localhost:8081/content/groups/public/org/apache/maven/shared/maven-dependency-analyzer/1.0/maven-dependency-analyzer-1.0.pom
4K downloaded
Downloading: http://localhost:8081/content/groups/public/asm/asm/3.0/asm-3.0.pom
360b downloaded
Downloading: http://localhost:8081/content/groups/public/asm/asm-parent/3.0/asm-parent-3.0.pom
2K downloaded
Downloading: http://localhost:8081/content/groups/public/org/apache/maven/shared/maven-dependency-tree/1.1/maven-dependency-tree-1.1.pom
2K downloaded
Downloading: http://localhost:8081/content/groups/public/org/apache/maven/reporting/maven-reporting-impl/2.0.4/maven-reporting-impl-2.0.4.pom
1K downloaded
Downloading: http://localhost:8081/content/groups/public/org/apache/maven/maven-project/2.0.4/maven-project-2.0.4.pom
1K downloaded
Downloading: http://localhost:8081/content/groups/public/commons-validator/commons-validator/1.2.0/commons-validator-1.2.0.pom
8K downloaded
Downloading: http://localhost:8081/content/groups/public/commons-beanutils/commons-beanutils/1.7.0/commons-beanutils-1.7.0.pom
357b downloaded
Downloading: http://localhost:8081/content/groups/public/commons-digester/commons-digester/1.6/commons-digester-1.6.pom
974b downloaded
Downloading: http://localhost:8081/content/groups/public/commons-beanutils/commons-beanutils/1.6/commons-beanutils-1.6.pom
2K downloaded
Downloading: http://localhost:8081/content/groups/public/commons-logging/commons-logging/1.0/commons-logging-1.0.pom
163b downloaded
Downloading: http://localhost:8081/content/groups/public/commons-collections/commons-collections/2.1/commons-collections-2.1.pom
3K downloaded
Downloading: http://localhost:8081/content/groups/public/xml-apis/xml-apis/2.0.2/xml-apis-2.0.2.pom
346b downloaded
Downloading: http://localhost:8081/content/groups/public/org/apache/maven/doxia/doxia-core/1.0-alpha-7/doxia-core-1.0-alpha-7.pom
1K downloaded
Downloading: http://localhost:8081/content/groups/public/org/apache/maven/maven-plugin-api/2.0.4/maven-plugin-api-2.0.4.pom
643b downloaded
Downloading: http://localhost:8081/content/groups/public/org/apache/maven/doxia/doxia-site-renderer/1.0-alpha-7/doxia-site-renderer-1.0-alpha-7.pom
1K downloaded
Downloading: http://localhost:8081/content/groups/public/org/codehaus/plexus/plexus-i18n/1.0-beta-6/plexus-i18n-1.0-beta-6.pom
771b downloaded
Downloading: http://localhost:8081/content/groups/public/org/codehaus/plexus/plexus-velocity/1.1.2/plexus-velocity-1.1.2.pom
7K downloaded
Downloading: http://localhost:8081/content/groups/public/commons-logging/commons-logging-api/1.0.4/commons-logging-api-1.0.4.pom
168b downloaded
Downloading: http://localhost:8081/content/groups/public/org/apache/maven/doxia/doxia-decoration-model/1.0-alpha-7/doxia-decoration-model-1.0-alpha-7.pom
1K downloaded
Downloading: http://localhost:8081/content/groups/public/org/apache/maven/doxia/doxia-sink-api/1.0-alpha-8/doxia-sink-api-1.0-alpha-8.pom
424b downloaded
Downloading: http://localhost:8081/content/groups/public/org/apache/maven/doxia/doxia/1.0-alpha-8/doxia-1.0-alpha-8.pom
2K downloaded
Downloading: http://localhost:8081/content/groups/public/org/apache/maven/doxia/doxia-site-renderer/1.0-alpha-8/doxia-site-renderer-1.0-alpha-8.pom
1K downloaded
Downloading: http://localhost:8081/content/groups/public/org/apache/maven/doxia/doxia-core/1.0-alpha-8/doxia-core-1.0-alpha-8.pom
1K downloaded
Downloading: http://localhost:8081/content/groups/public/org/apache/maven/doxia/doxia-decoration-model/1.0-alpha-8/doxia-decoration-model-1.0-alpha-8.pom
1K downloaded
Downloading: http://localhost:8081/content/groups/public/org/codehaus/plexus/plexus-utils/1.4.6/plexus-utils-1.4.6.jar
199K downloaded
Downloading: http://localhost:8081/content/groups/public/org/apache/maven/shared/file-management/1.1/file-management-1.1.jar
30K downloaded
Downloading: http://localhost:8081/content/groups/public/org/apache/maven/shared/maven-shared-io/1.0/maven-shared-io-1.0.jar
32K downloaded
Downloading: http://localhost:8081/content/groups/public/org/apache/maven/shared/maven-dependency-analyzer/1.0/maven-dependency-analyzer-1.0.jar
26K downloaded
Downloading: http://localhost:8081/content/groups/public/asm/asm/3.0/asm-3.0.jar
41K downloaded
Downloading: http://localhost:8081/content/groups/public/org/apache/maven/shared/maven-dependency-tree/1.1/maven-dependency-tree-1.1.jar
33K downloaded
Downloading: http://localhost:8081/content/groups/public/org/apache/maven/reporting/maven-reporting-impl/2.0.4/maven-reporting-impl-2.0.4.jar
13K downloaded
Downloading: http://localhost:8081/content/groups/public/commons-validator/commons-validator/1.2.0/commons-validator-1.2.0.jar
88K downloaded
Downloading: http://localhost:8081/content/groups/public/commons-beanutils/commons-beanutils/1.7.0/commons-beanutils-1.7.0.jar
184K downloaded
Downloading: http://localhost:8081/content/groups/public/commons-logging/commons-logging/1.0.4/commons-logging-1.0.4.jar
37K downloaded
Downloading: http://localhost:8081/content/groups/public/commons-digester/commons-digester/1.6/commons-digester-1.6.jar
164K downloaded
Downloading: http://localhost:8081/content/groups/public/org/apache/maven/doxia/doxia-core/1.0-alpha-7/doxia-core-1.0-alpha-7.jar
225K downloaded
Downloading: http://localhost:8081/content/groups/public/org/apache/maven/doxia/doxia-site-renderer/1.0-alpha-8/doxia-site-renderer-1.0-alpha-8.jar
33K downloaded
Downloading: http://localhost:8081/content/groups/public/org/codehaus/plexus/plexus-i18n/1.0-beta-6/plexus-i18n-1.0-beta-6.jar
11K downloaded
Downloading: http://localhost:8081/content/groups/public/org/apache/maven/doxia/doxia-decoration-model/1.0-alpha-8/doxia-decoration-model-1.0-alpha-8.jar
39K downloaded
[INFO] [dependency:copy-dependencies {execution: copy}]
[INFO] Copying archetype-proxy-2.0-alpha-5-SNAPSHOT.war to http://ci.sonatype.org/job/Archetype/ws/trunk/archetype-common/target/wars/archetype-proxy.war

[INFO] Copying archetype-repository-2.0-alpha-5-SNAPSHOT.war to http://ci.sonatype.org/job/Archetype/ws/trunk/archetype-common/target/wars/archetype-repository.war

Downloading: http://localhost:8081/content/groups/public/ant/ant-antlr/1.6.5/ant-antlr-1.6.5.pom
146b downloaded
Downloading: http://localhost:8081/content/groups/public/org/apache/maven/maven-plugin-api/2.0.1/maven-plugin-api-2.0.1.pom
643b downloaded
Downloading: http://localhost:8081/content/groups/public/org/apache/maven/maven/2.0.1/maven-2.0.1.pom
11K downloaded
Downloading: http://localhost:8081/content/groups/public/org/apache/maven/maven-project/2.0.1/maven-project-2.0.1.pom
1K downloaded
Downloading: http://localhost:8081/content/groups/public/org/apache/maven/maven-profile/2.0.1/maven-profile-2.0.1.pom
1K downloaded
Downloading: http://localhost:8081/content/groups/public/org/apache/maven/maven-model/2.0.1/maven-model-2.0.1.pom
2K downloaded
Downloading: http://localhost:8081/content/groups/public/org/apache/maven/maven-artifact-manager/2.0.1/maven-artifact-manager-2.0.1.pom
1K downloaded
Downloading: http://localhost:8081/content/groups/public/org/apache/maven/maven-repository-metadata/2.0.1/maven-repository-metadata-2.0.1.pom
1K downloaded
Downloading: http://localhost:8081/content/groups/public/org/apache/maven/maven-artifact/2.0.1/maven-artifact-2.0.1.pom
765b downloaded
Downloading: http://localhost:8081/content/groups/public/ant/ant-launcher/1.6.5/ant-launcher-1.6.5.pom
149b downloaded
Downloading: http://localhost:8081/content/groups/public/ant/ant-antlr/1.6.5/ant-antlr-1.6.5.jar
5K downloaded
Downloading: http://localhost:8081/content/groups/public/ant/ant-launcher/1.6.5/ant-launcher-1.6.5.jar
8K downloaded
[INFO] [antrun:run {execution: archetype-test}]
[INFO] Executing tasks
    [mkdir] Created dir: http://ci.sonatype.org/job/Archetype/ws/trunk/archetype-common/target/test-classes/repositories/central/archetypes/basic/1.0

      [jar] Building jar: http://ci.sonatype.org/job/Archetype/ws/trunk/archetype-common/target/test-classes/repositories/central/archetypes/basic/1.0/basic-1.0.jar

[INFO] Executed tasks
[INFO] [antrun:run {execution: archetype-test-partial}]
[INFO] Executing tasks
    [mkdir] Created dir: http://ci.sonatype.org/job/Archetype/ws/trunk/archetype-common/target/test-classes/repositories/central/archetypes/partial/1.0

      [jar] Building jar: http://ci.sonatype.org/job/Archetype/ws/trunk/archetype-common/target/test-classes/repositories/central/archetypes/partial/1.0/partial-1.0.jar

[INFO] Executed tasks
[INFO] [antrun:run {execution: archetype-test-site}]
[INFO] Executing tasks
    [mkdir] Created dir: http://ci.sonatype.org/job/Archetype/ws/trunk/archetype-common/target/test-classes/repositories/central/archetypes/site/1.0

      [jar] Building jar: http://ci.sonatype.org/job/Archetype/ws/trunk/archetype-common/target/test-classes/repositories/central/archetypes/site/1.0/site-1.0.jar

[INFO] Executed tasks
[INFO] [antrun:run {execution: archetype-test-old}]
[INFO] Executing tasks
    [mkdir] Created dir: http://ci.sonatype.org/job/Archetype/ws/trunk/archetype-common/target/test-classes/repositories/central/archetypes/old/1.0

      [jar] Building jar: http://ci.sonatype.org/job/Archetype/ws/trunk/archetype-common/target/test-classes/repositories/central/archetypes/old/1.0/old-1.0.jar

[INFO] Executed tasks
[INFO] [antrun:run {execution: archetype-test-fileset}]
[INFO] Executing tasks
    [mkdir] Created dir: http://ci.sonatype.org/job/Archetype/ws/trunk/archetype-common/target/test-classes/repositories/central/archetypes/fileset/1.0

      [jar] Building jar: http://ci.sonatype.org/job/Archetype/ws/trunk/archetype-common/target/test-classes/repositories/central/archetypes/fileset/1.0/fileset-1.0.jar

[INFO] Executed tasks
[INFO] [antrun:run {execution: repository-metadata}]
[INFO] Executing tasks
[INFO] Executed tasks
[INFO] [compiler:testCompile]
[INFO] Compiling 17 source files to http://ci.sonatype.org/job/Archetype/ws/trunk/archetype-common/target/test-classes

[INFO] ------------------------------------------------------------------------
[ERROR] BUILD FAILURE
[INFO] ------------------------------------------------------------------------
[INFO] Compilation failure
http://ci.sonatype.org/job/Archetype/ws/trunk/archetype-common/src/test/java/org/apache/maven/archetype/source/CatalogArchetypeDataSinkTest.java
:[17,-1] cannot access junit.framework.TestCase
bad class file: /home/j2ee-hudson/repos/archetype/junit/junit/4.4/junit-4.4.jar(junit/framework/TestCase.class)
class file has wrong version 49.0, should be 48.0



http://ci.sonatype.org/job/Archetype/ws/trunk/archetype-common/src/test/java/org/apache/maven/archetype/source/CatalogArchetypeDataSinkTest.java
:[17,-1] cannot access junit.framework.TestCase
bad class file: /home/j2ee-hudson/repos/archetype/junit/junit/4.4/junit-4.4.jar(junit/framework/TestCase.class)
class file has wrong version 49.0, should be 48.0


[INFO] ------------------------------------------------------------------------
[INFO] Trace
org.apache.maven.BuildFailureException: Compilation failure
http://ci.sonatype.org/job/Archetype/ws/trunk/archetype-common/src/test/java/org/apache/maven/archetype/source/CatalogArchetypeDataSinkTest.java
:[17,-1] cannot access junit.framework.TestCase
bad class file: /home/j2ee-hudson/repos/archetype/junit/junit/4.4/junit-4.4.jar(junit/framework/TestCase.class)
class file has wrong version 49.0, should be 48.0


	at org.apache.maven.lifecycle.DefaultLifecycleExecutor.executeGoals(DefaultLifecycleExecutor.java:579)
	at org.apache.maven.lifecycle.DefaultLifecycleExecutor.executeGoalWithLifecycle(DefaultLifecycleExecutor.java:499)
	at org.apache.maven.lifecycle.DefaultLifecycleExecutor.executeGoal(DefaultLifecycleExecutor.java:478)
	at org.apache.maven.lifecycle.DefaultLifecycleExecutor.executeGoalAndHandleFailures(DefaultLifecycleExecutor.java:330)
	at org.apache.maven.lifecycle.DefaultLifecycleExecutor.executeTaskSegments(DefaultLifecycleExecutor.java:291)
	at org.apache.maven.lifecycle.DefaultLifecycleExecutor.execute(DefaultLifecycleExecutor.java:142)
	at org.apache.maven.DefaultMaven.doExecute(DefaultMaven.java:336)
	at org.apache.maven.DefaultMaven.execute(DefaultMaven.java:129)
	at org.apache.maven.cli.MavenCli.main(MavenCli.java:287)
	at sun.reflect.NativeMethodAccessorImpl.invoke0(Native Method)
	at sun.reflect.NativeMethodAccessorImpl.invoke(NativeMethodAccessorImpl.java:39)
	at sun.reflect.DelegatingMethodAccessorImpl.invoke(DelegatingMethodAccessorImpl.java:25)
	at java.lang.reflect.Method.invoke(Method.java:324)
	at org.codehaus.classworlds.Launcher.launchEnhanced(Launcher.java:315)
	at org.codehaus.classworlds.Launcher.launch(Launcher.java:255)
	at org.codehaus.classworlds.Launcher.mainWithExitCode(Launcher.java:430)
	at org.codehaus.classworlds.Launcher.main(Launcher.java:375)
Caused by: org.apache.maven.plugin.CompilationFailureException: Compilation failure
http://ci.sonatype.org/job/Archetype/ws/trunk/archetype-common/src/test/java/org/apache/maven/archetype/source/CatalogArchetypeDataSinkTest.java
:[17,-1] cannot access junit.framework.TestCase
bad class file: /home/j2ee-hudson/repos/archetype/junit/junit/4.4/junit-4.4.jar(junit/framework/TestCase.class)
class file has wrong version 49.0, should be 48.0


	at org.apache.maven.plugin.AbstractCompilerMojo.execute(AbstractCompilerMojo.java:516)
	at org.apache.maven.plugin.TestCompilerMojo.execute(TestCompilerMojo.java:102)
	at org.apache.maven.plugin.DefaultPluginManager.executeMojo(DefaultPluginManager.java:451)
	at org.apache.maven.lifecycle.DefaultLifecycleExecutor.executeGoals(DefaultLifecycleExecutor.java:558)
	... 16 more
[INFO] ------------------------------------------------------------------------
[INFO] Total time: 1 minute 13 seconds
[INFO] Finished at: Sun Oct 12 18:52:01 CDT 2008
[INFO] Final Memory: 56M/102M
[INFO] ------------------------------------------------------------------------


Mime
View raw message