maven-notifications mailing list archives

Site index · List index
Message view « Date » · « Thread »
Top « Date » · « Thread »
From Hudson <Hud...@sonatype.org>
Subject Build failed in Hudson: plugins-IT-with-maven-2.0.x » Maven Dependency Plugin #546
Date Wed, 15 Oct 2008 12:27:55 GMT
See http://ci.sonatype.org/job/plugins-IT-with-maven-2.0.x/org.apache.maven.plugins$maven-dependency-plugin/546/changes

------------------------------------------
[INFO] ------------------------------------------------------------------------
[INFO] Building Maven Dependency Plugin
[INFO]    task-segment: [clean, deploy]
[INFO] ------------------------------------------------------------------------
[INFO] snapshot org.codehaus.mojo:shitty-maven-plugin:1.0-alpha-3-SNAPSHOT: checking for updates
from central
[WARNING] repository metadata for: 'snapshot org.codehaus.mojo:shitty-maven-plugin:1.0-alpha-3-SNAPSHOT'
could not be retrieved from repository: central due to an error: Error transferring file
[INFO] Repository 'central' will be blacklisted
[INFO] snapshot org.codehaus.mojo:shitty-maven-plugin:1.0-alpha-3-SNAPSHOT: checking for updates
from Codehaus Snapshots
[INFO] snapshot org.codehaus.mojo:shitty-maven-plugin:1.0-alpha-3-SNAPSHOT: checking for updates
from central
[WARNING] repository metadata for: 'snapshot org.codehaus.mojo:shitty-maven-plugin:1.0-alpha-3-SNAPSHOT'
could not be retrieved from repository: central due to an error: Error transferring file
[INFO] Repository 'central' will be blacklisted
[INFO] snapshot org.codehaus.mojo:shitty-maven-plugin:1.0-alpha-3-SNAPSHOT: checking for updates
from apache.snapshots
[WARNING] repository metadata for: 'snapshot org.codehaus.mojo:shitty-maven-plugin:1.0-alpha-3-SNAPSHOT'
could not be retrieved from repository: apache.snapshots due to an error: Error transferring
file
[INFO] Repository 'apache.snapshots' will be blacklisted
[INFO] [clean:clean]
[INFO] Deleting directory http://ci.sonatype.org/job/plugins-IT-with-maven-2.0.x/org.apache.maven.plugins$maven-dependency-plugin/ws/target

[INFO] [enforcer:enforce {execution: ensure-no-container-api}]
[WARNING] Attempting to build MavenProject instance for Artifact (org.codehaus.mojo:shitty-maven-plugin:1.0-alpha-3-20080809.120934-2)
of type: maven-plugin; constructing POM artifact instead.
[INFO] snapshot org.codehaus.groovy.maven:gmaven-mojo:1.0-rc-3-SNAPSHOT: checking for updates
from Codehaus Snapshots
[INFO] snapshot org.codehaus.groovy.maven:gmaven-mojo:1.0-rc-3-SNAPSHOT: checking for updates
from codehaus.org
[INFO] snapshot org.codehaus.groovy.maven:gmaven:1.0-rc-3-SNAPSHOT: checking for updates from
Codehaus Snapshots
[INFO] snapshot org.codehaus.groovy.maven:gmaven:1.0-rc-3-SNAPSHOT: checking for updates from
codehaus.org
[INFO] snapshot org.codehaus.groovy.maven.runtime:gmaven-runtime-api:1.0-rc-3-SNAPSHOT: checking
for updates from Codehaus Snapshots
[INFO] snapshot org.codehaus.groovy.maven.runtime:gmaven-runtime-api:1.0-rc-3-SNAPSHOT: checking
for updates from codehaus.org
[INFO] snapshot org.codehaus.groovy.maven.runtime:gmaven-runtime:1.0-rc-3-SNAPSHOT: checking
for updates from Codehaus Snapshots
[INFO] snapshot org.codehaus.groovy.maven.runtime:gmaven-runtime:1.0-rc-3-SNAPSHOT: checking
for updates from codehaus.org
[INFO] snapshot org.codehaus.groovy.maven.feature:gmaven-feature-api:1.0-rc-3-SNAPSHOT: checking
for updates from Codehaus Snapshots
[INFO] snapshot org.codehaus.groovy.maven.feature:gmaven-feature-api:1.0-rc-3-SNAPSHOT: checking
for updates from codehaus.org
[INFO] snapshot org.codehaus.groovy.maven.feature:gmaven-feature:1.0-rc-3-SNAPSHOT: checking
for updates from Codehaus Snapshots
[INFO] snapshot org.codehaus.groovy.maven.feature:gmaven-feature:1.0-rc-3-SNAPSHOT: checking
for updates from codehaus.org
[INFO] snapshot org.codehaus.groovy.maven.runtime:gmaven-runtime-default:1.0-rc-3-SNAPSHOT:
checking for updates from Codehaus Snapshots
[INFO] snapshot org.codehaus.groovy.maven.runtime:gmaven-runtime-default:1.0-rc-3-SNAPSHOT:
checking for updates from codehaus.org
[INFO] snapshot org.codehaus.groovy.maven.runtime:gmaven-runtime-1.5:1.0-rc-3-SNAPSHOT: checking
for updates from Codehaus Snapshots
[INFO] snapshot org.codehaus.groovy.maven.runtime:gmaven-runtime-1.5:1.0-rc-3-SNAPSHOT: checking
for updates from codehaus.org
[INFO] snapshot org.codehaus.groovy.maven.feature:gmaven-feature-support:1.0-rc-3-SNAPSHOT:
checking for updates from Codehaus Snapshots
[INFO] snapshot org.codehaus.groovy.maven.feature:gmaven-feature-support:1.0-rc-3-SNAPSHOT:
checking for updates from codehaus.org
[INFO] snapshot org.codehaus.groovy.maven.runtime:gmaven-runtime-support:1.0-rc-3-SNAPSHOT:
checking for updates from Codehaus Snapshots
[INFO] snapshot org.codehaus.groovy.maven.runtime:gmaven-runtime-support:1.0-rc-3-SNAPSHOT:
checking for updates from codehaus.org
[INFO] snapshot org.codehaus.groovy.maven:gmaven-common:1.0-rc-3-SNAPSHOT: checking for updates
from Codehaus Snapshots
[WARNING] *** CHECKSUM FAILED - Checksum failed on download: local = 'a306ed6e48e4ea90c1505e4fce122726dea8d761';
remote = '39b743b903f6dea9d16fa69dc997bf38dd9df158' - RETRYING
[WARNING] *** CHECKSUM FAILED - Checksum failed on download: local = 'a306ed6e48e4ea90c1505e4fce122726dea8d761';
remote = '39b743b903f6dea9d16fa69dc997bf38dd9df158' - IGNORING
[INFO] snapshot org.codehaus.groovy.maven:gmaven-common:1.0-rc-3-SNAPSHOT: checking for updates
from codehaus.org
[WARNING] *** CHECKSUM FAILED - Checksum failed on download: local = 'a306ed6e48e4ea90c1505e4fce122726dea8d761';
remote = '39b743b903f6dea9d16fa69dc997bf38dd9df158' - RETRYING
[WARNING] *** CHECKSUM FAILED - Checksum failed on download: local = 'a306ed6e48e4ea90c1505e4fce122726dea8d761';
remote = '39b743b903f6dea9d16fa69dc997bf38dd9df158' - IGNORING
Downloading: http://snapshots.repository.codehaus.org/org/codehaus/groovy/maven/gmaven-common/1.0-rc-3-SNAPSHOT/gmaven-common-1.0-rc-3-20080814.131810-9.pom
Downloading: http://snapshots.repository.codehaus.org/org/codehaus/groovy/maven/gmaven-common/1.0-rc-3-SNAPSHOT/gmaven-common-1.0-rc-3-20080814.131810-9.pom
Downloading: http://snapshots.repository.codehaus.org/org/codehaus/groovy/maven/gmaven-common/1.0-rc-3-SNAPSHOT/gmaven-common-1.0-rc-3-20080814.131810-9.pom
[INFO] [shitty:clean {execution: default}]
[INFO] [plugin:helpmojo {execution: generated-helpmojo}]
[INFO] Using 2 extractors.
[INFO] Applying extractor for language: java
[INFO] Extractor for language: java found 17 mojo descriptors.
[INFO] Applying extractor for language: bsh
[INFO] Extractor for language: bsh found 0 mojo descriptors.
[INFO] [plugin:descriptor]
[INFO] Using 2 extractors.
[INFO] Applying extractor for language: java
[INFO] Extractor for language: java found 18 mojo descriptors.
[INFO] Applying extractor for language: bsh
[INFO] Extractor for language: bsh found 0 mojo descriptors.
[INFO] [remote-resources:process {execution: default}]
[INFO] [resources:resources]
[INFO] Using encoding: 'UTF-8' to copy filtered resources.
[INFO] [compiler:compile]
[INFO] Compiling 41 source files to http://ci.sonatype.org/job/plugins-IT-with-maven-2.0.x/org.apache.maven.plugins$maven-dependency-plugin/ws/target/classes

[INFO] [resources:testResources]
[INFO] Using encoding: 'UTF-8' to copy filtered resources.
[INFO] [compiler:testCompile]
[INFO] Compiling 34 source files to http://ci.sonatype.org/job/plugins-IT-with-maven-2.0.x/org.apache.maven.plugins$maven-dependency-plugin/ws/target/test-classes

[INFO] [surefire:test]
[INFO] Surefire report directory: http://ci.sonatype.org/job/plugins-IT-with-maven-2.0.x/org.apache.maven.plugins$maven-dependency-plugin/ws/target/surefire-reports


-------------------------------------------------------
 T E S T S
-------------------------------------------------------
Running org.apache.maven.plugin.dependency.TestAnalyzeDepMgt
[info] Found Resolved Dependency / DependencyManagement mismatches:
[info]    Nothing in DepMgt.
[info] Found Resolved Dependency / DependencyManagement mismatches:
[info] testGroupId:release:jar was excluded in DepMgt, but version 1.0 has been found in the
dependency tree.
[info] 	Dependency: testGroupId:release:jar
[info] 		DepMgt  : 3.0
[info] 		Resolved: 1.0
[warn] Potential problems found in Dependency Management 
[info] Found Resolved Dependency / DependencyManagement mismatches:
[info] testGroupId:release:jar was excluded in DepMgt, but version 1.0 has been found in the
dependency tree.
[info] 	Dependency: testGroupId:release:jar
[info] 		DepMgt  : 3.0
[info] 		Resolved: 1.0
Caught Expected Exception:Found Dependency errors.
[info] Found Resolved Dependency / DependencyManagement mismatches:
[info] 	Ignoring Direct Dependencies.
[info]    None
Tests run: 5, Failures: 0, Errors: 0, Skipped: 0, Time elapsed: 0.099 sec
Running org.apache.maven.plugin.dependency.TestUnpackDependenciesMojo
Tests run: 28, Failures: 0, Errors: 0, Skipped: 0, Time elapsed: 15.781 sec
Running org.apache.maven.plugin.dependency.utils.markers.TestDefaultMarkerFileHandler
Tests run: 6, Failures: 0, Errors: 0, Skipped: 0, Time elapsed: 0.014 sec
Running org.apache.maven.plugin.dependency.utils.filters.TestMarkerFileFilter
Tests run: 5, Failures: 0, Errors: 0, Skipped: 0, Time elapsed: 0.011 sec
Running org.apache.maven.plugin.dependency.utils.filters.TestResolveMarkerFileFilter
Tests run: 1, Failures: 0, Errors: 0, Skipped: 0, Time elapsed: 0.008 sec
Running org.apache.maven.plugin.dependency.utils.translators.TestClassifierTypeTranslator
Tests run: 6, Failures: 0, Errors: 0, Skipped: 0, Time elapsed: 0.611 sec
Running org.apache.maven.plugin.dependency.TestIncludeExcludeUnpackMojo
[INFO] Configured Artifact: test:test:1.0:jar
[INFO] Unpacking http://ci.sonatype.org/job/plugins-IT-with-maven-2.0.x/org.apache.maven.plugins$maven-dependency-plugin/ws/target/unit-tests/unpack/localTestRepo/test-1.0.jar
 to
  http://ci.sonatype.org/job/plugins-IT-with-maven-2.0.x/org.apache.maven.plugins$maven-dependency-plugin/ws/target/unit-tests/unpack/outputDirectory

   with Includes **/*1.txt and excludes:null
[INFO] Configured Artifact: test:test:1.0:jar
[INFO] Unpacking http://ci.sonatype.org/job/plugins-IT-with-maven-2.0.x/org.apache.maven.plugins$maven-dependency-plugin/ws/target/unit-tests/unpack/localTestRepo/test-1.0.jar
 to
  http://ci.sonatype.org/job/plugins-IT-with-maven-2.0.x/org.apache.maven.plugins$maven-dependency-plugin/ws/target/unit-tests/unpack/outputDirectory

   with Includes **/test2.txt and excludes:null
[INFO] Configured Artifact: test:test:1.0:jar
[INFO] Unpacking http://ci.sonatype.org/job/plugins-IT-with-maven-2.0.x/org.apache.maven.plugins$maven-dependency-plugin/ws/target/unit-tests/unpack/localTestRepo/test-1.0.jar
 to
  http://ci.sonatype.org/job/plugins-IT-with-maven-2.0.x/org.apache.maven.plugins$maven-dependency-plugin/ws/target/unit-tests/unpack/outputDirectory

   with Includes **/* and excludes:null
[INFO] Configured Artifact: test:test:1.0:jar
[INFO] Unpacking http://ci.sonatype.org/job/plugins-IT-with-maven-2.0.x/org.apache.maven.plugins$maven-dependency-plugin/ws/target/unit-tests/unpack/localTestRepo/test-1.0.jar
 to
  http://ci.sonatype.org/job/plugins-IT-with-maven-2.0.x/org.apache.maven.plugins$maven-dependency-plugin/ws/target/unit-tests/unpack/outputDirectory

   with Includes null and excludes:**/*1.txt
[INFO] Configured Artifact: test:test:1.0:jar
[INFO] Unpacking http://ci.sonatype.org/job/plugins-IT-with-maven-2.0.x/org.apache.maven.plugins$maven-dependency-plugin/ws/target/unit-tests/unpack/localTestRepo/test-1.0.jar
 to
  http://ci.sonatype.org/job/plugins-IT-with-maven-2.0.x/org.apache.maven.plugins$maven-dependency-plugin/ws/target/unit-tests/unpack/outputDirectory

   with Includes null and excludes:**/test2.txt
[INFO] Configured Artifact: test:test:1.0:jar
[INFO] Unpacking http://ci.sonatype.org/job/plugins-IT-with-maven-2.0.x/org.apache.maven.plugins$maven-dependency-plugin/ws/target/unit-tests/unpack/localTestRepo/test-1.0.jar
 to
  http://ci.sonatype.org/job/plugins-IT-with-maven-2.0.x/org.apache.maven.plugins$maven-dependency-plugin/ws/target/unit-tests/unpack/outputDirectory

   with Includes null and excludes:**/*
[INFO] Configured Artifact: test:test:1.0:jar
[INFO] Unpacking http://ci.sonatype.org/job/plugins-IT-with-maven-2.0.x/org.apache.maven.plugins$maven-dependency-plugin/ws/target/unit-tests/unpack/localTestRepo/test-1.0.jar
 to
  http://ci.sonatype.org/job/plugins-IT-with-maven-2.0.x/org.apache.maven.plugins$maven-dependency-plugin/ws/target/unit-tests/unpack/outputDirectory

   with Includes null and excludes:null
[INFO] Configured Artifact: test:test:1.0:jar
[INFO] Unpacking http://ci.sonatype.org/job/plugins-IT-with-maven-2.0.x/org.apache.maven.plugins$maven-dependency-plugin/ws/target/unit-tests/unpack/localTestRepo/test-1.0.jar
 to
  http://ci.sonatype.org/job/plugins-IT-with-maven-2.0.x/org.apache.maven.plugins$maven-dependency-plugin/ws/target/unit-tests/unpack/outputDirectory

   with Includes **/* and excludes:null
[INFO] Configured Artifact: test:test:1.0:jar
[INFO] Unpacking http://ci.sonatype.org/job/plugins-IT-with-maven-2.0.x/org.apache.maven.plugins$maven-dependency-plugin/ws/target/unit-tests/unpack/localTestRepo/test-1.0.jar
 to
  http://ci.sonatype.org/job/plugins-IT-with-maven-2.0.x/org.apache.maven.plugins$maven-dependency-plugin/ws/target/unit-tests/unpack/outputDirectory

   with Includes null and excludes:**/*
[INFO] Configured Artifact: test:test:1.0:jar
[INFO] Configured Artifact: test:test:1.0:jar
[INFO] Unpacking http://ci.sonatype.org/job/plugins-IT-with-maven-2.0.x/org.apache.maven.plugins$maven-dependency-plugin/ws/target/unit-tests/unpack/localTestRepo/test-1.0.jar
 to
  http://ci.sonatype.org/job/plugins-IT-with-maven-2.0.x/org.apache.maven.plugins$maven-dependency-plugin/ws/target/unit-tests/unpack/outputDirectory

   with Includes **/test2.txt and excludes:null
[INFO] Unpacking http://ci.sonatype.org/job/plugins-IT-with-maven-2.0.x/org.apache.maven.plugins$maven-dependency-plugin/ws/target/unit-tests/unpack/localTestRepo/test-1.0.jar
 to
  http://ci.sonatype.org/job/plugins-IT-with-maven-2.0.x/org.apache.maven.plugins$maven-dependency-plugin/ws/target/unit-tests/unpack/outputDirectory

   with Includes **/test3.txt and excludes:null
[INFO] Configured Artifact: test:test:1.0:jar
[INFO] Configured Artifact: test:test:1.0:jar
[INFO] Unpacking http://ci.sonatype.org/job/plugins-IT-with-maven-2.0.x/org.apache.maven.plugins$maven-dependency-plugin/ws/target/unit-tests/unpack/localTestRepo/test-1.0.jar
 to
  http://ci.sonatype.org/job/plugins-IT-with-maven-2.0.x/org.apache.maven.plugins$maven-dependency-plugin/ws/target/unit-tests/unpack/outputDirectory

   with Includes **/test2.txt and excludes:null
[INFO] Unpacking http://ci.sonatype.org/job/plugins-IT-with-maven-2.0.x/org.apache.maven.plugins$maven-dependency-plugin/ws/target/unit-tests/unpack/localTestRepo/test-1.0.jar
 to
  http://ci.sonatype.org/job/plugins-IT-with-maven-2.0.x/org.apache.maven.plugins$maven-dependency-plugin/ws/target/unit-tests/unpack/outputDirectory

   with Includes **/test3.txt and excludes:null
[INFO] Configured Artifact: test:test:1.0:jar
[INFO] Configured Artifact: test:test:1.0:jar
[INFO] test-1.0.jar already unpacked.
[INFO] test-1.0.jar already unpacked.
Tests run: 11, Failures: 0, Errors: 0, Skipped: 0, Time elapsed: 3.433 sec
Running org.apache.maven.plugin.dependency.utils.markers.TestUnpackMarkerFileHandler
Tests run: 9, Failures: 0, Errors: 0, Skipped: 0, Time elapsed: 0.956 sec
Running org.apache.maven.plugin.dependency.TestCopyDependenciesMojo
Tests run: 30, Failures: 0, Errors: 0, Skipped: 0, Time elapsed: 8.939 sec
Running org.apache.maven.plugin.dependency.utils.markers.TestSourcesMarkerFileHandler
Tests run: 10, Failures: 0, Errors: 0, Skipped: 0, Time elapsed: 0.016 sec
Running org.apache.maven.plugin.dependency.TestBuildClasspathMojo
[INFO] Dependencies classpath:
http://ci.sonatype.org/job/plugins-IT-with-maven-2.0.x/org.apache.maven.plugins$maven-dependency-plugin/ws/target/unit-tests/build-classpath/localTestRepo/compile-1.0.jar
:http://ci.sonatype.org/job/plugins-IT-with-maven-2.0.x/org.apache.maven.plugins$maven-dependency-plugin/ws/target/unit-tests/build-classpath/localTestRepo/provided-1.0.jar
:http://ci.sonatype.org/job/plugins-IT-with-maven-2.0.x/org.apache.maven.plugins$maven-dependency-plugin/ws/target/unit-tests/build-classpath/localTestRepo/runtime-1.0.jar
:http://ci.sonatype.org/job/plugins-IT-with-maven-2.0.x/org.apache.maven.plugins$maven-dependency-plugin/ws/target/unit-tests/build-classpath/localTestRepo/system-1.0.jar
:http://ci.sonatype.org/job/plugins-IT-with-maven-2.0.x/org.apache.maven.plugins$maven-dependency-plugin/ws/target/unit-tests/build-classpath/localTestRepo/test-1.0.jar
:http://ci.sonatype.org/job/plugins-IT-with-maven-2.0.x/org.apache.maven.plugins$maven-dependency-plugin/ws/target/unit-tests/build-classpath/localTestRepo/release-1.0.jar
:http://ci.sonatype.org/job/plugins-IT-with-maven-2.0.x/org.apache.maven.plugins$maven-dependency-plugin/ws/target/unit-tests/build-classpath/localTestRepo/snapshot-2.0-SNAPSHOT.jar

[INFO] Wrote classpath file 'http://ci.sonatype.org/job/plugins-IT-with-maven-2.0.x/org.apache.maven.plugins$maven-dependency-plugin/ws/target/unit-tests/build-classpath/buildClasspath.txt'.

[INFO] Wrote classpath file 'http://ci.sonatype.org/job/plugins-IT-with-maven-2.0.x/org.apache.maven.plugins$maven-dependency-plugin/ws/target/unit-tests/build-classpath/buildClasspath.txt'.

Tests run: 2, Failures: 0, Errors: 0, Skipped: 0, Time elapsed: 0.358 sec
Running org.apache.maven.plugin.dependency.its.DependencyPluginTest
Tests run: 3, Failures: 0, Errors: 0, Skipped: 0, Time elapsed: 0.008 sec
Running org.apache.maven.plugin.dependency.utils.TestSilentLog
Tests run: 2, Failures: 0, Errors: 0, Skipped: 0, Time elapsed: 0.004 sec
Running org.apache.maven.plugin.dependency.TestResolveMojo
Tests run: 2, Failures: 0, Errors: 0, Skipped: 0, Time elapsed: 0.315 sec
Running org.apache.maven.plugin.dependency.fromConfiguration.TestArtifactItem
Tests run: 2, Failures: 0, Errors: 0, Skipped: 0, Time elapsed: 0.199 sec
Running org.apache.maven.plugin.dependency.TestTreeMojo
[INFO] testGroupId:project:jar:1.0:compile
[INFO] +- testGroupId:snapshot:jar:2.0-SNAPSHOT:compile
[INFO] \- testGroupId:release:jar:1.0:compile
Tests run: 1, Failures: 0, Errors: 0, Skipped: 0, Time elapsed: 0.27 sec
Running org.apache.maven.plugin.dependency.utils.TestDependencyStatusSets
Tests run: 5, Failures: 0, Errors: 0, Skipped: 0, Time elapsed: 0.515 sec
Running org.apache.maven.plugin.dependency.fromConfiguration.TestCopyMojo
Tests run: 23, Failures: 0, Errors: 0, Skipped: 0, Time elapsed: 4.866 sec
Running org.apache.maven.plugin.dependency.utils.TestDependencyUtil
Tests run: 7, Failures: 0, Errors: 0, Skipped: 0, Time elapsed: 0.01 sec
Running org.apache.maven.plugin.dependency.TestIncludeExcludeUnpackDependenciesMojo
Tests run: 7, Failures: 0, Errors: 0, Skipped: 0, Time elapsed: 2.009 sec
Running org.apache.maven.plugin.dependency.utils.filters.TestDestFileFilter
Tests run: 7, Failures: 0, Errors: 0, Skipped: 0, Time elapsed: 0.016 sec
Running org.apache.maven.plugin.dependency.TestCopyDependenciesMojo2
[INFO] Installing http://ci.sonatype.org/job/plugins-IT-with-maven-2.0.x/org.apache.maven.plugins$maven-dependency-plugin/ws/target/unit-tests/copy-dependencies/localTestRepo/compile-1.0.jar
 to http://ci.sonatype.org/job/plugins-IT-with-maven-2.0.x/org.apache.maven.plugins$maven-dependency-plugin/ws/target/unit-tests/copy-dependencies/outputDirectory/g/compile/1.0/compile-1.0.jar

[INFO] Installing http://ci.sonatype.org/job/plugins-IT-with-maven-2.0.x/org.apache.maven.plugins$maven-dependency-plugin/ws/target/unit-tests/copy-dependencies/localTestRepo/provided-1.0.jar
 to http://ci.sonatype.org/job/plugins-IT-with-maven-2.0.x/org.apache.maven.plugins$maven-dependency-plugin/ws/target/unit-tests/copy-dependencies/outputDirectory/g/provided/1.0/provided-1.0.jar

[INFO] Installing http://ci.sonatype.org/job/plugins-IT-with-maven-2.0.x/org.apache.maven.plugins$maven-dependency-plugin/ws/target/unit-tests/copy-dependencies/localTestRepo/runtime-1.0.jar
 to http://ci.sonatype.org/job/plugins-IT-with-maven-2.0.x/org.apache.maven.plugins$maven-dependency-plugin/ws/target/unit-tests/copy-dependencies/outputDirectory/g/runtime/1.0/runtime-1.0.jar

[INFO] Installing http://ci.sonatype.org/job/plugins-IT-with-maven-2.0.x/org.apache.maven.plugins$maven-dependency-plugin/ws/target/unit-tests/copy-dependencies/localTestRepo/system-1.0.jar
 to http://ci.sonatype.org/job/plugins-IT-with-maven-2.0.x/org.apache.maven.plugins$maven-dependency-plugin/ws/target/unit-tests/copy-dependencies/outputDirectory/g/system/1.0/system-1.0.jar

[INFO] Installing http://ci.sonatype.org/job/plugins-IT-with-maven-2.0.x/org.apache.maven.plugins$maven-dependency-plugin/ws/target/unit-tests/copy-dependencies/localTestRepo/test-1.0.jar
 to http://ci.sonatype.org/job/plugins-IT-with-maven-2.0.x/org.apache.maven.plugins$maven-dependency-plugin/ws/target/unit-tests/copy-dependencies/outputDirectory/g/test/1.0/test-1.0.jar

[INFO] Installing http://ci.sonatype.org/job/plugins-IT-with-maven-2.0.x/org.apache.maven.plugins$maven-dependency-plugin/ws/target/unit-tests/copy-dependencies/localTestRepo/expanded-snapshot-2.0-SNAPSHOT.jar
 to http://ci.sonatype.org/job/plugins-IT-with-maven-2.0.x/org.apache.maven.plugins$maven-dependency-plugin/ws/target/unit-tests/copy-dependencies/outputDirectory/testGroupId/expanded-snapshot/2.0-SNAPSHOT/expanded-snapshot-2.0-20081015.120938-1.jar

[INFO] Installing http://ci.sonatype.org/job/plugins-IT-with-maven-2.0.x/org.apache.maven.plugins$maven-dependency-plugin/ws/target/unit-tests/copy-dependencies/localTestRepo/expanded-snapshot-2.0-SNAPSHOT.jar
 to http://ci.sonatype.org/job/plugins-IT-with-maven-2.0.x/org.apache.maven.plugins$maven-dependency-plugin/ws/target/unit-tests/copy-dependencies/outputDirectory/testGroupId/expanded-snapshot/2.0-SNAPSHOT/expanded-snapshot-2.0-SNAPSHOT.jar

[INFO] Installing http://ci.sonatype.org/job/plugins-IT-with-maven-2.0.x/org.apache.maven.plugins$maven-dependency-plugin/ws/target/unit-tests/copy-dependencies/localTestRepo/expanded-snapshot-2.0-SNAPSHOT.pom
 to http://ci.sonatype.org/job/plugins-IT-with-maven-2.0.x/org.apache.maven.plugins$maven-dependency-plugin/ws/target/unit-tests/copy-dependencies/outputDirectory/testGroupId/expanded-snapshot/2.0-SNAPSHOT/expanded-snapshot-2.0-20081015.120938-1.pom

[INFO] Installing http://ci.sonatype.org/job/plugins-IT-with-maven-2.0.x/org.apache.maven.plugins$maven-dependency-plugin/ws/target/unit-tests/copy-dependencies/localTestRepo/expanded-snapshot-2.0-SNAPSHOT.pom
 to http://ci.sonatype.org/job/plugins-IT-with-maven-2.0.x/org.apache.maven.plugins$maven-dependency-plugin/ws/target/unit-tests/copy-dependencies/outputDirectory/testGroupId/expanded-snapshot/2.0-SNAPSHOT/expanded-snapshot-2.0-SNAPSHOT.pom

[INFO] Installing http://ci.sonatype.org/job/plugins-IT-with-maven-2.0.x/org.apache.maven.plugins$maven-dependency-plugin/ws/target/unit-tests/copy-dependencies/localTestRepo/release-1.0.jar
 to http://ci.sonatype.org/job/plugins-IT-with-maven-2.0.x/org.apache.maven.plugins$maven-dependency-plugin/ws/target/unit-tests/copy-dependencies/outputDirectory/testGroupId/release/1.0/release-1.0.jar

[INFO] Installing http://ci.sonatype.org/job/plugins-IT-with-maven-2.0.x/org.apache.maven.plugins$maven-dependency-plugin/ws/target/unit-tests/copy-dependencies/localTestRepo/snapshot-2.0-SNAPSHOT.jar
 to http://ci.sonatype.org/job/plugins-IT-with-maven-2.0.x/org.apache.maven.plugins$maven-dependency-plugin/ws/target/unit-tests/copy-dependencies/outputDirectory/testGroupId/snapshot/2.0-SNAPSHOT/snapshot-2.0-SNAPSHOT.jar

Tests run: 10, Failures: 0, Errors: 0, Skipped: 0, Time elapsed: 1.82 sec
Running org.apache.maven.plugin.dependency.TestUnpackDependenciesMojo2
Tests run: 5, Failures: 0, Errors: 0, Skipped: 0, Time elapsed: 7.104 sec
Running org.apache.maven.plugin.dependency.fromConfiguration.TestUnpackMojo
Tests run: 16, Failures: 0, Errors: 0, Skipped: 0, Time elapsed: 3.524 sec

Results :

Tests run: 203, Failures: 0, Errors: 0, Skipped: 0

[HUDSON] Recording test results
[INFO] [jar:jar]
[INFO] Building jar: http://ci.sonatype.org/job/plugins-IT-with-maven-2.0.x/org.apache.maven.plugins$maven-dependency-plugin/ws/target/maven-dependency-plugin-2.1-SNAPSHOT.jar

[INFO] [plugin:addPluginArtifactMetadata]
[INFO] [shitty:install {execution: default}]
[INFO] Installing http://ci.sonatype.org/job/plugins-IT-with-maven-2.0.x/org.apache.maven.plugins$maven-dependency-plugin/ws/target/maven-dependency-plugin-2.1-SNAPSHOT.jar
 to /home/j2ee-hudson/repos/maven-plugins/org/apache/maven/plugins/maven-dependency-plugin/testing/maven-dependency-plugin-testing.jar
[INFO] [shitty:test {execution: default}]
[INFO] Starting 1 test builds
[INFO] 
[INFO] -------------------------------------------------------------------------------
[INFO] 
[INFO] filterunpack RUNNING
[INFO] filterunpack SUCCESS (0:00:25.348) 
[INFO] 
[INFO] -------------------------------------------------------------------------------
[INFO] Test Summary (0:00:26.551)
[INFO]     Passed: 1
[INFO]     Failed: 0
[INFO] -------------------------------------------------------------------------------
[INFO] 
[INFO] [install:install]
[INFO] Installing http://ci.sonatype.org/job/plugins-IT-with-maven-2.0.x/org.apache.maven.plugins$maven-dependency-plugin/ws/target/maven-dependency-plugin-2.1-SNAPSHOT.jar
 to /home/j2ee-hudson/repos/maven-plugins/org/apache/maven/plugins/maven-dependency-plugin/2.1-SNAPSHOT/maven-dependency-plugin-2.1-SNAPSHOT.jar
[INFO] [plugin:updateRegistry]
[INFO] [deploy:deploy]
altDeploymentRepository = null
[INFO] Retrieving previous build number from apache.snapshots
[HUDSON] Archiving http://ci.sonatype.org/job/plugins-IT-with-maven-2.0.x/org.apache.maven.plugins$maven-dependency-plugin/ws/pom.xml
 to /home/j2ee-hudson/.hudson/jobs/plugins-IT-with-maven-2.0.x/modules/org.apache.maven.plugins$maven-dependency-plugin/builds/2008-10-15_06-25-07/archive/org.apache.maven.plugins/maven-dependency-plugin/2.1-SNAPSHOT/pom.xml
[HUDSON] Archiving http://ci.sonatype.org/job/plugins-IT-with-maven-2.0.x/org.apache.maven.plugins$maven-dependency-plugin/ws/target/maven-dependency-plugin-2.1-SNAPSHOT.jar
 to /home/j2ee-hudson/.hudson/jobs/plugins-IT-with-maven-2.0.x/modules/org.apache.maven.plugins$maven-dependency-plugin/builds/2008-10-15_06-25-07/archive/org.apache.maven.plugins/maven-dependency-plugin/2.1-SNAPSHOT/maven-dependency-plugin-2.1-SNAPSHOT.jar


Mime
View raw message