maven-notifications mailing list archives

Site index · List index
Message view « Date » · « Thread »
Top « Date » · « Thread »
From Hudson <Hud...@sonatype.org>
Subject Build failed in Hudson: maven-shared » Maven Shared I/O API #31
Date Sat, 11 Oct 2008 01:10:53 GMT
See http://ci.sonatype.org/job/maven-shared/org.apache.maven.shared$maven-shared-io/31/changes

------------------------------------------
[INFO] ------------------------------------------------------------------------
[INFO] Building Maven Shared I/O API
[INFO]    task-segment: [clean, deploy]
[INFO] ------------------------------------------------------------------------
[INFO] [clean:clean]
[INFO] Deleting directory http://ci.sonatype.org/job/maven-shared/org.apache.maven.shared$maven-shared-io/ws/target

[INFO] [remote-resources:process {execution: default}]
[INFO] [resources:resources]
[INFO] Using encoding: 'UTF-8' to copy filtered resources.
[INFO] [compiler:compile]
[INFO] Compiling 28 source files to http://ci.sonatype.org/job/maven-shared/org.apache.maven.shared$maven-shared-io/ws/target/classes

[INFO] [resources:testResources]
[INFO] Using encoding: 'UTF-8' to copy filtered resources.
[INFO] [compiler:testCompile]
[INFO] Compiling 14 source files to http://ci.sonatype.org/job/maven-shared/org.apache.maven.shared$maven-shared-io/ws/target/test-classes

[INFO] [surefire:test]
[INFO] Surefire report directory: http://ci.sonatype.org/job/maven-shared/org.apache.maven.shared$maven-shared-io/ws/target/surefire-reports


-------------------------------------------------------
 T E S T S
-------------------------------------------------------
Running org.apache.maven.shared.io.location.ArtifactLocatorStrategyTest
Tests run: 13, Failures: 0, Errors: 0, Skipped: 0, Time elapsed: 0.142 sec
Running org.apache.maven.shared.io.location.LocatorTest
Tests run: 7, Failures: 0, Errors: 0, Skipped: 0, Time elapsed: 0.009 sec
Running org.apache.maven.shared.io.logging.DefaultMessageHolderTest
Tests run: 14, Failures: 0, Errors: 0, Skipped: 0, Time elapsed: 0.013 sec
Running org.apache.maven.shared.io.download.DownloadFailedExceptionTest
Tests run: 3, Failures: 0, Errors: 0, Skipped: 0, Time elapsed: 0.004 sec
Running org.apache.maven.shared.io.location.FileLocatorStrategyTest
[1] [INFO] File: /tmp/file-locator.19658.test does not exist.
Tests run: 2, Failures: 0, Errors: 0, Skipped: 0, Time elapsed: 0.008 sec
Running org.apache.maven.shared.io.location.FileLocationTest
Tests run: 8, Failures: 0, Errors: 0, Skipped: 0, Time elapsed: 0.019 sec
Running org.apache.maven.shared.io.location.ClasspathResourceLocatorStrategyTest
Tests run: 4, Failures: 0, Errors: 0, Skipped: 0, Time elapsed: 0.005 sec
Running org.apache.maven.shared.io.scan.mapping.SuffixMappingTest
Tests run: 5, Failures: 0, Errors: 0, Skipped: 0, Time elapsed: 0.018 sec
Running org.apache.maven.shared.io.location.URLLocatorStrategyTest
Tests run: 4, Failures: 0, Errors: 0, Skipped: 0, Time elapsed: 0.009 sec
Running org.apache.maven.shared.io.download.DefaultDownloadManagerTest
Tests run: 14, Failures: 0, Errors: 0, Skipped: 0, Time elapsed: 0.756 sec
Running org.apache.maven.shared.io.location.URLLocationTest
Tests run: 3, Failures: 0, Errors: 0, Skipped: 0, Time elapsed: 0.003 sec
Running org.apache.maven.shared.io.location.ArtifactLocationTest
Tests run: 2, Failures: 0, Errors: 0, Skipped: 0, Time elapsed: 0.005 sec

Results :

Tests run: 79, Failures: 0, Errors: 0, Skipped: 0

[HUDSON] Recording test results
[INFO] [jar:jar]
[INFO] Building jar: http://ci.sonatype.org/job/maven-shared/org.apache.maven.shared$maven-shared-io/ws/target/maven-shared-io-1.2-SNAPSHOT.jar

[INFO] [install:install]
[INFO] Installing http://ci.sonatype.org/job/maven-shared/org.apache.maven.shared$maven-shared-io/ws/target/maven-shared-io-1.2-SNAPSHOT.jar
 to /home/hudson/repos/maven-shared/org/apache/maven/shared/maven-shared-io/1.2-SNAPSHOT/maven-shared-io-1.2-SNAPSHOT.jar
[INFO] [deploy:deploy]
altDeploymentRepository = null
[INFO] Retrieving previous build number from apache.snapshots
Uploading: http://repository.sonatype.org:8081/content/repositories/maven.snapshots/org/apache/maven/shared/maven-shared-io/1.2-SNAPSHOT/maven-shared-io-1.2-20081011.011037-607.jar
38K uploaded
[INFO] Retrieving previous metadata from apache.snapshots
[INFO] Uploading repository metadata for: 'snapshot org.apache.maven.shared:maven-shared-io:1.2-SNAPSHOT'
[INFO] Uploading project information for maven-shared-io 1.2-20081011.011037-607
[HUDSON] Archiving http://ci.sonatype.org/job/maven-shared/org.apache.maven.shared$maven-shared-io/ws/pom.xml
 to /home/hudson/.hudson/jobs/maven-shared/modules/org.apache.maven.shared$maven-shared-io/builds/2008-10-10_20-10-19/archive/org.apache.maven.shared/maven-shared-io/1.2-SNAPSHOT/pom.xml
[HUDSON] Archiving http://ci.sonatype.org/job/maven-shared/org.apache.maven.shared$maven-shared-io/ws/target/maven-shared-io-1.2-SNAPSHOT.jar
 to /home/hudson/.hudson/jobs/maven-shared/modules/org.apache.maven.shared$maven-shared-io/builds/2008-10-10_20-10-19/archive/org.apache.maven.shared/maven-shared-io/1.2-20081011.011037-607/maven-shared-io-1.2-SNAPSHOT.jar
[INFO] ------------------------------------------------------------------------
[ERROR] BUILD ERROR
[INFO] ------------------------------------------------------------------------
[INFO] Error installing artifact's metadata: Error while deploying metadata: Failed to transfer
file: http://repository.sonatype.org:8081/content/repositories/maven.snapshots/org/apache/maven/shared/maven-shared-io/1.2-SNAPSHOT/maven-shared-io-1.2-20081011.011037-607.pom.md5.
Return code is: 500

[INFO] ------------------------------------------------------------------------
[INFO] Trace
org.apache.maven.lifecycle.LifecycleExecutionException: Error installing artifact's metadata:
Error while deploying metadata: Failed to transfer file: http://repository.sonatype.org:8081/content/repositories/maven.snapshots/org/apache/maven/shared/maven-shared-io/1.2-SNAPSHOT/maven-shared-io-1.2-20081011.011037-607.pom.md5.
Return code is: 500
	at org.apache.maven.lifecycle.DefaultLifecycleExecutor.executeGoals(DefaultLifecycleExecutor.java:583)
	at org.apache.maven.lifecycle.DefaultLifecycleExecutor.executeGoalWithLifecycle(DefaultLifecycleExecutor.java:499)
	at org.apache.maven.lifecycle.DefaultLifecycleExecutor.executeGoal(DefaultLifecycleExecutor.java:478)
	at org.apache.maven.lifecycle.DefaultLifecycleExecutor.executeGoalAndHandleFailures(DefaultLifecycleExecutor.java:330)
	at org.apache.maven.lifecycle.DefaultLifecycleExecutor.executeTaskSegments(DefaultLifecycleExecutor.java:291)
	at org.apache.maven.lifecycle.DefaultLifecycleExecutor.execute(DefaultLifecycleExecutor.java:142)
	at org.apache.maven.lifecycle.LifecycleExecutorInterceptor.execute(LifecycleExecutorInterceptor.java:42)
	at org.apache.maven.DefaultMaven.doExecute(DefaultMaven.java:336)
	at org.apache.maven.DefaultMaven.execute(DefaultMaven.java:129)
	at org.apache.maven.cli.MavenCli.main(MavenCli.java:287)
	at sun.reflect.NativeMethodAccessorImpl.invoke0(Native Method)
	at sun.reflect.NativeMethodAccessorImpl.invoke(NativeMethodAccessorImpl.java:39)
	at sun.reflect.DelegatingMethodAccessorImpl.invoke(DelegatingMethodAccessorImpl.java:25)
	at java.lang.reflect.Method.invoke(Method.java:597)
	at org.codehaus.classworlds.Launcher.launchEnhanced(Launcher.java:315)
	at org.codehaus.classworlds.Launcher.launch(Launcher.java:255)
	at hudson.maven.agent.Main.launch(Main.java:133)
	at hudson.maven.MavenBuilder.call(MavenBuilder.java:139)
	at hudson.maven.MavenModuleSetBuild$Builder.call(MavenModuleSetBuild.java:543)
	at hudson.maven.MavenModuleSetBuild$Builder.call(MavenModuleSetBuild.java:489)
	at hudson.remoting.UserRequest.perform(UserRequest.java:69)
	at hudson.remoting.UserRequest.perform(UserRequest.java:23)
	at hudson.remoting.Request$2.run(Request.java:213)
	at java.util.concurrent.Executors$RunnableAdapter.call(Executors.java:441)
	at java.util.concurrent.FutureTask$Sync.innerRun(FutureTask.java:303)
	at java.util.concurrent.FutureTask.run(FutureTask.java:138)
	at java.util.concurrent.ThreadPoolExecutor$Worker.runTask(ThreadPoolExecutor.java:885)
	at java.util.concurrent.ThreadPoolExecutor$Worker.run(ThreadPoolExecutor.java:907)
	at java.lang.Thread.run(Thread.java:619)
Caused by: org.apache.maven.plugin.MojoExecutionException: Error installing artifact's metadata:
Error while deploying metadata: Failed to transfer file: http://repository.sonatype.org:8081/content/repositories/maven.snapshots/org/apache/maven/shared/maven-shared-io/1.2-SNAPSHOT/maven-shared-io-1.2-20081011.011037-607.pom.md5.
Return code is: 500
	at org.apache.maven.plugin.deploy.DeployMojo.execute(DeployMojo.java:174)
	at org.apache.maven.plugin.DefaultPluginManager.executeMojo(DefaultPluginManager.java:451)
	at hudson.maven.agent.PluginManagerInterceptor.executeMojo(PluginManagerInterceptor.java:159)
	at org.apache.maven.lifecycle.DefaultLifecycleExecutor.executeGoals(DefaultLifecycleExecutor.java:558)
	... 28 more
Caused by: org.apache.maven.artifact.deployer.ArtifactDeploymentException: Error installing
artifact's metadata: Error while deploying metadata: Failed to transfer file: http://repository.sonatype.org:8081/content/repositories/maven.snapshots/org/apache/maven/shared/maven-shared-io/1.2-SNAPSHOT/maven-shared-io-1.2-20081011.011037-607.pom.md5.
Return code is: 500
	at org.apache.maven.artifact.deployer.DefaultArtifactDeployer.deploy(DefaultArtifactDeployer.java:102)
	at org.apache.maven.plugin.deploy.DeployMojo.execute(DeployMojo.java:162)
	... 31 more
Caused by: org.apache.maven.artifact.repository.metadata.RepositoryMetadataDeploymentException:
Error while deploying metadata: Failed to transfer file: http://repository.sonatype.org:8081/content/repositories/maven.snapshots/org/apache/maven/shared/maven-shared-io/1.2-SNAPSHOT/maven-shared-io-1.2-20081011.011037-607.pom.md5.
Return code is: 500
	at org.apache.maven.artifact.repository.metadata.DefaultRepositoryMetadataManager.deploy(DefaultRepositoryMetadataManager.java:450)
	at org.apache.maven.artifact.deployer.DefaultArtifactDeployer.deploy(DefaultArtifactDeployer.java:86)
	... 32 more
Caused by: org.apache.maven.wagon.TransferFailedException: Failed to transfer file: http://repository.sonatype.org:8081/content/repositories/maven.snapshots/org/apache/maven/shared/maven-shared-io/1.2-SNAPSHOT/maven-shared-io-1.2-20081011.011037-607.pom.md5.
Return code is: 500
	at org.apache.maven.wagon.providers.http.LightweightHttpWagon.put(LightweightHttpWagon.java:172)
	at org.apache.maven.artifact.manager.DefaultWagonManager.putRemoteFile(DefaultWagonManager.java:266)
	at org.apache.maven.artifact.manager.DefaultWagonManager.putArtifactMetadata(DefaultWagonManager.java:169)
	at org.apache.maven.artifact.repository.metadata.DefaultRepositoryMetadataManager.deploy(DefaultRepositoryMetadataManager.java:446)
	... 33 more
[INFO] ------------------------------------------------------------------------
[INFO] Total time: 25 seconds
[INFO] Finished at: Fri Oct 10 20:10:52 CDT 2008
[INFO] Final Memory: 28M/154M
[INFO] ------------------------------------------------------------------------


Mime
View raw message