maven-notifications mailing list archives

Site index · List index
Message view « Date » · « Thread »
Top « Date » · « Thread »
From Hudson <Hud...@sonatype.org>
Subject Build failed in Hudson: maven-core-integration-testing » 1.5,ubuntu #6
Date Sun, 12 Oct 2008 21:01:51 GMT
See http://grid.sonatype.com:18080/job/maven-core-integration-testing/./jdk=1.5,label=ubuntu/6/changes

Changes:

[Benjamin Bentmann] o Rewrote it0114 to use pre-packaged extension and IT support plugin,
thereby eliminating dependency on production plugins and accelerating test by almost 10x

[Benjamin Bentmann] o Deleted it0111 which is superseded by it0114

------------------------------------------
started
Building remotely on orchestrator
Updating https://svn.apache.org/repos/asf/maven/core-integration-testing/trunk
D         core-it-suite/src/test/java/org/apache/maven/it/MavenIT0114ExtensionThatProvidesResources.java
D         core-it-suite/src/test/java/org/apache/maven/it/MavenIT0111PluginsThatRequireAResourceFromAnExtensionTest.java
U         core-it-suite/src/test/java/org/apache/maven/it/IntegrationTestSuite.java
AU        core-it-suite/src/test/java/org/apache/maven/it/MavenITmng2749Test.java
D         core-it-suite/src/test/resources/it0111-pluginThatRequiresResourceFromAnExtension
D         core-it-suite/src/test/resources/it0114-extensionThatProvidesResources
A         core-it-suite/src/test/resources/mng-2749
A         core-it-suite/src/test/resources/mng-2749/repo
A         core-it-suite/src/test/resources/mng-2749/repo/org
A         core-it-suite/src/test/resources/mng-2749/repo/org/apache
A         core-it-suite/src/test/resources/mng-2749/repo/org/apache/maven
A         core-it-suite/src/test/resources/mng-2749/repo/org/apache/maven/its
A         core-it-suite/src/test/resources/mng-2749/repo/org/apache/maven/its/mng2749
A         core-it-suite/src/test/resources/mng-2749/repo/org/apache/maven/its/mng2749/extension
AU        core-it-suite/src/test/resources/mng-2749/repo/org/apache/maven/its/mng2749/extension/maven-metadata.xml
A         core-it-suite/src/test/resources/mng-2749/repo/org/apache/maven/its/mng2749/extension/0.1
A         core-it-suite/src/test/resources/mng-2749/repo/org/apache/maven/its/mng2749/extension/0.1/extension-0.1.pom
AU        core-it-suite/src/test/resources/mng-2749/repo/org/apache/maven/its/mng2749/extension/0.1/extension-0.1.jar
AU        core-it-suite/src/test/resources/mng-2749/pom.xml
At revision 703874
[maven-its] $ mvn -Dlabel=ubuntu -Djdk=1.5 clean install -B -e
FATAL: command execution failed
java.io.IOException: Cannot run program "mvn" (in directory "http://grid.sonatype.com:18080/job/maven-core-integration-testing/./jdk=1.5,label=ubuntu/ws/maven-its")
: java.io.IOException: error=2, No such file or directory
	at java.lang.ProcessBuilder.start(ProcessBuilder.java:459)
	at hudson.Proc$LocalProc.<init>(Proc.java:104)
	at hudson.Proc$LocalProc.<init>(Proc.java:82)
	at hudson.Launcher$LocalLauncher.createLocalProc(Launcher.java:311)
	at hudson.Launcher$LocalLauncher.launch(Launcher.java:302)
	at hudson.Launcher$RemoteLaunchCallable.call(Launcher.java:417)
	at hudson.Launcher$RemoteLaunchCallable.call(Launcher.java:401)
	at hudson.remoting.UserRequest.perform(UserRequest.java:69)
	at hudson.remoting.UserRequest.perform(UserRequest.java:23)
	at hudson.remoting.Request$2.run(Request.java:213)
	at java.util.concurrent.Executors$RunnableAdapter.call(Executors.java:441)
	at java.util.concurrent.FutureTask$Sync.innerRun(FutureTask.java:303)
	at java.util.concurrent.FutureTask.run(FutureTask.java:138)
	at java.util.concurrent.ThreadPoolExecutor$Worker.runTask(ThreadPoolExecutor.java:885)
	at java.util.concurrent.ThreadPoolExecutor$Worker.run(ThreadPoolExecutor.java:907)
	at java.lang.Thread.run(Thread.java:619)
Caused by: java.io.IOException: java.io.IOException: error=2, No such file or directory
	at java.lang.UNIXProcess.<init>(UNIXProcess.java:148)
	at java.lang.ProcessImpl.start(ProcessImpl.java:65)
	at java.lang.ProcessBuilder.start(ProcessBuilder.java:452)
	... 15 more


Mime
View raw message