maven-notifications mailing list archives

Site index · List index
Message view « Date » · « Thread »
Top « Date » · « Thread »
From Hudson <Hud...@sonatype.org>
Subject Build failed in Hudson: maven-core-integration-testing #8
Date Sat, 11 Oct 2008 21:01:26 GMT
See http://ci.sonatype.org/job/maven-core-integration-testing/8/changes

Changes:

[Benjamin Bentmann] o Cured "Skipping (version ${maven.version} not in range (2.0.8,))" when
using -Dtest=

[Benjamin Bentmann] o Added IT for MNG-2892

[Benjamin Bentmann] o Added IT for MNG-1703

[Benjamin Bentmann] o Deleted it0089 which duplicates the intention of it0086
  (Checkstyle's PackageNamesLoader.loadModuleFactory() merely boils down to ClassLoader.getResource())

[Benjamin Bentmann] o Decoupled it0087 from production dependency

[Benjamin Bentmann] o Decoupled it0086 from production dependency

------------------------------------------
started
Updating https://svn.apache.org/repos/asf/maven/core-integration-testing/trunk
D         core-it-suite/src/test/java/org/apache/maven/it/MavenIT0089Test.java
U         core-it-suite/src/test/java/org/apache/maven/it/IntegrationTestSuite.java
AU        core-it-suite/src/test/java/org/apache/maven/it/MavenITmng1703Test.java
AU        core-it-suite/src/test/java/org/apache/maven/it/MavenITmng2892Test.java
U         core-it-suite/src/test/java/org/apache/maven/it/MavenIT0086Test.java
U         core-it-suite/src/test/java/org/apache/maven/it/MavenIT0087Test.java
D         core-it-suite/src/test/resources/it0089
A         core-it-suite/src/test/resources/mng-1703
A         core-it-suite/src/test/resources/mng-1703/child
A         core-it-suite/src/test/resources/mng-1703/child/repo
A         core-it-suite/src/test/resources/mng-1703/child/repo/org
A         core-it-suite/src/test/resources/mng-1703/child/repo/org/apache
A         core-it-suite/src/test/resources/mng-1703/child/repo/org/apache/maven
A         core-it-suite/src/test/resources/mng-1703/child/repo/org/apache/maven/its
A         core-it-suite/src/test/resources/mng-1703/child/repo/org/apache/maven/its/mng1703
A         core-it-suite/src/test/resources/mng-1703/child/repo/org/apache/maven/its/mng1703/dep
AU        core-it-suite/src/test/resources/mng-1703/child/repo/org/apache/maven/its/mng1703/dep/maven-metadata.xml
A         core-it-suite/src/test/resources/mng-1703/child/repo/org/apache/maven/its/mng1703/dep/0.1
AU        core-it-suite/src/test/resources/mng-1703/child/repo/org/apache/maven/its/mng1703/dep/0.1/dep-0.1.jar
A         core-it-suite/src/test/resources/mng-1703/child/repo/org/apache/maven/its/mng1703/dep/0.1/dep-0.1.pom
AU        core-it-suite/src/test/resources/mng-1703/child/pom.xml
AU        core-it-suite/src/test/resources/mng-1703/pom.xml
U         core-it-suite/src/test/resources/it0086/pom.xml
A         core-it-suite/src/test/resources/it0087/repo
A         core-it-suite/src/test/resources/it0087/repo/org
A         core-it-suite/src/test/resources/it0087/repo/org/apache
A         core-it-suite/src/test/resources/it0087/repo/org/apache/maven
A         core-it-suite/src/test/resources/it0087/repo/org/apache/maven/its
A         core-it-suite/src/test/resources/it0087/repo/org/apache/maven/its/it0087
A         core-it-suite/src/test/resources/it0087/repo/org/apache/maven/its/it0087/dep
A         core-it-suite/src/test/resources/it0087/repo/org/apache/maven/its/it0087/dep/1.3
A         core-it-suite/src/test/resources/it0087/repo/org/apache/maven/its/it0087/dep/1.3/dep-1.3.pom
AU        core-it-suite/src/test/resources/it0087/repo/org/apache/maven/its/it0087/dep/1.3/dep-1.3.jar
AU        core-it-suite/src/test/resources/it0087/repo/org/apache/maven/its/it0087/dep/maven-metadata.xml
U         core-it-suite/src/test/resources/it0087/pom.xml
U         core-it-suite/src/test/resources/bootstrap/pom.xml
A         core-it-suite/src/test/resources/mng-2892
A         core-it-suite/src/test/resources/mng-2892/repo
A         core-it-suite/src/test/resources/mng-2892/repo/org
A         core-it-suite/src/test/resources/mng-2892/repo/org/codehaus
A         core-it-suite/src/test/resources/mng-2892/repo/org/codehaus/plexus
A         core-it-suite/src/test/resources/mng-2892/repo/org/codehaus/plexus/plexus-utils
AU        core-it-suite/src/test/resources/mng-2892/repo/org/codehaus/plexus/plexus-utils/maven-metadata.xml
A         core-it-suite/src/test/resources/mng-2892/repo/org/codehaus/plexus/plexus-utils/0.1-stub
A         core-it-suite/src/test/resources/mng-2892/repo/org/codehaus/plexus/plexus-utils/0.1-stub/plexus-utils-0.1-stub.pom
AU        core-it-suite/src/test/resources/mng-2892/repo/org/codehaus/plexus/plexus-utils/0.1-stub/plexus-utils-0.1-stub.jar
AU        core-it-suite/src/test/resources/mng-2892/pom.xml
U         core-it-support/maven-it-helper/src/main/java/org/apache/maven/it/AbstractMavenIntegrationTestCase.java
At revision 703731
[maven-its] $ mvn clean deploy -B -U -e -Dmaven.repo.local=/home/hudson/repos/core-its
FATAL: command execution failed
java.io.IOException: Cannot run program "mvn" (in directory "http://ci.sonatype.org/job/maven-core-integration-testing/ws/maven-its")
: java.io.IOException: error=2, No such file or directory
	at java.lang.ProcessBuilder.start(ProcessBuilder.java:459)
	at hudson.Proc$LocalProc.<init>(Proc.java:104)
	at hudson.Proc$LocalProc.<init>(Proc.java:82)
	at hudson.Launcher$LocalLauncher.createLocalProc(Launcher.java:311)
	at hudson.Launcher$LocalLauncher.launch(Launcher.java:302)
	at hudson.Launcher.launch(Launcher.java:140)
	at hudson.Launcher.launch(Launcher.java:92)
	at hudson.tasks.Maven.perform(Maven.java:184)
	at hudson.model.Build$RunnerImpl.build(Build.java:138)
	at hudson.model.Build$RunnerImpl.doRun(Build.java:113)
	at hudson.model.AbstractBuild$AbstractRunner.run(AbstractBuild.java:240)
	at hudson.model.Run.run(Run.java:793)
	at hudson.model.Build.run(Build.java:88)
	at hudson.model.ResourceController.execute(ResourceController.java:70)
	at hudson.model.Executor.run(Executor.java:88)
Caused by: java.io.IOException: java.io.IOException: error=2, No such file or directory
	at java.lang.UNIXProcess.<init>(UNIXProcess.java:148)
	at java.lang.ProcessImpl.start(ProcessImpl.java:65)
	at java.lang.ProcessBuilder.start(ProcessBuilder.java:452)
	... 14 more


Mime
View raw message