maven-notifications mailing list archives

Site index · List index
Message view « Date » · « Thread »
Top « Date » · « Thread »
From Hudson <Hud...@sonatype.org>
Subject Build failed in Hudson: maven-core-integration-testing #11
Date Sun, 12 Oct 2008 21:02:35 GMT
See http://ci.sonatype.org/job/maven-core-integration-testing/11/changes

Changes:

[Benjamin Bentmann] o Rewrote it0114 to use pre-packaged extension and IT support plugin,
thereby eliminating dependency on production plugins and accelerating test by almost 10x

[Benjamin Bentmann] o Deleted it0111 which is superseded by it0114

------------------------------------------
started
Updating https://svn.apache.org/repos/asf/maven/core-integration-testing/trunk
D         core-it-suite/src/test/java/org/apache/maven/it/MavenIT0114ExtensionThatProvidesResources.java
D         core-it-suite/src/test/java/org/apache/maven/it/MavenIT0111PluginsThatRequireAResourceFromAnExtensionTest.java
U         core-it-suite/src/test/java/org/apache/maven/it/IntegrationTestSuite.java
AU        core-it-suite/src/test/java/org/apache/maven/it/MavenITmng2749Test.java
D         core-it-suite/src/test/resources/it0111-pluginThatRequiresResourceFromAnExtension
D         core-it-suite/src/test/resources/it0114-extensionThatProvidesResources
A         core-it-suite/src/test/resources/mng-2749
A         core-it-suite/src/test/resources/mng-2749/repo
A         core-it-suite/src/test/resources/mng-2749/repo/org
A         core-it-suite/src/test/resources/mng-2749/repo/org/apache
A         core-it-suite/src/test/resources/mng-2749/repo/org/apache/maven
A         core-it-suite/src/test/resources/mng-2749/repo/org/apache/maven/its
A         core-it-suite/src/test/resources/mng-2749/repo/org/apache/maven/its/mng2749
A         core-it-suite/src/test/resources/mng-2749/repo/org/apache/maven/its/mng2749/extension
AU        core-it-suite/src/test/resources/mng-2749/repo/org/apache/maven/its/mng2749/extension/maven-metadata.xml
A         core-it-suite/src/test/resources/mng-2749/repo/org/apache/maven/its/mng2749/extension/0.1
A         core-it-suite/src/test/resources/mng-2749/repo/org/apache/maven/its/mng2749/extension/0.1/extension-0.1.pom
AU        core-it-suite/src/test/resources/mng-2749/repo/org/apache/maven/its/mng2749/extension/0.1/extension-0.1.jar
AU        core-it-suite/src/test/resources/mng-2749/pom.xml
At revision 703874
[maven-its] $ mvn clean deploy -B -U -e -Dmaven.repo.local=/home/hudson/repos/core-its
FATAL: command execution failed
java.io.IOException: Cannot run program "mvn" (in directory "http://ci.sonatype.org/job/maven-core-integration-testing/ws/maven-its")
: java.io.IOException: error=2, No such file or directory
	at java.lang.ProcessBuilder.start(ProcessBuilder.java:459)
	at hudson.Proc$LocalProc.<init>(Proc.java:104)
	at hudson.Proc$LocalProc.<init>(Proc.java:82)
	at hudson.Launcher$LocalLauncher.createLocalProc(Launcher.java:311)
	at hudson.Launcher$LocalLauncher.launch(Launcher.java:302)
	at hudson.Launcher.launch(Launcher.java:140)
	at hudson.Launcher.launch(Launcher.java:92)
	at hudson.tasks.Maven.perform(Maven.java:184)
	at hudson.model.Build$RunnerImpl.build(Build.java:138)
	at hudson.model.Build$RunnerImpl.doRun(Build.java:113)
	at hudson.model.AbstractBuild$AbstractRunner.run(AbstractBuild.java:240)
	at hudson.model.Run.run(Run.java:793)
	at hudson.model.Build.run(Build.java:88)
	at hudson.model.ResourceController.execute(ResourceController.java:70)
	at hudson.model.Executor.run(Executor.java:88)
Caused by: java.io.IOException: java.io.IOException: error=2, No such file or directory
	at java.lang.UNIXProcess.<init>(UNIXProcess.java:148)
	at java.lang.ProcessImpl.start(ProcessImpl.java:65)
	at java.lang.ProcessBuilder.start(ProcessBuilder.java:452)
	... 14 more


Mime
View raw message