maven-notifications mailing list archives

Site index · List index
Message view « Date » · « Thread »
Top « Date » · « Thread »
From Hudson <Hud...@sonatype.org>
Subject Build failed in Hudson: maven-core-integration-testing » 1.5,ubuntu #5
Date Sun, 12 Oct 2008 17:02:59 GMT
See http://grid.sonatype.com:18080/job/maven-core-integration-testing/./jdk=1.5,label=ubuntu/5/changes

Changes:

[Benjamin Bentmann] o Added IT for MNG-3271

[Benjamin Bentmann] o Added IT for MNG-1999

[Benjamin Bentmann] o Added new IT plugin to check ${reports} handling

------------------------------------------
started
Building remotely on orchestrator
Updating https://svn.apache.org/repos/asf/maven/core-integration-testing/trunk
AU        core-it-suite/src/test/java/org/apache/maven/it/MavenITmng3271Test.java
U         core-it-suite/src/test/java/org/apache/maven/it/IntegrationTestSuite.java
AU        core-it-suite/src/test/java/org/apache/maven/it/MavenITmng1999Test.java
U         core-it-suite/src/test/resources/bootstrap/pom.xml
A         core-it-suite/src/test/resources/mng-3271
AU        core-it-suite/src/test/resources/mng-3271/pom.xml
A         core-it-suite/src/test/resources/mng-1999
A         core-it-suite/src/test/resources/mng-1999/child
AU        core-it-suite/src/test/resources/mng-1999/child/pom.xml
AU        core-it-suite/src/test/resources/mng-1999/pom.xml
U         core-it-support/core-it-plugins/pom.xml
A         core-it-support/core-it-plugins/maven-it-plugin-site
A         core-it-support/core-it-plugins/maven-it-plugin-site/src
A         core-it-support/core-it-plugins/maven-it-plugin-site/src/main
A         core-it-support/core-it-plugins/maven-it-plugin-site/src/main/java
A         core-it-support/core-it-plugins/maven-it-plugin-site/src/main/java/org
A         core-it-support/core-it-plugins/maven-it-plugin-site/src/main/java/org/apache
A         core-it-support/core-it-plugins/maven-it-plugin-site/src/main/java/org/apache/maven
A         core-it-support/core-it-plugins/maven-it-plugin-site/src/main/java/org/apache/maven/plugin
A         core-it-support/core-it-plugins/maven-it-plugin-site/src/main/java/org/apache/maven/plugin/coreit
AU        core-it-support/core-it-plugins/maven-it-plugin-site/src/main/java/org/apache/maven/plugin/coreit/ListMojo.java
AU        core-it-support/core-it-plugins/maven-it-plugin-site/pom.xml
At revision 703846
[maven-its] $ mvn -Dlabel=ubuntu -Djdk=1.5 clean install -B -e
FATAL: command execution failed
java.io.IOException: Cannot run program "mvn" (in directory "http://grid.sonatype.com:18080/job/maven-core-integration-testing/./jdk=1.5,label=ubuntu/ws/maven-its")
: java.io.IOException: error=2, No such file or directory
	at java.lang.ProcessBuilder.start(ProcessBuilder.java:459)
	at hudson.Proc$LocalProc.<init>(Proc.java:104)
	at hudson.Proc$LocalProc.<init>(Proc.java:82)
	at hudson.Launcher$LocalLauncher.createLocalProc(Launcher.java:311)
	at hudson.Launcher$LocalLauncher.launch(Launcher.java:302)
	at hudson.Launcher$RemoteLaunchCallable.call(Launcher.java:417)
	at hudson.Launcher$RemoteLaunchCallable.call(Launcher.java:401)
	at hudson.remoting.UserRequest.perform(UserRequest.java:69)
	at hudson.remoting.UserRequest.perform(UserRequest.java:23)
	at hudson.remoting.Request$2.run(Request.java:213)
	at java.util.concurrent.Executors$RunnableAdapter.call(Executors.java:441)
	at java.util.concurrent.FutureTask$Sync.innerRun(FutureTask.java:303)
	at java.util.concurrent.FutureTask.run(FutureTask.java:138)
	at java.util.concurrent.ThreadPoolExecutor$Worker.runTask(ThreadPoolExecutor.java:885)
	at java.util.concurrent.ThreadPoolExecutor$Worker.run(ThreadPoolExecutor.java:907)
	at java.lang.Thread.run(Thread.java:619)
Caused by: java.io.IOException: java.io.IOException: error=2, No such file or directory
	at java.lang.UNIXProcess.<init>(UNIXProcess.java:148)
	at java.lang.ProcessImpl.start(ProcessImpl.java:65)
	at java.lang.ProcessBuilder.start(ProcessBuilder.java:452)
	... 15 more


Mime
View raw message