maven-notifications mailing list archives

Site index · List index
Message view « Date » · « Thread »
Top « Date » · « Thread »
From Hudson <Hud...@sonatype.org>
Subject Build failed in Hudson: plugins-IT-with-maven-2.0.x » Maven WAR Plugin #539
Date Wed, 15 Oct 2008 06:03:34 GMT
See http://ci.sonatype.org/job/plugins-IT-with-maven-2.0.x/org.apache.maven.plugins$maven-war-plugin/539/changes

------------------------------------------
[...truncated 428 lines...]
[INFO] Exploding webapp
[INFO] Assembling webapp[maven-war-plugin-test] in [http://ci.sonatype.org/job/plugins-IT-with-maven-2.0.x/org.apache.maven.plugins$maven-war-plugin/ws/target/test-classes/unit/dependenciesanalysis/test-dir/dependency-now-provided]

[INFO] Processing war project
[INFO] Copying webapp resources[http://ci.sonatype.org/job/plugins-IT-with-maven-2.0.x/org.apache.maven.plugins$maven-war-plugin/ws/target/test-classes/unit/dependenciesanalysis/test-dir/dependency-now-provided-test-data/source]

[INFO] Webapp assembled in[24 msecs]
[INFO] Exploding webapp
[INFO] Assembling webapp[maven-war-plugin-test] in [http://ci.sonatype.org/job/plugins-IT-with-maven-2.0.x/org.apache.maven.plugins$maven-war-plugin/ws/target/test-classes/unit/dependenciesanalysis/test-dir/dependency-now-provided]

[INFO] Scope of dependency[Dependency {groupId=org.sample.jar, artifactId=lib-test, version=1.0,
type=jar}] has changed (runtime -> provided).
[INFO] Processing war project
[INFO] Copying webapp resources[http://ci.sonatype.org/job/plugins-IT-with-maven-2.0.x/org.apache.maven.plugins$maven-war-plugin/ws/target/test-classes/unit/dependenciesanalysis/test-dir/dependency-now-provided-test-data/source]

[INFO] Webapp assembled in[9 msecs]
Tests run: 4, Failures: 0, Errors: 0, Skipped: 0, Time elapsed: 0.535 sec

Results :

Tests run: 75, Failures: 0, Errors: 0, Skipped: 0

[HUDSON] Recording test results
[INFO] [jar:jar]
[INFO] Building jar: http://ci.sonatype.org/job/plugins-IT-with-maven-2.0.x/org.apache.maven.plugins$maven-war-plugin/ws/target/maven-war-plugin-2.1-beta-1-SNAPSHOT.jar

[INFO] [plugin:addPluginArtifactMetadata]
[INFO] [invoker:install {execution: integration-test}]
[INFO] Installing http://ci.sonatype.org/job/plugins-IT-with-maven-2.0.x/org.apache.maven.plugins$maven-war-plugin/ws/pom.xml
 to http://ci.sonatype.org/job/plugins-IT-with-maven-2.0.x/org.apache.maven.plugins$maven-war-plugin/ws/target/local-repo/org/apache/maven/plugins/maven-war-plugin/2.1-beta-1-SNAPSHOT/maven-war-plugin-2.1-beta-1-SNAPSHOT.pom

[INFO] Installing http://ci.sonatype.org/job/plugins-IT-with-maven-2.0.x/org.apache.maven.plugins$maven-war-plugin/ws/target/maven-war-plugin-2.1-beta-1-SNAPSHOT.jar
 to http://ci.sonatype.org/job/plugins-IT-with-maven-2.0.x/org.apache.maven.plugins$maven-war-plugin/ws/target/local-repo/org/apache/maven/plugins/maven-war-plugin/2.1-beta-1-SNAPSHOT/maven-war-plugin-2.1-beta-1-SNAPSHOT.jar

[INFO] [invoker:run {execution: integration-test}]
[INFO] Building: MWAR-96/pom.xml
[INFO] ...SUCCESS.
[INFO] Building: simple-war-no-webxml/pom.xml
[INFO] ...SUCCESS.
[INFO] Building: MWAR-131/pom.xml
[INFO] ...SUCCESS.
[INFO] Building: MWAR-129/pom.xml
[INFO] ...SUCCESS.
[INFO] Building: web-resources-filtering/pom.xml
[INFO] ...FAILED[code=1]. See http://ci.sonatype.org/job/plugins-IT-with-maven-2.0.x/org.apache.maven.plugins$maven-war-plugin/ws/target/it/web-resources-filtering/build.log
 for details.
[INFO] Building: MWAR-143/pom.xml
[INFO] ...SUCCESS.
[INFO] Building: default/pom.xml
[INFO] ...SUCCESS.
[INFO] Building: MWAR-62/pom.xml
[INFO] ...SUCCESS.
[INFO] Building: scoped-dependency-same-artifact/pom.xml
[INFO] ...SUCCESS.
[INFO] Building: MWAR-139/pom.xml
[INFO] ...SUCCESS.
[INFO] Building: simple-war-project/pom.xml
[INFO] ...SUCCESS.
[INFO] Building: MWAR-133/pom.xml
[INFO] ...SUCCESS.
[INFO] 

---------------------------------------
Execution Summary:
Builds Passing: 11
Builds Failing: 1
---------------------------------------

The following builds failed:

*  web-resources-filtering/pom.xml

[HUDSON] Archiving http://ci.sonatype.org/job/plugins-IT-with-maven-2.0.x/org.apache.maven.plugins$maven-war-plugin/ws/pom.xml
 to /home/j2ee-hudson/.hudson/jobs/plugins-IT-with-maven-2.0.x/modules/org.apache.maven.plugins$maven-war-plugin/builds/2008-10-15_00-18-24/archive/org.apache.maven.plugins/maven-war-plugin/2.1-beta-1-SNAPSHOT/pom.xml
[HUDSON] Archiving http://ci.sonatype.org/job/plugins-IT-with-maven-2.0.x/org.apache.maven.plugins$maven-war-plugin/ws/target/maven-war-plugin-2.1-beta-1-SNAPSHOT.jar
 to /home/j2ee-hudson/.hudson/jobs/plugins-IT-with-maven-2.0.x/modules/org.apache.maven.plugins$maven-war-plugin/builds/2008-10-15_00-18-24/archive/org.apache.maven.plugins/maven-war-plugin/2.1-beta-1-SNAPSHOT/maven-war-plugin-2.1-beta-1-SNAPSHOT.jar
[INFO] 
[INFO] 
[INFO] ------------------------------------------------------------------------
[INFO] Reactor Summary:
[INFO] ------------------------------------------------------------------------
[INFO] Maven Plugins ......................................... SUCCESS [16.345s]
[INFO] Maven Remote Resources Plugin ......................... SUCCESS [17.706s]
[INFO] Maven Invoker Plugin .................................. SUCCESS [3:57.130s]
[INFO] Maven Ant Plugin ...................................... SUCCESS [1:27.585s]
[INFO] Maven AntRun Plugin ................................... FAILED [46.501s]
[INFO] Maven Assembly Plugin ................................. SUCCESS [13:25.639s]
[INFO] Maven Changelog Plugin ................................ SUCCESS [30.603s]
[INFO] Maven Changes Report Plugin ........................... SUCCESS [13.379s]
[INFO] Maven Checkstyle Plugin ............................... SUCCESS [49.467s]
[INFO] Maven Clean Plugin .................................... SUCCESS [28.540s]
[INFO] Maven Compiler Plugin ................................. SUCCESS [27.234s]
[INFO] Maven Dependency Plugin ............................... SUCCESS [1:18.440s]
[INFO] Maven Deploy Plugin ................................... SUCCESS [12.557s]
[INFO] Maven DOAP Plugin ..................................... SKIPPED (dependency build failed
or was skipped)
[INFO] Maven Documentation Checker Plugin .................... SKIPPED (dependency build failed
or was skipped)
[INFO] Maven EAR Plugin ...................................... SUCCESS [2:22.695s]
[INFO] Maven Eclipse Plugin .................................. SUCCESS [8:16.199s]
[INFO] Maven EJB Plugin ...................................... SUCCESS [11.980s]
[INFO] Maven GPG Plugin ...................................... SKIPPED (dependency build failed
or was skipped)
[INFO] Maven Help Plugin ..................................... SKIPPED (dependency build failed
or was skipped)
[INFO] Maven IDEA Plugin ..................................... SKIPPED (dependency build failed
or was skipped)
[INFO] Maven Install Plugin .................................. SKIPPED (dependency build failed
or was skipped)
[INFO] Maven Javadoc Plugin .................................. SUCCESS [2:42.533s]
[INFO] Maven JAR Plugin ...................................... SUCCESS [2:03.686s]
[INFO] Maven Linkcheck Plugin ................................ SKIPPED (dependency build failed
or was skipped)
[INFO] Maven One Plugin ...................................... SKIPPED (dependency build failed
or was skipped)
[INFO] Maven Patch Plugin .................................... SUCCESS [22.692s]
[INFO] Maven PMD Plugin ...................................... SKIPPED (dependency build failed
or was skipped)
[INFO] Maven RAR Plugin ...................................... SUCCESS [10.001s]
[INFO] Maven Reactor Plugin .................................. SUCCESS [6.085s]
[INFO] Maven Repository Plugin ............................... SKIPPED (dependency build failed
or was skipped)
[INFO] Maven Resources Plugin ................................ FAILED [58.815s]
[INFO] Maven Shade Plugin .................................... SKIPPED (dependency build failed
or was skipped)
[INFO] Maven Site Plugin ..................................... SUCCESS [1:02.584s]
[INFO] Maven Source Plugin ................................... SUCCESS [17.481s]
[INFO] Maven Stage Plugin .................................... SKIPPED (dependency build failed
or was skipped)
[INFO] Maven Toolchains Plugin ............................... SKIPPED (dependency build failed
or was skipped)
[INFO] Maven Verifier Plugin ................................. SUCCESS [13.212s]
[INFO] Maven WAR Plugin ...................................... FAILED [1:35.714s]
[INFO] ------------------------------------------------------------------------
[INFO] Error for project: Maven AntRun Plugin (during deploy)
[INFO] ------------------------------------------------------------------------
[INFO] : org.apache.maven.plugin.invoker.InvokerMojo@24fa3073
1 builds failed.

1 builds failed.
[INFO] ------------------------------------------------------------------------
[INFO] Trace
org.apache.maven.BuildFailureException: 1 builds failed.
	at org.apache.maven.lifecycle.DefaultLifecycleExecutor.executeGoals(DefaultLifecycleExecutor.java:579)
	at org.apache.maven.lifecycle.DefaultLifecycleExecutor.executeGoalWithLifecycle(DefaultLifecycleExecutor.java:499)
	at org.apache.maven.lifecycle.DefaultLifecycleExecutor.executeGoal(DefaultLifecycleExecutor.java:478)
	at org.apache.maven.lifecycle.DefaultLifecycleExecutor.executeGoalAndHandleFailures(DefaultLifecycleExecutor.java:330)
	at org.apache.maven.lifecycle.DefaultLifecycleExecutor.executeTaskSegments(DefaultLifecycleExecutor.java:291)
	at org.apache.maven.lifecycle.DefaultLifecycleExecutor.execute(DefaultLifecycleExecutor.java:142)
	at org.apache.maven.lifecycle.LifecycleExecutorInterceptor.execute(LifecycleExecutorInterceptor.java:42)
	at org.apache.maven.DefaultMaven.doExecute(DefaultMaven.java:336)
	at org.apache.maven.DefaultMaven.execute(DefaultMaven.java:129)
	at org.apache.maven.cli.MavenCli.main(MavenCli.java:287)
	at sun.reflect.NativeMethodAccessorImpl.invoke0(Native Method)
	at sun.reflect.NativeMethodAccessorImpl.invoke(NativeMethodAccessorImpl.java:39)
	at sun.reflect.DelegatingMethodAccessorImpl.invoke(DelegatingMethodAccessorImpl.java:25)
	at java.lang.reflect.Method.invoke(Method.java:585)
	at org.codehaus.classworlds.Launcher.launchEnhanced(Launcher.java:315)
	at org.codehaus.classworlds.Launcher.launch(Launcher.java:255)
	at hudson.maven.agent.Main.launch(Main.java:133)
	at hudson.maven.MavenBuilder.call(MavenBuilder.java:139)
	at hudson.maven.MavenModuleSetBuild$Builder.call(MavenModuleSetBuild.java:543)
	at hudson.maven.MavenModuleSetBuild$Builder.call(MavenModuleSetBuild.java:489)
	at hudson.remoting.UserRequest.perform(UserRequest.java:69)
	at hudson.remoting.UserRequest.perform(UserRequest.java:23)
	at hudson.remoting.Request$2.run(Request.java:213)
	at java.util.concurrent.Executors$RunnableAdapter.call(Executors.java:417)
	at java.util.concurrent.FutureTask$Sync.innerRun(FutureTask.java:269)
	at java.util.concurrent.FutureTask.run(FutureTask.java:123)
	at java.util.concurrent.ThreadPoolExecutor$Worker.runTask(ThreadPoolExecutor.java:650)
	at java.util.concurrent.ThreadPoolExecutor$Worker.run(ThreadPoolExecutor.java:675)
	at java.lang.Thread.run(Thread.java:595)
Caused by: org.apache.maven.plugin.MojoFailureException: 1 builds failed.
	at org.apache.maven.plugin.invoker.InvokerMojo.execute(InvokerMojo.java:493)
	at org.apache.maven.plugin.DefaultPluginManager.executeMojo(DefaultPluginManager.java:451)
	at hudson.maven.agent.PluginManagerInterceptor.executeMojo(PluginManagerInterceptor.java:159)
	at org.apache.maven.lifecycle.DefaultLifecycleExecutor.executeGoals(DefaultLifecycleExecutor.java:558)
	... 28 more
[INFO] ------------------------------------------------------------------------
[INFO] Error for project: Maven Resources Plugin (during deploy)
[INFO] ------------------------------------------------------------------------
[INFO] : org.apache.maven.plugin.invoker.InvokerMojo@6c5c4442
1 builds failed.

1 builds failed.
[INFO] ------------------------------------------------------------------------
[INFO] Trace
org.apache.maven.BuildFailureException: 1 builds failed.
	at org.apache.maven.lifecycle.DefaultLifecycleExecutor.executeGoals(DefaultLifecycleExecutor.java:579)
	at org.apache.maven.lifecycle.DefaultLifecycleExecutor.executeGoalWithLifecycle(DefaultLifecycleExecutor.java:499)
	at org.apache.maven.lifecycle.DefaultLifecycleExecutor.executeGoal(DefaultLifecycleExecutor.java:478)
	at org.apache.maven.lifecycle.DefaultLifecycleExecutor.executeGoalAndHandleFailures(DefaultLifecycleExecutor.java:330)
	at org.apache.maven.lifecycle.DefaultLifecycleExecutor.executeTaskSegments(DefaultLifecycleExecutor.java:291)
	at org.apache.maven.lifecycle.DefaultLifecycleExecutor.execute(DefaultLifecycleExecutor.java:142)
	at org.apache.maven.lifecycle.LifecycleExecutorInterceptor.execute(LifecycleExecutorInterceptor.java:42)
	at org.apache.maven.DefaultMaven.doExecute(DefaultMaven.java:336)
	at org.apache.maven.DefaultMaven.execute(DefaultMaven.java:129)
	at org.apache.maven.cli.MavenCli.main(MavenCli.java:287)
	at sun.reflect.NativeMethodAccessorImpl.invoke0(Native Method)
	at sun.reflect.NativeMethodAccessorImpl.invoke(NativeMethodAccessorImpl.java:39)
	at sun.reflect.DelegatingMethodAccessorImpl.invoke(DelegatingMethodAccessorImpl.java:25)
	at java.lang.reflect.Method.invoke(Method.java:585)
	at org.codehaus.classworlds.Launcher.launchEnhanced(Launcher.java:315)
	at org.codehaus.classworlds.Launcher.launch(Launcher.java:255)
	at hudson.maven.agent.Main.launch(Main.java:133)
	at hudson.maven.MavenBuilder.call(MavenBuilder.java:139)
	at hudson.maven.MavenModuleSetBuild$Builder.call(MavenModuleSetBuild.java:543)
	at hudson.maven.MavenModuleSetBuild$Builder.call(MavenModuleSetBuild.java:489)
	at hudson.remoting.UserRequest.perform(UserRequest.java:69)
	at hudson.remoting.UserRequest.perform(UserRequest.java:23)
	at hudson.remoting.Request$2.run(Request.java:213)
	at java.util.concurrent.Executors$RunnableAdapter.call(Executors.java:417)
	at java.util.concurrent.FutureTask$Sync.innerRun(FutureTask.java:269)
	at java.util.concurrent.FutureTask.run(FutureTask.java:123)
	at java.util.concurrent.ThreadPoolExecutor$Worker.runTask(ThreadPoolExecutor.java:650)
	at java.util.concurrent.ThreadPoolExecutor$Worker.run(ThreadPoolExecutor.java:675)
	at java.lang.Thread.run(Thread.java:595)
Caused by: org.apache.maven.plugin.MojoFailureException: 1 builds failed.
	at org.apache.maven.plugin.invoker.InvokerMojo.execute(InvokerMojo.java:493)
	at org.apache.maven.plugin.DefaultPluginManager.executeMojo(DefaultPluginManager.java:451)
	at hudson.maven.agent.PluginManagerInterceptor.executeMojo(PluginManagerInterceptor.java:159)
	at org.apache.maven.lifecycle.DefaultLifecycleExecutor.executeGoals(DefaultLifecycleExecutor.java:558)
	... 28 more
[INFO] ------------------------------------------------------------------------
[INFO] Error for project: Maven WAR Plugin (during deploy)
[INFO] ------------------------------------------------------------------------
[INFO] : org.apache.maven.plugin.invoker.InvokerMojo@47e25269
1 builds failed.

1 builds failed.
[INFO] ------------------------------------------------------------------------
[INFO] Trace
org.apache.maven.BuildFailureException: 1 builds failed.
	at org.apache.maven.lifecycle.DefaultLifecycleExecutor.executeGoals(DefaultLifecycleExecutor.java:579)
	at org.apache.maven.lifecycle.DefaultLifecycleExecutor.executeGoalWithLifecycle(DefaultLifecycleExecutor.java:499)
	at org.apache.maven.lifecycle.DefaultLifecycleExecutor.executeGoal(DefaultLifecycleExecutor.java:478)
	at org.apache.maven.lifecycle.DefaultLifecycleExecutor.executeGoalAndHandleFailures(DefaultLifecycleExecutor.java:330)
	at org.apache.maven.lifecycle.DefaultLifecycleExecutor.executeTaskSegments(DefaultLifecycleExecutor.java:291)
	at org.apache.maven.lifecycle.DefaultLifecycleExecutor.execute(DefaultLifecycleExecutor.java:142)
	at org.apache.maven.lifecycle.LifecycleExecutorInterceptor.execute(LifecycleExecutorInterceptor.java:42)
	at org.apache.maven.DefaultMaven.doExecute(DefaultMaven.java:336)
	at org.apache.maven.DefaultMaven.execute(DefaultMaven.java:129)
	at org.apache.maven.cli.MavenCli.main(MavenCli.java:287)
	at sun.reflect.NativeMethodAccessorImpl.invoke0(Native Method)
	at sun.reflect.NativeMethodAccessorImpl.invoke(NativeMethodAccessorImpl.java:39)
	at sun.reflect.DelegatingMethodAccessorImpl.invoke(DelegatingMethodAccessorImpl.java:25)
	at java.lang.reflect.Method.invoke(Method.java:585)
	at org.codehaus.classworlds.Launcher.launchEnhanced(Launcher.java:315)
	at org.codehaus.classworlds.Launcher.launch(Launcher.java:255)
	at hudson.maven.agent.Main.launch(Main.java:133)
	at hudson.maven.MavenBuilder.call(MavenBuilder.java:139)
	at hudson.maven.MavenModuleSetBuild$Builder.call(MavenModuleSetBuild.java:543)
	at hudson.maven.MavenModuleSetBuild$Builder.call(MavenModuleSetBuild.java:489)
	at hudson.remoting.UserRequest.perform(UserRequest.java:69)
	at hudson.remoting.UserRequest.perform(UserRequest.java:23)
	at hudson.remoting.Request$2.run(Request.java:213)
	at java.util.concurrent.Executors$RunnableAdapter.call(Executors.java:417)
	at java.util.concurrent.FutureTask$Sync.innerRun(FutureTask.java:269)
	at java.util.concurrent.FutureTask.run(FutureTask.java:123)
	at java.util.concurrent.ThreadPoolExecutor$Worker.runTask(ThreadPoolExecutor.java:650)
	at java.util.concurrent.ThreadPoolExecutor$Worker.run(ThreadPoolExecutor.java:675)
	at java.lang.Thread.run(Thread.java:595)
Caused by: org.apache.maven.plugin.MojoFailureException: 1 builds failed.
	at org.apache.maven.plugin.invoker.InvokerMojo.execute(InvokerMojo.java:493)
	at org.apache.maven.plugin.DefaultPluginManager.executeMojo(DefaultPluginManager.java:451)
	at hudson.maven.agent.PluginManagerInterceptor.executeMojo(PluginManagerInterceptor.java:159)
	at org.apache.maven.lifecycle.DefaultLifecycleExecutor.executeGoals(DefaultLifecycleExecutor.java:558)
	... 28 more
[INFO] ------------------------------------------------------------------------
[INFO] BUILD ERRORS
[INFO] ------------------------------------------------------------------------
[INFO] Total time: 44 minutes 58 seconds
[INFO] Finished at: Wed Oct 15 01:03:29 CDT 2008
[INFO] Final Memory: 107M/273M
[INFO] ------------------------------------------------------------------------


Mime
View raw message