maven-notifications mailing list archives

Site index · List index
Message view « Date » · « Thread »
Top « Date » · « Thread »
From Hudson <Hud...@sonatype.org>
Subject Build failed in Hudson: plugins-IT-with-maven-2.0.x » Maven WAR Plugin #506
Date Fri, 03 Oct 2008 06:11:04 GMT
See http://ci.sonatype.org/job/plugins-IT-with-maven-2.0.x/org.apache.maven.plugins$maven-war-plugin/506/changes

------------------------------------------
[...truncated 441 lines...]
Results :

Tests run: 75, Failures: 0, Errors: 0, Skipped: 0

[HUDSON] Recording test results
[INFO] [jar:jar]
[INFO] Building jar: http://ci.sonatype.org/job/plugins-IT-with-maven-2.0.x/org.apache.maven.plugins$maven-war-plugin/ws/target/maven-war-plugin-2.1-beta-1-SNAPSHOT.jar

[INFO] [plugin:addPluginArtifactMetadata]
[INFO] [invoker:install {execution: integration-test}]
[INFO] Installing http://ci.sonatype.org/job/plugins-IT-with-maven-2.0.x/org.apache.maven.plugins$maven-war-plugin/ws/pom.xml
 to http://ci.sonatype.org/job/plugins-IT-with-maven-2.0.x/org.apache.maven.plugins$maven-war-plugin/ws/target/local-repo/org/apache/maven/plugins/maven-war-plugin/2.1-beta-1-SNAPSHOT/maven-war-plugin-2.1-beta-1-SNAPSHOT.pom

[INFO] Installing http://ci.sonatype.org/job/plugins-IT-with-maven-2.0.x/org.apache.maven.plugins$maven-war-plugin/ws/target/maven-war-plugin-2.1-beta-1-SNAPSHOT.jar
 to http://ci.sonatype.org/job/plugins-IT-with-maven-2.0.x/org.apache.maven.plugins$maven-war-plugin/ws/target/local-repo/org/apache/maven/plugins/maven-war-plugin/2.1-beta-1-SNAPSHOT/maven-war-plugin-2.1-beta-1-SNAPSHOT.jar

[INFO] [invoker:run {execution: integration-test}]
[INFO] Building: MWAR-96/pom.xml
[INFO] ...SUCCESS.
[INFO] Building: simple-war-no-webxml/pom.xml
[INFO] ...SUCCESS.
[INFO] Building: MWAR-131/pom.xml
[INFO] ...SUCCESS.
[INFO] Building: MWAR-129/pom.xml
[INFO] ...SUCCESS.
[INFO] Building: web-resources-filtering/pom.xml
[INFO] ...FAILED[code=1]. See http://ci.sonatype.org/job/plugins-IT-with-maven-2.0.x/org.apache.maven.plugins$maven-war-plugin/ws/target/it/web-resources-filtering/build.log
 for details.
[INFO] Building: MWAR-143/pom.xml
[INFO] ...SUCCESS.
[INFO] Building: default/pom.xml
[INFO] ...SUCCESS.
[INFO] Building: MWAR-62/pom.xml
[INFO] ...SUCCESS.
[INFO] Building: scoped-dependency-same-artifact/pom.xml
[INFO] ...SUCCESS.
[INFO] Building: MWAR-139/pom.xml
[INFO] ...SUCCESS.
[INFO] Building: simple-war-project/pom.xml
[INFO] ...SUCCESS.
[INFO] Building: MWAR-133/pom.xml
[INFO] ...SUCCESS.
[INFO] 

---------------------------------------
Execution Summary:
Builds Passing: 11
Builds Failing: 1
---------------------------------------

The following builds failed:

*  web-resources-filtering/pom.xml

[HUDSON] Archiving http://ci.sonatype.org/job/plugins-IT-with-maven-2.0.x/org.apache.maven.plugins$maven-war-plugin/ws/pom.xml
 to /home/j2ee-hudson/.hudson/jobs/plugins-IT-with-maven-2.0.x/modules/org.apache.maven.plugins$maven-war-plugin/builds/2008-10-03_00-19-35/archive/org.apache.maven.plugins/maven-war-plugin/2.1-beta-1-SNAPSHOT/pom.xml
[HUDSON] Archiving http://ci.sonatype.org/job/plugins-IT-with-maven-2.0.x/org.apache.maven.plugins$maven-war-plugin/ws/target/maven-war-plugin-2.1-beta-1-SNAPSHOT.jar
 to /home/j2ee-hudson/.hudson/jobs/plugins-IT-with-maven-2.0.x/modules/org.apache.maven.plugins$maven-war-plugin/builds/2008-10-03_00-19-35/archive/org.apache.maven.plugins/maven-war-plugin/2.1-beta-1-SNAPSHOT/maven-war-plugin-2.1-beta-1-SNAPSHOT.jar
[INFO] 
[INFO] 
[INFO] ------------------------------------------------------------------------
[INFO] Reactor Summary:
[INFO] ------------------------------------------------------------------------
[INFO] Maven Plugins ......................................... SUCCESS [27.391s]
[INFO] Maven Remote Resources Plugin ......................... SUCCESS [23.999s]
[INFO] Maven Invoker Plugin .................................. SUCCESS [3:56.292s]
[INFO] Maven Ant Plugin ...................................... SUCCESS [1:30.979s]
[INFO] Maven AntRun Plugin ................................... SUCCESS [44.128s]
[INFO] Maven Assembly Plugin ................................. SUCCESS [14:31.316s]
[INFO] Maven Changelog Plugin ................................ SUCCESS [41.441s]
[INFO] Maven Changes Report Plugin ........................... SUCCESS [14.353s]
[INFO] Maven Checkstyle Plugin ............................... SUCCESS [1:04.787s]
[INFO] Maven Clean Plugin .................................... SUCCESS [33.950s]
[INFO] Maven Compiler Plugin ................................. SUCCESS [30.152s]
[INFO] Maven Dependency Plugin ............................... SUCCESS [1:47.984s]
[INFO] Maven Deploy Plugin ................................... SUCCESS [12.402s]
[INFO] Maven DOAP Plugin ..................................... SUCCESS [5.626s]
[INFO] Maven Documentation Checker Plugin .................... SUCCESS [2.326s]
[INFO] Maven EAR Plugin ...................................... SUCCESS [3:02.881s]
[INFO] Maven Eclipse Plugin .................................. SUCCESS [9:14.282s]
[INFO] Maven EJB Plugin ...................................... SUCCESS [16.291s]
[INFO] Maven GPG Plugin ...................................... SUCCESS [2.866s]
[INFO] Maven Help Plugin ..................................... SUCCESS [7.486s]
[INFO] Maven IDEA Plugin ..................................... SUCCESS [17.923s]
[INFO] Maven Install Plugin .................................. SUCCESS [5.529s]
[INFO] Maven Javadoc Plugin .................................. SUCCESS [2:47.215s]
[INFO] Maven JAR Plugin ...................................... SUCCESS [2:01.026s]
[INFO] Maven Linkcheck Plugin ................................ SUCCESS [2.647s]
[INFO] Maven One Plugin ...................................... SUCCESS [3.614s]
[INFO] Maven Patch Plugin .................................... SUCCESS [23.199s]
[INFO] Maven PMD Plugin ...................................... SUCCESS [9.962s]
[INFO] Maven RAR Plugin ...................................... SUCCESS [11.146s]
[INFO] Maven Reactor Plugin .................................. SUCCESS [8.067s]
[INFO] Maven Repository Plugin ............................... SUCCESS [5.789s]
[INFO] Maven Resources Plugin ................................ FAILED [56.122s]
[INFO] Maven Shade Plugin .................................... SUCCESS [15.069s]
[INFO] Maven Site Plugin ..................................... FAILED [6.149s]
[INFO] Maven Source Plugin ................................... SUCCESS [21.876s]
[INFO] Maven Stage Plugin .................................... SUCCESS [2.451s]
[INFO] Maven Toolchains Plugin ............................... SUCCESS [2.828s]
[INFO] Maven Verifier Plugin ................................. SUCCESS [14.785s]
[INFO] Maven WAR Plugin ...................................... FAILED [1:54.381s]
[INFO] ------------------------------------------------------------------------
[INFO] Error for project: Maven Resources Plugin (during deploy)
[INFO] ------------------------------------------------------------------------
[INFO] : org.apache.maven.plugin.invoker.InvokerMojo@3ff8aab0
1 builds failed.

1 builds failed.
[INFO] ------------------------------------------------------------------------
[INFO] Trace
org.apache.maven.BuildFailureException: 1 builds failed.
	at org.apache.maven.lifecycle.DefaultLifecycleExecutor.executeGoals(DefaultLifecycleExecutor.java:579)
	at org.apache.maven.lifecycle.DefaultLifecycleExecutor.executeGoalWithLifecycle(DefaultLifecycleExecutor.java:499)
	at org.apache.maven.lifecycle.DefaultLifecycleExecutor.executeGoal(DefaultLifecycleExecutor.java:478)
	at org.apache.maven.lifecycle.DefaultLifecycleExecutor.executeGoalAndHandleFailures(DefaultLifecycleExecutor.java:330)
	at org.apache.maven.lifecycle.DefaultLifecycleExecutor.executeTaskSegments(DefaultLifecycleExecutor.java:291)
	at org.apache.maven.lifecycle.DefaultLifecycleExecutor.execute(DefaultLifecycleExecutor.java:142)
	at org.apache.maven.lifecycle.LifecycleExecutorInterceptor.execute(LifecycleExecutorInterceptor.java:42)
	at org.apache.maven.DefaultMaven.doExecute(DefaultMaven.java:336)
	at org.apache.maven.DefaultMaven.execute(DefaultMaven.java:129)
	at org.apache.maven.cli.MavenCli.main(MavenCli.java:287)
	at sun.reflect.NativeMethodAccessorImpl.invoke0(Native Method)
	at sun.reflect.NativeMethodAccessorImpl.invoke(NativeMethodAccessorImpl.java:39)
	at sun.reflect.DelegatingMethodAccessorImpl.invoke(DelegatingMethodAccessorImpl.java:25)
	at java.lang.reflect.Method.invoke(Method.java:585)
	at org.codehaus.classworlds.Launcher.launchEnhanced(Launcher.java:315)
	at org.codehaus.classworlds.Launcher.launch(Launcher.java:255)
	at hudson.maven.agent.Main.launch(Main.java:133)
	at hudson.maven.MavenBuilder.call(MavenBuilder.java:139)
	at hudson.maven.MavenModuleSetBuild$Builder.call(MavenModuleSetBuild.java:543)
	at hudson.maven.MavenModuleSetBuild$Builder.call(MavenModuleSetBuild.java:489)
	at hudson.remoting.UserRequest.perform(UserRequest.java:69)
	at hudson.remoting.UserRequest.perform(UserRequest.java:23)
	at hudson.remoting.Request$2.run(Request.java:213)
	at java.util.concurrent.Executors$RunnableAdapter.call(Executors.java:417)
	at java.util.concurrent.FutureTask$Sync.innerRun(FutureTask.java:269)
	at java.util.concurrent.FutureTask.run(FutureTask.java:123)
	at java.util.concurrent.ThreadPoolExecutor$Worker.runTask(ThreadPoolExecutor.java:650)
	at java.util.concurrent.ThreadPoolExecutor$Worker.run(ThreadPoolExecutor.java:675)
	at java.lang.Thread.run(Thread.java:595)
Caused by: org.apache.maven.plugin.MojoFailureException: 1 builds failed.
	at org.apache.maven.plugin.invoker.InvokerMojo.execute(InvokerMojo.java:493)
	at org.apache.maven.plugin.DefaultPluginManager.executeMojo(DefaultPluginManager.java:451)
	at hudson.maven.agent.PluginManagerInterceptor.executeMojo(PluginManagerInterceptor.java:159)
	at org.apache.maven.lifecycle.DefaultLifecycleExecutor.executeGoals(DefaultLifecycleExecutor.java:558)
	... 28 more
[INFO] ------------------------------------------------------------------------
[INFO] Error for project: Maven Site Plugin (during deploy)
[INFO] ------------------------------------------------------------------------
[INFO] Compilation failure

/home/j2ee-hudson/.hudson/jobs/plugins-IT-with-maven-2.0.x/workspace/trunk/maven-site-plugin/target/generated-sources/plugin/org/apache/maven/plugins/site/HelpMojo.java:[148,113]
illegal escape character

/home/j2ee-hudson/.hudson/jobs/plugins-IT-with-maven-2.0.x/workspace/trunk/maven-site-plugin/target/generated-sources/plugin/org/apache/maven/plugins/site/HelpMojo.java:[148,125]
illegal escape character

/home/j2ee-hudson/.hudson/jobs/plugins-IT-with-maven-2.0.x/workspace/trunk/maven-site-plugin/target/generated-sources/plugin/org/apache/maven/plugins/site/HelpMojo.java:[148,135]
illegal escape character

/home/j2ee-hudson/.hudson/jobs/plugins-IT-with-maven-2.0.x/workspace/trunk/maven-site-plugin/target/generated-sources/plugin/org/apache/maven/plugins/site/HelpMojo.java:[302,113]
illegal escape character

/home/j2ee-hudson/.hudson/jobs/plugins-IT-with-maven-2.0.x/workspace/trunk/maven-site-plugin/target/generated-sources/plugin/org/apache/maven/plugins/site/HelpMojo.java:[302,125]
illegal escape character

/home/j2ee-hudson/.hudson/jobs/plugins-IT-with-maven-2.0.x/workspace/trunk/maven-site-plugin/target/generated-sources/plugin/org/apache/maven/plugins/site/HelpMojo.java:[302,135]
illegal escape character


[INFO] ------------------------------------------------------------------------
[INFO] Trace
org.apache.maven.BuildFailureException: Compilation failure
	at org.apache.maven.lifecycle.DefaultLifecycleExecutor.executeGoals(DefaultLifecycleExecutor.java:579)
	at org.apache.maven.lifecycle.DefaultLifecycleExecutor.executeGoalWithLifecycle(DefaultLifecycleExecutor.java:499)
	at org.apache.maven.lifecycle.DefaultLifecycleExecutor.executeGoal(DefaultLifecycleExecutor.java:478)
	at org.apache.maven.lifecycle.DefaultLifecycleExecutor.executeGoalAndHandleFailures(DefaultLifecycleExecutor.java:330)
	at org.apache.maven.lifecycle.DefaultLifecycleExecutor.executeTaskSegments(DefaultLifecycleExecutor.java:291)
	at org.apache.maven.lifecycle.DefaultLifecycleExecutor.execute(DefaultLifecycleExecutor.java:142)
	at org.apache.maven.lifecycle.LifecycleExecutorInterceptor.execute(LifecycleExecutorInterceptor.java:42)
	at org.apache.maven.DefaultMaven.doExecute(DefaultMaven.java:336)
	at org.apache.maven.DefaultMaven.execute(DefaultMaven.java:129)
	at org.apache.maven.cli.MavenCli.main(MavenCli.java:287)
	at sun.reflect.NativeMethodAccessorImpl.invoke0(Native Method)
	at sun.reflect.NativeMethodAccessorImpl.invoke(NativeMethodAccessorImpl.java:39)
	at sun.reflect.DelegatingMethodAccessorImpl.invoke(DelegatingMethodAccessorImpl.java:25)
	at java.lang.reflect.Method.invoke(Method.java:585)
	at org.codehaus.classworlds.Launcher.launchEnhanced(Launcher.java:315)
	at org.codehaus.classworlds.Launcher.launch(Launcher.java:255)
	at hudson.maven.agent.Main.launch(Main.java:133)
	at hudson.maven.MavenBuilder.call(MavenBuilder.java:139)
	at hudson.maven.MavenModuleSetBuild$Builder.call(MavenModuleSetBuild.java:543)
	at hudson.maven.MavenModuleSetBuild$Builder.call(MavenModuleSetBuild.java:489)
	at hudson.remoting.UserRequest.perform(UserRequest.java:69)
	at hudson.remoting.UserRequest.perform(UserRequest.java:23)
	at hudson.remoting.Request$2.run(Request.java:213)
	at java.util.concurrent.Executors$RunnableAdapter.call(Executors.java:417)
	at java.util.concurrent.FutureTask$Sync.innerRun(FutureTask.java:269)
	at java.util.concurrent.FutureTask.run(FutureTask.java:123)
	at java.util.concurrent.ThreadPoolExecutor$Worker.runTask(ThreadPoolExecutor.java:650)
	at java.util.concurrent.ThreadPoolExecutor$Worker.run(ThreadPoolExecutor.java:675)
	at java.lang.Thread.run(Thread.java:595)
Caused by: org.apache.maven.plugin.CompilationFailureException: Compilation failure
	at org.apache.maven.plugin.AbstractCompilerMojo.execute(AbstractCompilerMojo.java:516)
	at org.apache.maven.plugin.CompilerMojo.execute(CompilerMojo.java:114)
	at org.apache.maven.plugin.DefaultPluginManager.executeMojo(DefaultPluginManager.java:451)
	at hudson.maven.agent.PluginManagerInterceptor.executeMojo(PluginManagerInterceptor.java:159)
	at org.apache.maven.lifecycle.DefaultLifecycleExecutor.executeGoals(DefaultLifecycleExecutor.java:558)
	... 28 more
[INFO] ------------------------------------------------------------------------
[INFO] Error for project: Maven WAR Plugin (during deploy)
[INFO] ------------------------------------------------------------------------
[INFO] : org.apache.maven.plugin.invoker.InvokerMojo@55ccf17b
1 builds failed.

1 builds failed.
[INFO] ------------------------------------------------------------------------
[INFO] Trace
org.apache.maven.BuildFailureException: 1 builds failed.
	at org.apache.maven.lifecycle.DefaultLifecycleExecutor.executeGoals(DefaultLifecycleExecutor.java:579)
	at org.apache.maven.lifecycle.DefaultLifecycleExecutor.executeGoalWithLifecycle(DefaultLifecycleExecutor.java:499)
	at org.apache.maven.lifecycle.DefaultLifecycleExecutor.executeGoal(DefaultLifecycleExecutor.java:478)
	at org.apache.maven.lifecycle.DefaultLifecycleExecutor.executeGoalAndHandleFailures(DefaultLifecycleExecutor.java:330)
	at org.apache.maven.lifecycle.DefaultLifecycleExecutor.executeTaskSegments(DefaultLifecycleExecutor.java:291)
	at org.apache.maven.lifecycle.DefaultLifecycleExecutor.execute(DefaultLifecycleExecutor.java:142)
	at org.apache.maven.lifecycle.LifecycleExecutorInterceptor.execute(LifecycleExecutorInterceptor.java:42)
	at org.apache.maven.DefaultMaven.doExecute(DefaultMaven.java:336)
	at org.apache.maven.DefaultMaven.execute(DefaultMaven.java:129)
	at org.apache.maven.cli.MavenCli.main(MavenCli.java:287)
	at sun.reflect.NativeMethodAccessorImpl.invoke0(Native Method)
	at sun.reflect.NativeMethodAccessorImpl.invoke(NativeMethodAccessorImpl.java:39)
	at sun.reflect.DelegatingMethodAccessorImpl.invoke(DelegatingMethodAccessorImpl.java:25)
	at java.lang.reflect.Method.invoke(Method.java:585)
	at org.codehaus.classworlds.Launcher.launchEnhanced(Launcher.java:315)
	at org.codehaus.classworlds.Launcher.launch(Launcher.java:255)
	at hudson.maven.agent.Main.launch(Main.java:133)
	at hudson.maven.MavenBuilder.call(MavenBuilder.java:139)
	at hudson.maven.MavenModuleSetBuild$Builder.call(MavenModuleSetBuild.java:543)
	at hudson.maven.MavenModuleSetBuild$Builder.call(MavenModuleSetBuild.java:489)
	at hudson.remoting.UserRequest.perform(UserRequest.java:69)
	at hudson.remoting.UserRequest.perform(UserRequest.java:23)
	at hudson.remoting.Request$2.run(Request.java:213)
	at java.util.concurrent.Executors$RunnableAdapter.call(Executors.java:417)
	at java.util.concurrent.FutureTask$Sync.innerRun(FutureTask.java:269)
	at java.util.concurrent.FutureTask.run(FutureTask.java:123)
	at java.util.concurrent.ThreadPoolExecutor$Worker.runTask(ThreadPoolExecutor.java:650)
	at java.util.concurrent.ThreadPoolExecutor$Worker.run(ThreadPoolExecutor.java:675)
	at java.lang.Thread.run(Thread.java:595)
Caused by: org.apache.maven.plugin.MojoFailureException: 1 builds failed.
	at org.apache.maven.plugin.invoker.InvokerMojo.execute(InvokerMojo.java:493)
	at org.apache.maven.plugin.DefaultPluginManager.executeMojo(DefaultPluginManager.java:451)
	at hudson.maven.agent.PluginManagerInterceptor.executeMojo(PluginManagerInterceptor.java:159)
	at org.apache.maven.lifecycle.DefaultLifecycleExecutor.executeGoals(DefaultLifecycleExecutor.java:558)
	... 28 more
[INFO] ------------------------------------------------------------------------
[INFO] BUILD ERRORS
[INFO] ------------------------------------------------------------------------
[INFO] Total time: 51 minutes 14 seconds
[INFO] Finished at: Fri Oct 03 01:10:56 CDT 2008
[INFO] Final Memory: 110M/275M
[INFO] ------------------------------------------------------------------------
Waiting for Hudson to finish collecting data


Mime
View raw message