maven-notifications mailing list archives

Site index · List index
Message view « Date » · « Thread »
Top « Date » · « Thread »
From Hudson <Hud...@sonatype.org>
Subject Build failed in Hudson: doxia » Doxia #45
Date Sat, 11 Oct 2008 01:32:40 GMT
See http://ci.sonatype.org/job/doxia/org.apache.maven.doxia$doxia/45/changes

Changes:

[Herve Boutemy] use modello-maven-plugin models parameter instead of model, which is deprecated

------------------------------------------
channel started
+ Error stacktraces are turned on.
Executing Maven:  -B -B -f http://ci.sonatype.org/job/doxia/org.apache.maven.doxia$doxia/ws/pom.xml
 clean deploy -B -U -e -Dmaven.repo.local=/home/j2ee-hudson/repos/doxia
[INFO] Scanning for projects...
[INFO] Reactor build order: 
[INFO]   Doxia
[INFO]   Doxia :: Logging API
[INFO]   Doxia :: Sink API
[INFO]   Doxia :: Core
[INFO]   Doxia :: Modules
[INFO]   Doxia :: APT Module
[INFO]   Doxia :: Confluence Module
[INFO]   Doxia :: Simplified DocBook Module
[INFO]   Doxia :: FML Module
[INFO]   Doxia :: FO Module
[INFO]   Doxia :: iText Module
[INFO]   Doxia :: Latex Module
[INFO]   Doxia :: RTF Module
[INFO]   Doxia :: TWiki Module
[INFO]   Doxia :: XDoc Module
[INFO]   Doxia :: XHTML Module
[INFO]   Doxia :: Book Component
[INFO]   Doxia :: Maven Plugin
[INFO] ------------------------------------------------------------------------
[INFO] Building Doxia
[INFO]    task-segment: [clean, deploy]
[INFO] ------------------------------------------------------------------------
[INFO] [clean:clean]
[INFO] Deleting directory http://ci.sonatype.org/job/doxia/org.apache.maven.doxia$doxia/ws/target

[INFO] [plexus:descriptor {execution: default}]
[INFO] Setting property: classpath.resource.loader.class => 'org.codehaus.plexus.velocity.ContextClassLoaderResourceLoader'.
[INFO] Setting property: velocimacro.messages.on => 'false'.
[INFO] Setting property: resource.loader => 'classpath'.
[INFO] Setting property: resource.manager.logwhenfound => 'false'.
[INFO] [remote-resources:process {execution: default}]
[INFO] [site:attach-descriptor]
[INFO] Unable to load parent project from a relative path: Could not find the model file '/home/j2ee-hudson/.hudson/jobs/doxia/pom/maven/pom.xml'.
for project unknown
[INFO] Parent project loaded from repository.
[INFO] [install:install]
[INFO] Installing http://ci.sonatype.org/job/doxia/org.apache.maven.doxia$doxia/ws/pom.xml
 to /home/j2ee-hudson/repos/doxia/org/apache/maven/doxia/doxia/1.0-beta-1-SNAPSHOT/doxia-1.0-beta-1-SNAPSHOT.pom
[INFO] [deploy:deploy]
altDeploymentRepository = null
[INFO] Retrieving previous build number from apache.snapshots
[HUDSON] Archiving http://ci.sonatype.org/job/doxia/org.apache.maven.doxia$doxia/ws/pom.xml
 to /home/j2ee-hudson/.hudson/jobs/doxia/modules/org.apache.maven.doxia$doxia/builds/2008-10-10_20-32-20/archive/org.apache.maven.doxia/doxia/1.0-beta-1-SNAPSHOT/pom.xml
[INFO] ------------------------------------------------------------------------
[ERROR] BUILD ERROR
[INFO] ------------------------------------------------------------------------
[INFO] Error retrieving previous build number for artifact 'org.apache.maven.doxia:doxia:pom':
repository metadata for: 'snapshot org.apache.maven.doxia:doxia:1.0-beta-1-SNAPSHOT' could
not be retrieved from repository: apache.snapshots due to an error: Error transferring file

Server returned HTTP response code: 500 for URL: http://localhost:8081/content/repositories/maven.snapshots/org/apache/maven/doxia/doxia/1.0-beta-1-SNAPSHOT/maven-metadata.xml
[INFO] ------------------------------------------------------------------------
[INFO] Trace
org.apache.maven.lifecycle.LifecycleExecutionException: Error retrieving previous build number
for artifact 'org.apache.maven.doxia:doxia:pom': repository metadata for: 'snapshot org.apache.maven.doxia:doxia:1.0-beta-1-SNAPSHOT'
could not be retrieved from repository: apache.snapshots due to an error: Error transferring
file
	at org.apache.maven.lifecycle.DefaultLifecycleExecutor.executeGoals(DefaultLifecycleExecutor.java:583)
	at org.apache.maven.lifecycle.DefaultLifecycleExecutor.executeGoalWithLifecycle(DefaultLifecycleExecutor.java:499)
	at org.apache.maven.lifecycle.DefaultLifecycleExecutor.executeGoal(DefaultLifecycleExecutor.java:478)
	at org.apache.maven.lifecycle.DefaultLifecycleExecutor.executeGoalAndHandleFailures(DefaultLifecycleExecutor.java:330)
	at org.apache.maven.lifecycle.DefaultLifecycleExecutor.executeTaskSegments(DefaultLifecycleExecutor.java:291)
	at org.apache.maven.lifecycle.DefaultLifecycleExecutor.execute(DefaultLifecycleExecutor.java:142)
	at org.apache.maven.lifecycle.LifecycleExecutorInterceptor.execute(LifecycleExecutorInterceptor.java:42)
	at org.apache.maven.DefaultMaven.doExecute(DefaultMaven.java:336)
	at org.apache.maven.DefaultMaven.execute(DefaultMaven.java:129)
	at org.apache.maven.cli.MavenCli.main(MavenCli.java:287)
	at sun.reflect.NativeMethodAccessorImpl.invoke0(Native Method)
	at sun.reflect.NativeMethodAccessorImpl.invoke(NativeMethodAccessorImpl.java:39)
	at sun.reflect.DelegatingMethodAccessorImpl.invoke(DelegatingMethodAccessorImpl.java:25)
	at java.lang.reflect.Method.invoke(Method.java:597)
	at org.codehaus.classworlds.Launcher.launchEnhanced(Launcher.java:315)
	at org.codehaus.classworlds.Launcher.launch(Launcher.java:255)
	at hudson.maven.agent.Main.launch(Main.java:133)
	at hudson.maven.MavenBuilder.call(MavenBuilder.java:139)
	at hudson.maven.MavenModuleSetBuild$Builder.call(MavenModuleSetBuild.java:543)
	at hudson.maven.MavenModuleSetBuild$Builder.call(MavenModuleSetBuild.java:489)
	at hudson.remoting.UserRequest.perform(UserRequest.java:69)
	at hudson.remoting.UserRequest.perform(UserRequest.java:23)
	at hudson.remoting.Request$2.run(Request.java:213)
	at java.util.concurrent.Executors$RunnableAdapter.call(Executors.java:441)
	at java.util.concurrent.FutureTask$Sync.innerRun(FutureTask.java:303)
	at java.util.concurrent.FutureTask.run(FutureTask.java:138)
	at java.util.concurrent.ThreadPoolExecutor$Worker.runTask(ThreadPoolExecutor.java:885)
	at java.util.concurrent.ThreadPoolExecutor$Worker.run(ThreadPoolExecutor.java:907)
	at java.lang.Thread.run(Thread.java:619)
Caused by: org.apache.maven.plugin.MojoExecutionException: Error retrieving previous build
number for artifact 'org.apache.maven.doxia:doxia:pom': repository metadata for: 'snapshot
org.apache.maven.doxia:doxia:1.0-beta-1-SNAPSHOT' could not be retrieved from repository:
apache.snapshots due to an error: Error transferring file
	at org.apache.maven.plugin.deploy.DeployMojo.execute(DeployMojo.java:174)
	at org.apache.maven.plugin.DefaultPluginManager.executeMojo(DefaultPluginManager.java:451)
	at hudson.maven.agent.PluginManagerInterceptor.executeMojo(PluginManagerInterceptor.java:159)
	at org.apache.maven.lifecycle.DefaultLifecycleExecutor.executeGoals(DefaultLifecycleExecutor.java:558)
	... 28 more
Caused by: org.apache.maven.artifact.deployer.ArtifactDeploymentException: Error retrieving
previous build number for artifact 'org.apache.maven.doxia:doxia:pom': repository metadata
for: 'snapshot org.apache.maven.doxia:doxia:1.0-beta-1-SNAPSHOT' could not be retrieved from
repository: apache.snapshots due to an error: Error transferring file
	at org.apache.maven.artifact.transform.SnapshotTransformation.transformForDeployment(SnapshotTransformation.java:106)
	at org.apache.maven.artifact.transform.DefaultArtifactTransformationManager.transformForDeployment(DefaultArtifactTransformationManager.java:78)
	at org.apache.maven.artifact.deployer.DefaultArtifactDeployer.deploy(DefaultArtifactDeployer.java:71)
	at org.apache.maven.plugin.deploy.DeployMojo.execute(DeployMojo.java:152)
	... 31 more
Caused by: org.apache.maven.artifact.repository.metadata.RepositoryMetadataResolutionException:
repository metadata for: 'snapshot org.apache.maven.doxia:doxia:1.0-beta-1-SNAPSHOT' could
not be retrieved from repository: apache.snapshots due to an error: Error transferring file
	at org.apache.maven.artifact.repository.metadata.DefaultRepositoryMetadataManager.resolveAlways(DefaultRepositoryMetadataManager.java:352)
	at org.apache.maven.artifact.transform.SnapshotTransformation.resolveLatestSnapshotBuildNumber(SnapshotTransformation.java:161)
	at org.apache.maven.artifact.transform.SnapshotTransformation.transformForDeployment(SnapshotTransformation.java:100)
	... 34 more
Caused by: org.apache.maven.wagon.TransferFailedException: Error transferring file
	at org.apache.maven.wagon.providers.http.LightweightHttpWagon.fillInputData(LightweightHttpWagon.java:104)
	at org.apache.maven.wagon.StreamWagon.get(StreamWagon.java:68)
	at org.apache.maven.artifact.manager.DefaultWagonManager.getRemoteFile(DefaultWagonManager.java:470)
	at org.apache.maven.artifact.manager.DefaultWagonManager.getArtifactMetadataFromDeploymentRepository(DefaultWagonManager.java:379)
	at org.apache.maven.artifact.repository.metadata.DefaultRepositoryMetadataManager.getArtifactMetadataFromDeploymentRepository(DefaultRepositoryMetadataManager.java:380)
	at org.apache.maven.artifact.repository.metadata.DefaultRepositoryMetadataManager.resolveAlways(DefaultRepositoryMetadataManager.java:348)
	... 36 more
Caused by: java.io.IOException: Server returned HTTP response code: 500 for URL: http://localhost:8081/content/repositories/maven.snapshots/org/apache/maven/doxia/doxia/1.0-beta-1-SNAPSHOT/maven-metadata.xml
	at sun.net.www.protocol.http.HttpURLConnection.getInputStream(HttpURLConnection.java:1241)
	at org.apache.maven.wagon.providers.http.LightweightHttpWagon.fillInputData(LightweightHttpWagon.java:83)
	... 41 more
[INFO] ------------------------------------------------------------------------
[INFO] Total time: 13 seconds
[INFO] Finished at: Fri Oct 10 20:32:39 CDT 2008
[INFO] Final Memory: 34M/425M
[INFO] ------------------------------------------------------------------------


Mime
View raw message