maven-notifications mailing list archives

Site index · List index
Message view « Date » · « Thread »
Top « Date » · « Thread »
From Hudson <Hud...@sonatype.org>
Subject Build failed in Hudson: maven-core-integration-testing #9
Date Sun, 12 Oct 2008 13:06:00 GMT
See http://ci.sonatype.org/job/maven-core-integration-testing/9/changes

Changes:

[Benjamin Bentmann] o Fixed stream handling

[Benjamin Bentmann] o Printed elapsed test time to highlight long running tests

------------------------------------------
started
Updating https://svn.apache.org/repos/asf/maven/core-integration-testing/trunk
U         core-it-suite/src/test/java/org/apache/maven/it/MavenITmng3473PluginReportCrash.java
U         core-it-support/maven-it-helper/src/main/java/org/apache/maven/it/AbstractMavenIntegrationTestCase.java
At revision 703813
[maven-its] $ mvn clean deploy -B -U -e -Dmaven.repo.local=/home/hudson/repos/core-its
FATAL: command execution failed
java.io.IOException: Cannot run program "mvn" (in directory "http://ci.sonatype.org/job/maven-core-integration-testing/ws/maven-its")
: java.io.IOException: error=2, No such file or directory
	at java.lang.ProcessBuilder.start(ProcessBuilder.java:459)
	at hudson.Proc$LocalProc.<init>(Proc.java:104)
	at hudson.Proc$LocalProc.<init>(Proc.java:82)
	at hudson.Launcher$LocalLauncher.createLocalProc(Launcher.java:311)
	at hudson.Launcher$LocalLauncher.launch(Launcher.java:302)
	at hudson.Launcher.launch(Launcher.java:140)
	at hudson.Launcher.launch(Launcher.java:92)
	at hudson.tasks.Maven.perform(Maven.java:184)
	at hudson.model.Build$RunnerImpl.build(Build.java:138)
	at hudson.model.Build$RunnerImpl.doRun(Build.java:113)
	at hudson.model.AbstractBuild$AbstractRunner.run(AbstractBuild.java:240)
	at hudson.model.Run.run(Run.java:793)
	at hudson.model.Build.run(Build.java:88)
	at hudson.model.ResourceController.execute(ResourceController.java:70)
	at hudson.model.Executor.run(Executor.java:88)
Caused by: java.io.IOException: java.io.IOException: error=2, No such file or directory
	at java.lang.UNIXProcess.<init>(UNIXProcess.java:148)
	at java.lang.ProcessImpl.start(ProcessImpl.java:65)
	at java.lang.ProcessBuilder.start(ProcessBuilder.java:452)
	... 14 more


Mime
View raw message