maven-notifications mailing list archives: October 2008

Site index · List index
Message list« Previous · 1 · 2 · 3 · 4 · 5 · 6 · 7 · 8 · 9 · 10 · Next »Thread · Author · Date
Hudson Build failed in Hudson: plugins-IT-with-maven-2.0.x » Maven WAR Plugin #539 Wed, 15 Oct, 06:03
Hudson Hudson build is back to normal: plugins-IT-with-maven-2.0.x » Maven Assembly Plugin #539 Wed, 15 Oct, 06:03
Hudson Build failed in Hudson: plugins-IT-with-maven-2.0.x » Maven Changes Report Plugin #540 Wed, 15 Oct, 06:51
Hudson Hudson build is back to normal: plugins-IT-with-maven-2.0.x » Maven Resources Plugin #540 Wed, 15 Oct, 06:51
Hudson Build failed in Hudson: plugins-IT-with-maven-2.0.x » Maven AntRun Plugin #540 Wed, 15 Oct, 06:51
Hudson Hudson build is back to normal: plugins-IT-with-maven-2.0.x » Maven WAR Plugin #540 Wed, 15 Oct, 06:51
Hudson Build failed in Hudson: plugins-IT-with-maven-2.0.x » Maven Assembly Plugin #540 Wed, 15 Oct, 06:51
Hudson Build failed in Hudson: plugins-IT-with-maven-2.0.x » Maven Changes Report Plugin #541 Wed, 15 Oct, 07:40
Hudson Build failed in Hudson: plugins-IT-with-maven-2.0.x » Maven AntRun Plugin #541 Wed, 15 Oct, 07:40
Hudson Build failed in Hudson: plugins-IT-with-maven-2.0.x » Maven Assembly Plugin #541 Wed, 15 Oct, 07:40
Apache Hudson Server Build failed in Hudson: Maven-2.1.x-with-bootstrap #97 Wed, 15 Oct, 07:43
Hudson Build failed in Hudson: plugins-IT-with-maven-2.0.x » Maven Changes Report Plugin #542 Wed, 15 Oct, 08:42
Hudson Build failed in Hudson: plugins-IT-with-maven-2.0.x » Maven AntRun Plugin #542 Wed, 15 Oct, 08:42
Hudson Build failed in Hudson: plugins-IT-with-maven-2.0.x » Maven Assembly Plugin #542 Wed, 15 Oct, 08:42
Hudson Build failed in Hudson: plugins-IT-with-maven-2.0.x » Maven Changes Report Plugin #543 Wed, 15 Oct, 09:36
Hudson Build failed in Hudson: plugins-IT-with-maven-2.0.x » Maven AntRun Plugin #543 Wed, 15 Oct, 09:36
Hudson Build failed in Hudson: plugins-IT-with-maven-2.0.x » Maven Assembly Plugin #543 Wed, 15 Oct, 09:36
Contin...@vmbuild.apache.org [continuum] BUILD FAILURE: Maven 2.0.x Branch - Integration Test Executor - default maven2 buildDefinition Wed, 15 Oct, 09:42
Hudson Build failed in Hudson: plugins-IT-with-maven-2.0.x » Maven Changes Report Plugin #544 Wed, 15 Oct, 10:30
Hudson Build failed in Hudson: plugins-IT-with-maven-2.0.x » Maven AntRun Plugin #544 Wed, 15 Oct, 10:30
Hudson Build failed in Hudson: plugins-IT-with-maven-2.0.x » Maven Assembly Plugin #544 Wed, 15 Oct, 10:30
Hudson Build failed in Hudson: plugins-IT-with-maven-2.0.x » Maven Changes Report Plugin #545 Wed, 15 Oct, 11:16
Hudson Build failed in Hudson: plugins-IT-with-maven-2.0.x » Maven AntRun Plugin #545 Wed, 15 Oct, 11:16
Hudson Build failed in Hudson: plugins-IT-with-maven-2.0.x » Maven Assembly Plugin #545 Wed, 15 Oct, 11:16
Hudson Build failed in Hudson: plugins-CI-with-maven-2.0.x » Maven Plugins #611 Wed, 15 Oct, 11:43
Hudson Hudson build became unstable: plugins-IT-with-maven-2.0.x » Maven EAR Plugin #546 Wed, 15 Oct, 12:27
Hudson Build failed in Hudson: plugins-IT-with-maven-2.0.x » Maven Changes Report Plugin #546 Wed, 15 Oct, 12:27
Hudson Build failed in Hudson: plugins-IT-with-maven-2.0.x » Maven Checkstyle Plugin #546 Wed, 15 Oct, 12:27
Hudson Build failed in Hudson: plugins-IT-with-maven-2.0.x » Maven Dependency Plugin #546 Wed, 15 Oct, 12:27
Hudson Build failed in Hudson: plugins-IT-with-maven-2.0.x » Maven Deploy Plugin #546 Wed, 15 Oct, 12:27
Hudson Build failed in Hudson: plugins-IT-with-maven-2.0.x » Maven Compiler Plugin #546 Wed, 15 Oct, 12:27
Hudson Build failed in Hudson: plugins-IT-with-maven-2.0.x » Maven AntRun Plugin #546 Wed, 15 Oct, 12:27
Hudson Build failed in Hudson: plugins-IT-with-maven-2.0.x » Maven Assembly Plugin #546 Wed, 15 Oct, 12:27
Hudson Build failed in Hudson: plugins-IT-with-maven-2.0.x » Maven Clean Plugin #546 Wed, 15 Oct, 12:27
Hudson Build failed in Hudson: plugins-IT-with-maven-2.0.x » Maven AntRun Plugin #547 Wed, 15 Oct, 13:07
Hudson Hudson build is back to normal: plugins-IT-with-maven-2.0.x » Maven Compiler Plugin #547 Wed, 15 Oct, 13:07
Hudson Hudson build is back to stable: plugins-IT-with-maven-2.0.x » Maven EAR Plugin #547 Wed, 15 Oct, 13:07
Hudson Hudson build is back to normal: plugins-IT-with-maven-2.0.x » Maven Dependency Plugin #547 Wed, 15 Oct, 13:07
Hudson Hudson build is back to normal: plugins-IT-with-maven-2.0.x » Maven Clean Plugin #547 Wed, 15 Oct, 13:07
Hudson Hudson build is back to normal: plugins-IT-with-maven-2.0.x » Maven Deploy Plugin #547 Wed, 15 Oct, 13:07
Hudson Build failed in Hudson: plugins-IT-with-maven-2.0.x » Maven Changes Report Plugin #547 Wed, 15 Oct, 13:07
Hudson Hudson build is back to normal: plugins-IT-with-maven-2.0.x » Maven Checkstyle Plugin #547 Wed, 15 Oct, 13:07
Hudson Build failed in Hudson: plugins-IT-with-maven-2.0.x » Maven Assembly Plugin #547 Wed, 15 Oct, 13:07
Contin...@vmbuild.apache.org [continuum] BUILD SUCCESSFUL: Maven Integration Testing - Maven Integration Test Plugin :: Artifact - default maven2 buildDefinition Wed, 15 Oct, 20:48
Contin...@vmbuild.apache.org [continuum] BUILD ERROR: Maven Integration Testing - Maven Integration Test Plugin :: Class Loader :: Dependency A - default maven2 buildDefinition Wed, 15 Oct, 20:48
Contin...@vmbuild.apache.org [continuum] BUILD ERROR: Maven Integration Testing - Maven Integration Test Plugin :: Class Loader :: Dependency B - default maven2 buildDefinition Wed, 15 Oct, 20:48
Contin...@vmbuild.apache.org [continuum] BUILD ERROR: Maven Integration Testing - Maven Integration Test Plugin :: Class Loader - default maven2 buildDefinition Wed, 15 Oct, 20:48
Contin...@vmbuild.apache.org [continuum] BUILD ERROR: Maven Integration Testing - Maven Integration Test Plugin :: Class Loader :: Aggregator - default maven2 buildDefinition Wed, 15 Oct, 20:48
Contin...@vmbuild.apache.org [continuum] BUILD SUCCESSFUL: Maven Integration Testing - Maven Integration Test Plugin :: Expression - default maven2 buildDefinition Wed, 15 Oct, 20:49
Contin...@vmbuild.apache.org [continuum] BUILD SUCCESSFUL: Maven Integration Testing - Maven Integration Test Plugin :: Site - default maven2 buildDefinition Wed, 15 Oct, 20:49
Contin...@vmbuild.apache.org [continuum] BUILD FAILURE: Maven 2.0.x Branch - Integration Test Executor - default maven2 buildDefinition Wed, 15 Oct, 21:19
Contin...@vmbuild.apache.org [continuum] BUILD SUCCESSFUL: Maven Integration Testing - Maven Integration Test Plugin :: Class Loader - default maven2 buildDefinition Wed, 15 Oct, 21:31
Contin...@vmbuild.apache.org [continuum] BUILD SUCCESSFUL: Maven Integration Testing - Maven Integration Test Plugin :: Class Loader :: Dependency A - default maven2 buildDefinition Wed, 15 Oct, 21:31
Contin...@vmbuild.apache.org [continuum] BUILD SUCCESSFUL: Maven Integration Testing - Maven Integration Test Plugin :: Class Loader :: Aggregator - default maven2 buildDefinition Wed, 15 Oct, 21:32
Contin...@vmbuild.apache.org [continuum] BUILD SUCCESSFUL: Maven Integration Testing - Maven Integration Test Plugin :: Class Loader :: Dependency B - default maven2 buildDefinition Wed, 15 Oct, 21:32
Contin...@vmbuild.apache.org [continuum] BUILD ERROR: Maven 2.0.x Branch - Integration Test Executor - default maven2 buildDefinition Wed, 15 Oct, 21:52
Contin...@vmbuild.apache.org [continuum] BUILD FAILURE: Maven 2.0.x Branch - Integration Test Executor - default maven2 buildDefinition Wed, 15 Oct, 22:31
Contin...@vmbuild.apache.org [continuum] BUILD SUCCESSFUL: Maven 2.0.x Branch - Integration Test Executor - default maven2 buildDefinition Thu, 16 Oct, 00:11
Contin...@vmbuild.apache.org [continuum] BUILD FAILURE: Maven 2.0.x Branch - Integration Test Executor - default maven2 buildDefinition Thu, 16 Oct, 06:19
Contin...@vmbuild.apache.org [continuum] BUILD FAILURE: Maven 2.0.x Branch - Integration Test Executor - default maven2 buildDefinition Thu, 16 Oct, 08:16
Apache Hudson Server Build failed in Hudson: Maven-2.1.x-with-bootstrap #98 Thu, 16 Oct, 08:20
Apache Hudson Server Build failed in Hudson: Maven-2.1.x-with-bootstrap #99 Thu, 16 Oct, 09:52
Contin...@vmbuild.apache.org [continuum] BUILD FAILURE: Maven 2.0.x Branch - Integration Test Executor - default maven2 buildDefinition Thu, 16 Oct, 10:10
Contin...@vmbuild.apache.org [continuum] BUILD FAILURE: Maven 2.0.x Branch - Integration Test Executor - default maven2 buildDefinition Thu, 16 Oct, 11:54
Contin...@vmbuild.apache.org [continuum] BUILD FAILURE: Maven 2.0.x Branch - Integration Test Executor - default maven2 buildDefinition Thu, 16 Oct, 13:20
Contin...@vmbuild.apache.org [continuum] BUILD FAILURE: Maven 2.0.x Branch - Integration Test Executor - default maven2 buildDefinition Thu, 16 Oct, 15:18
Contin...@vmbuild.apache.org [continuum] BUILD FAILURE: Maven 2.0.x Branch - Integration Test Executor - default maven2 buildDefinition Thu, 16 Oct, 20:45
Contin...@vmbuild.apache.org [continuum] BUILD SUCCESSFUL: Maven 2.0.x Branch - Integration Test Executor - default maven2 buildDefinition Fri, 17 Oct, 03:16
Contin...@vmbuild.apache.org [continuum] BUILD FAILURE: Maven 2.0.x Branch - Integration Test Executor - default maven2 buildDefinition Fri, 17 Oct, 10:45
Contin...@vmbuild.apache.org [continuum] BUILD ERROR: Maven 2.0.x Branch - Integration Test Executor - default maven2 buildDefinition Fri, 17 Oct, 12:19
Contin...@vmbuild.apache.org [continuum] BUILD SUCCESSFUL: Maven Integration Testing - Unnamed - org.apache.maven.its.plugins:maven-it-plugin-plexus-utils-11:maven-plugin:2.1-SNAPSHOT - default maven2 buildDefinition Fri, 17 Oct, 12:20
Contin...@vmbuild.apache.org [continuum] BUILD SUCCESSFUL: Maven Integration Testing - Unnamed - org.apache.maven.its.plugins:maven-it-plugin-plexus-utils-new:maven-plugin:2.1-SNAPSHOT - default maven2 buildDefinition Fri, 17 Oct, 12:20
Contin...@vmbuild.apache.org [continuum] BUILD SUCCESSFUL: Maven Integration Testing - Maven Verifier Component - default maven2 buildDefinition Fri, 17 Oct, 12:21
Contin...@vmbuild.apache.org [continuum] BUILD SUCCESSFUL: Maven 2.0.x Branch - Integration Test Executor - default maven2 buildDefinition Fri, 17 Oct, 13:02
Hudson Hudson build is back to normal: maven-core-integration-testing » 1.5,ubuntu #8 Fri, 17 Oct, 15:40
Hudson Hudson build is back to normal: plugins-CI-with-maven-2.0.x » Maven Plugins #612 Sat, 18 Oct, 17:16
Hudson Build failed in Hudson: plugins-IT-with-maven-2.0.x » Maven AntRun Plugin #548 Sun, 19 Oct, 05:52
Hudson Build failed in Hudson: plugins-IT-with-maven-2.0.x » Maven Resources Plugin #548 Sun, 19 Oct, 05:52
Hudson Hudson build is back to normal: plugins-IT-with-maven-2.0.x » Maven Changes Report Plugin #548 Sun, 19 Oct, 05:52
Hudson Hudson build is back to normal: plugins-IT-with-maven-2.0.x » Maven Assembly Plugin #548 Sun, 19 Oct, 05:52
Hudson Build failed in Hudson: plugins-IT-with-maven-2.0.x » Maven WAR Plugin #548 Sun, 19 Oct, 05:52
Apache Hudson Server Build failed in Hudson: Maven-2.1.x-with-bootstrap #100 Mon, 20 Oct, 07:17
Apache Hudson Server Build failed in Hudson: Maven-2.1.x-with-bootstrap #101 Mon, 20 Oct, 08:20
Apache Hudson Server Build failed in Hudson: Maven-2.1.x-with-bootstrap #102 Mon, 20 Oct, 11:45
Apache Hudson Server Build failed in Hudson: Maven-2.1.x-with-bootstrap #103 Mon, 20 Oct, 21:57
Hudson Build failed in Hudson: plugins-IT-with-maven-2.0.x » Maven Resources Plugin #549 Tue, 21 Oct, 05:52
Hudson Build failed in Hudson: plugins-IT-with-maven-2.0.x » Maven AntRun Plugin #549 Tue, 21 Oct, 05:52
Hudson Build failed in Hudson: plugins-IT-with-maven-2.0.x » Maven WAR Plugin #549 Tue, 21 Oct, 05:52
Contin...@vmbuild.apache.org [continuum] BUILD FAILURE: Maven 2.0.x Branch - Integration Test Executor - default maven2 buildDefinition Tue, 21 Oct, 20:04
Contin...@vmbuild.apache.org [continuum] BUILD FAILURE: Maven 2.0.x Branch - Integration Test Executor - default maven2 buildDefinition Tue, 21 Oct, 21:56
Contin...@vmbuild.apache.org [continuum] BUILD FAILURE: Maven 2.0.x Branch - Integration Test Executor - default maven2 buildDefinition Tue, 21 Oct, 23:25
Contin...@vmbuild.apache.org [continuum] BUILD FAILURE: Maven 2.0.x Branch - Integration Test Executor - default maven2 buildDefinition Wed, 22 Oct, 19:06
Contin...@vmbuild.apache.org [continuum] BUILD FAILURE: Maven 2.0.x Branch - Integration Test Executor - default maven2 buildDefinition Fri, 24 Oct, 13:04
Contin...@vmbuild.apache.org [continuum] BUILD FAILURE: Maven 2.0.x Branch - Integration Test Executor - default maven2 buildDefinition Fri, 24 Oct, 15:13
Contin...@vmbuild.apache.org [continuum] BUILD FAILURE: Maven 2.0.x Branch - Integration Test Executor - default maven2 buildDefinition Fri, 24 Oct, 17:05
Contin...@vmbuild.apache.org [continuum] BUILD FAILURE: Maven 2.0.x Branch - Integration Test Executor - default maven2 buildDefinition Fri, 24 Oct, 19:01
Contin...@vmbuild.apache.org [continuum] BUILD FAILURE: Maven 2.0.x Branch - Integration Test Executor - default maven2 buildDefinition Sat, 25 Oct, 19:19
Contin...@vmbuild.apache.org [continuum] BUILD FAILURE: Maven Plugins - Maven JAR Plugin - default maven2 buildDefinition Sat, 25 Oct, 19:33
Hudson Build failed in Hudson: maven-core-integration-testing #218 Sat, 25 Oct, 21:03
Hudson Build failed in Hudson: maven-core-integration-testing » 1.5,windows #19 Sat, 25 Oct, 21:04
Message list« Previous · 1 · 2 · 3 · 4 · 5 · 6 · 7 · 8 · 9 · 10 · Next »Thread · Author · Date
Box list
Jun 2019800
May 2019164
Apr 2019444
Mar 2019521
Feb 2019358
Jan 2019902
Dec 2018538
Nov 2018312
Oct 2018312
Sep 2018385
Aug 2018809
Jul 20181085
Jun 2018202
May 2018255
Apr 2018349
Mar 2018268
Feb 2018159
Jan 2018174
Dec 2017394
Nov 2017258
Oct 2017217
Sep 2017297
Aug 2017228
Jul 2017191
Jun 2017224
May 2017291
Apr 2017746
Mar 2017452
Feb 2017537
Jan 2017673
Dec 2016445
Nov 2016240
Oct 2016233
Sep 2016193
Aug 2016360
Jul 2016306
Jun 2016436
May 2016467
Apr 2016265
Mar 2016117
Feb 2016451
Jan 2016363
Dec 2015761
Nov 2015187
Oct 2015491
Sep 2015384
Aug 2015194
Jul 2015361
Jun 2015274
May 2015197
Apr 2015367
Mar 2015273
Feb 2015179
Jan 2015399
Dec 2014420
Nov 2014618
Oct 2014426
Sep 2014304
Aug 2014246
Jul 2014317
Jun 2014341
May 2014161
Apr 2014146
Mar 2014336
Feb 2014308
Jan 2014189
Dec 2013319
Nov 2013274
Oct 2013167
Sep 2013486
Aug 2013263
Jul 2013726
Jun 2013722
May 2013378
Apr 2013313
Mar 2013467
Feb 2013520
Jan 20131437
Dec 20121778
Nov 2012775
Oct 20121224
Sep 2012791
Aug 2012362
Jul 2012232
Jun 2012149
May 2012189
Apr 2012115
Mar 201257
Feb 2012155
Jan 2012170
Dec 2011244
Nov 2011187
Oct 2011139
Sep 2011190
Aug 2011276
Jul 201194
Jun 20114
Apr 201162
Mar 201176
Feb 201154
Jan 201185
Dec 201079
Nov 201061
Oct 201058
Sep 20101
Aug 201057
Jul 201037
Jun 201020
May 201075
Apr 201053
Mar 201012
Feb 201030
Jan 201071
Dec 2009104
Nov 200919
Oct 200931
Sep 2009193
Aug 2009268
Jul 2009193
Jun 2009147
May 200975
Apr 200979
Mar 2009134
Feb 2009657
Jan 200983
Dec 2008349
Nov 2008288
Oct 2008986
Sep 2008842
Aug 2008707
Jul 2008887
Jun 2008167
May 200821
Apr 2008231
Mar 2008438
Feb 2008317
Jan 2008205
Dec 2007185
Nov 2007532
Oct 2007439
Sep 2007699
Aug 20071294
Jul 2007351
Jun 20072211
May 2007273
Apr 2007262
Mar 2007534
Feb 20071648
Jan 20072359
Dec 2006575
Nov 2006357
Oct 2006642
Sep 2006660
Aug 20061662
Jul 20061320
Jun 2006473
May 20064700
Apr 20061113
Mar 20061048