maven-notifications mailing list archives

Site index · List index
Message view « Date » · « Thread »
Top « Date » · « Thread »
From Hudson <Hud...@sonatype.org>
Subject Build failed in Hudson: mercury #135
Date Wed, 05 Nov 2008 06:48:38 GMT
See http://ci.sonatype.org/job/mercury/135/changes

Changes:

[ogusakov] uprev to jetty 6.1.12

[ogusakov] switched to flawed, but better logging. Got rid of slf4j

------------------------------------------
[...truncated 1266 lines...]
Downloading: http://localhost:8081/content/groups/public/stax/stax-api/1.0.1/stax-api-1.0.1.pom
Downloading: http://localhost:8081/content/groups/public/javax/xml/stream/stax-api/1.0-2/stax-api-1.0-2.pom
962b downloaded
Downloading: http://repository.sonatype.org/content/groups/public/org/apache/maven/maven-mercury/3.0-SNAPSHOT/maven-mercury-3.0-20081104.000710-1.jar
23K downloaded
Downloading: http://repository.sonatype.org/content/groups/public/org/apache/maven/maven-project-builder/3.0-SNAPSHOT/maven-project-builder-3.0-20081104.001322-2.jar
133K downloaded
Downloading: http://repository.sonatype.org/content/groups/public/org/apache/maven/shared/maven-shared-model/1.0-SNAPSHOT/maven-shared-model-1.0-20081104.001322-3.jar
34K downloaded
Downloading: http://localhost:8081/content/groups/public/org/codehaus/woodstox/wstx-asl/3.2.6/wstx-asl-3.2.6.jar
508K downloaded
Downloading: http://localhost:8081/content/groups/public/stax/stax-api/1.0.1/stax-api-1.0.1.jar
25K downloaded
Downloading: http://localhost:8081/content/groups/public/javax/xml/stream/stax-api/1.0-2/stax-api-1.0-2.jar
22K downloaded
[INFO] [compiler:compile]
[INFO] Compiling 6 source files to http://ci.sonatype.org/job/mercury/ws/mercury/mercury-repo/mercury-repo-local-m2/target/classes

[INFO] [resources:testResources]
[INFO] Using default encoding to copy filtered resources.
Downloading: http://localhost:8081/content/groups/public/commons-digester/commons-digester/1.8/commons-digester-1.8.jar
140K downloaded
Downloading: http://localhost:8081/content/groups/public/commons-beanutils/commons-beanutils/1.7.0/commons-beanutils-1.7.0.jar
184K downloaded
Downloading: http://localhost:8081/content/groups/public/commons-logging/commons-logging/1.1/commons-logging-1.1.jar
51K downloaded
Downloading: http://localhost:8081/content/groups/public/log4j/log4j/1.2.12/log4j-1.2.12.jar
349K downloaded
Downloading: http://localhost:8081/content/groups/public/logkit/logkit/1.0.1/logkit-1.0.1.jar
70K downloaded
Downloading: http://localhost:8081/content/groups/public/avalon-framework/avalon-framework/4.1.3/avalon-framework-4.1.3.jar
62K downloaded
Downloading: http://localhost:8081/content/groups/public/javax/servlet/servlet-api/2.3/servlet-api-2.3.jar
76K downloaded
[INFO] [compiler:testCompile]
[INFO] Compiling 1 source file to http://ci.sonatype.org/job/mercury/ws/mercury/mercury-repo/mercury-repo-local-m2/target/test-classes

[INFO] [surefire:test]
[INFO] Surefire report directory: http://ci.sonatype.org/job/mercury/ws/mercury/mercury-repo/mercury-repo-local-m2/target/surefire-reports


-------------------------------------------------------
 T E S T S
-------------------------------------------------------
There are no tests to run.

Results :

Tests run: 0, Failures: 0, Errors: 0, Skipped: 0

[INFO] [jar:jar]
[INFO] Building jar: http://ci.sonatype.org/job/mercury/ws/mercury/mercury-repo/mercury-repo-local-m2/target/mercury-repo-local-m2-1.0.0-alpha-2-SNAPSHOT.jar

[INFO] [jar:test-jar {execution: package-tests}]
[INFO] Building jar: http://ci.sonatype.org/job/mercury/ws/mercury/mercury-repo/mercury-repo-local-m2/target/mercury-repo-local-m2-1.0.0-alpha-2-SNAPSHOT-tests.jar

[INFO] [install:install]
[INFO] Installing http://ci.sonatype.org/job/mercury/ws/mercury/mercury-repo/mercury-repo-local-m2/target/mercury-repo-local-m2-1.0.0-alpha-2-SNAPSHOT.jar
 to /home/j2ee-hudson/repos/mercury/org/apache/maven/mercury/mercury-repo-local-m2/1.0.0-alpha-2-SNAPSHOT/mercury-repo-local-m2-1.0.0-alpha-2-SNAPSHOT.jar
[INFO] Installing http://ci.sonatype.org/job/mercury/ws/mercury/mercury-repo/mercury-repo-local-m2/target/mercury-repo-local-m2-1.0.0-alpha-2-SNAPSHOT-tests.jar
 to /home/j2ee-hudson/repos/mercury/org/apache/maven/mercury/mercury-repo-local-m2/1.0.0-alpha-2-SNAPSHOT/mercury-repo-local-m2-1.0.0-alpha-2-SNAPSHOT-tests.jar
[INFO] [deploy:deploy]
altDeploymentRepository = null
[INFO] Retrieving previous build number from apache.snapshots
Uploading: http://localhost:8081/content/repositories/maven.snapshots/org/apache/maven/mercury/mercury-repo-local-m2/1.0.0-alpha-2-SNAPSHOT/mercury-repo-local-m2-1.0.0-alpha-2-20081105.064735-44.jar
22K uploaded
[INFO] Retrieving previous metadata from apache.snapshots
[INFO] Uploading repository metadata for: 'snapshot org.apache.maven.mercury:mercury-repo-local-m2:1.0.0-alpha-2-SNAPSHOT'
[INFO] Retrieving previous metadata from apache.snapshots
[INFO] Uploading repository metadata for: 'artifact org.apache.maven.mercury:mercury-repo-local-m2'
[INFO] Uploading project information for mercury-repo-local-m2 1.0.0-alpha-2-20081105.064735-44
[INFO] Retrieving previous build number from apache.snapshots
Uploading: http://localhost:8081/content/repositories/maven.snapshots/org/apache/maven/mercury/mercury-repo-local-m2/1.0.0-alpha-2-SNAPSHOT/mercury-repo-local-m2-1.0.0-alpha-2-20081105.064735-44-tests.jar
180K uploaded
[INFO] ------------------------------------------------------------------------
[INFO] Building Mercury Jetty HTTP Transport:   1.0.0-alpha-2-SNAPSHOT
[INFO]    task-segment: [clean, deploy]
[INFO] ------------------------------------------------------------------------
[INFO] [clean:clean]
[INFO] Deleting directory http://ci.sonatype.org/job/mercury/ws/mercury/mercury-transport/mercury-transport-http/target

[INFO] [resources:resources]
[INFO] Using default encoding to copy filtered resources.
Downloading: http://localhost:8081/content/groups/public/org/mortbay/jetty/jetty-client/6.1.12/jetty-client-6.1.12.pom
Downloading: http://repository.sonatype.org/content/repositories/staging/org/mortbay/jetty/jetty-client/6.1.12/jetty-client-6.1.12.pom
Downloading: http://repository.sonatype.org/content/groups/public/org/mortbay/jetty/jetty-client/6.1.12/jetty-client-6.1.12.pom
Downloading: http://localhost:8081/content/groups/public/org/mortbay/jetty/servlet-api-2.5/6.1.12/servlet-api-2.5-6.1.12.pom
Downloading: http://repository.sonatype.org/content/repositories/staging/org/mortbay/jetty/servlet-api-2.5/6.1.12/servlet-api-2.5-6.1.12.pom
Downloading: http://repository.sonatype.org/content/groups/public/org/mortbay/jetty/servlet-api-2.5/6.1.12/servlet-api-2.5-6.1.12.pom
Downloading: http://localhost:8081/content/groups/public/org/mortbay/jetty/jetty-servlet-tester/6.1.12/jetty-servlet-tester-6.1.12.pom
Downloading: http://repository.sonatype.org/content/repositories/staging/org/mortbay/jetty/jetty-servlet-tester/6.1.12/jetty-servlet-tester-6.1.12.pom
Downloading: http://repository.sonatype.org/content/groups/public/org/mortbay/jetty/jetty-servlet-tester/6.1.12/jetty-servlet-tester-6.1.12.pom
Downloading: http://localhost:8081/content/groups/public/org/mortbay/jetty/jetty-client/6.1.12/jetty-client-6.1.12.jar
Downloading: http://repository.sonatype.org/content/repositories/staging/org/mortbay/jetty/jetty-client/6.1.12/jetty-client-6.1.12.jar
Downloading: http://repository.sonatype.org/content/groups/public/org/mortbay/jetty/jetty-client/6.1.12/jetty-client-6.1.12.jar
Downloading: http://localhost:8081/content/groups/public/org/mortbay/jetty/servlet-api-2.5/6.1.12/servlet-api-2.5-6.1.12.jar
Downloading: http://repository.sonatype.org/content/repositories/staging/org/mortbay/jetty/servlet-api-2.5/6.1.12/servlet-api-2.5-6.1.12.jar
Downloading: http://repository.sonatype.org/content/groups/public/org/mortbay/jetty/servlet-api-2.5/6.1.12/servlet-api-2.5-6.1.12.jar
[INFO] ------------------------------------------------------------------------
[ERROR] BUILD ERROR
[INFO] ------------------------------------------------------------------------
[INFO] Failed to resolve artifact.

Missing:
----------
1) org.mortbay.jetty:jetty-client:jar:6.1.12

  Try downloading the file manually from the project website.

  Then, install it using the command: 
      mvn install:install-file -DgroupId=org.mortbay.jetty -DartifactId=jetty-client -Dversion=6.1.12
-Dpackaging=jar -Dfile=/path/to/file

  Alternatively, if you host your own repository you can deploy the file there: 
      mvn deploy:deploy-file -DgroupId=org.mortbay.jetty -DartifactId=jetty-client -Dversion=6.1.12
-Dpackaging=jar -Dfile=/path/to/file -Durl=[url] -DrepositoryId=[id]

  Path to dependency: 
  	1) org.apache.maven.mercury:mercury-transport-http:jar:1.0.0-alpha-2-SNAPSHOT
  	2) org.mortbay.jetty:jetty-client:jar:6.1.12

2) org.mortbay.jetty:servlet-api-2.5:jar:6.1.12

  Try downloading the file manually from the project website.

  Then, install it using the command: 
      mvn install:install-file -DgroupId=org.mortbay.jetty -DartifactId=servlet-api-2.5 -Dversion=6.1.12
-Dpackaging=jar -Dfile=/path/to/file

  Alternatively, if you host your own repository you can deploy the file there: 
      mvn deploy:deploy-file -DgroupId=org.mortbay.jetty -DartifactId=servlet-api-2.5 -Dversion=6.1.12
-Dpackaging=jar -Dfile=/path/to/file -Durl=[url] -DrepositoryId=[id]

  Path to dependency: 
  	1) org.apache.maven.mercury:mercury-transport-http:jar:1.0.0-alpha-2-SNAPSHOT
  	2) org.mortbay.jetty:servlet-api-2.5:jar:6.1.12

----------
2 required artifacts are missing.

for artifact: 
  org.apache.maven.mercury:mercury-transport-http:jar:1.0.0-alpha-2-SNAPSHOT

from the specified remote repositories:
  sona.staging (http://repository.sonatype.org/content/repositories/staging),
  Nexus (http://localhost:8081/content/groups/public),
  sona.central (http://repository.sonatype.org/content/groups/public)


[INFO] ------------------------------------------------------------------------
[INFO] Trace
org.apache.maven.lifecycle.LifecycleExecutionException: Missing:
----------
1) org.mortbay.jetty:jetty-client:jar:6.1.12

  Try downloading the file manually from the project website.

  Then, install it using the command: 
      mvn install:install-file -DgroupId=org.mortbay.jetty -DartifactId=jetty-client -Dversion=6.1.12
-Dpackaging=jar -Dfile=/path/to/file

  Alternatively, if you host your own repository you can deploy the file there: 
      mvn deploy:deploy-file -DgroupId=org.mortbay.jetty -DartifactId=jetty-client -Dversion=6.1.12
-Dpackaging=jar -Dfile=/path/to/file -Durl=[url] -DrepositoryId=[id]

  Path to dependency: 
  	1) org.apache.maven.mercury:mercury-transport-http:jar:1.0.0-alpha-2-SNAPSHOT
  	2) org.mortbay.jetty:jetty-client:jar:6.1.12

2) org.mortbay.jetty:servlet-api-2.5:jar:6.1.12

  Try downloading the file manually from the project website.

  Then, install it using the command: 
      mvn install:install-file -DgroupId=org.mortbay.jetty -DartifactId=servlet-api-2.5 -Dversion=6.1.12
-Dpackaging=jar -Dfile=/path/to/file

  Alternatively, if you host your own repository you can deploy the file there: 
      mvn deploy:deploy-file -DgroupId=org.mortbay.jetty -DartifactId=servlet-api-2.5 -Dversion=6.1.12
-Dpackaging=jar -Dfile=/path/to/file -Durl=[url] -DrepositoryId=[id]

  Path to dependency: 
  	1) org.apache.maven.mercury:mercury-transport-http:jar:1.0.0-alpha-2-SNAPSHOT
  	2) org.mortbay.jetty:servlet-api-2.5:jar:6.1.12

----------
2 required artifacts are missing.

for artifact: 
  org.apache.maven.mercury:mercury-transport-http:jar:1.0.0-alpha-2-SNAPSHOT

from the specified remote repositories:
  sona.staging (http://repository.sonatype.org/content/repositories/staging),
  Nexus (http://localhost:8081/content/groups/public),
  sona.central (http://repository.sonatype.org/content/groups/public)

	at org.apache.maven.lifecycle.DefaultLifecycleExecutor.executeGoals(DefaultLifecycleExecutor.java:575)
	at org.apache.maven.lifecycle.DefaultLifecycleExecutor.executeGoalWithLifecycle(DefaultLifecycleExecutor.java:499)
	at org.apache.maven.lifecycle.DefaultLifecycleExecutor.executeGoal(DefaultLifecycleExecutor.java:478)
	at org.apache.maven.lifecycle.DefaultLifecycleExecutor.executeGoalAndHandleFailures(DefaultLifecycleExecutor.java:330)
	at org.apache.maven.lifecycle.DefaultLifecycleExecutor.executeTaskSegments(DefaultLifecycleExecutor.java:291)
	at org.apache.maven.lifecycle.DefaultLifecycleExecutor.execute(DefaultLifecycleExecutor.java:142)
	at org.apache.maven.DefaultMaven.doExecute(DefaultMaven.java:336)
	at org.apache.maven.DefaultMaven.execute(DefaultMaven.java:129)
	at org.apache.maven.cli.MavenCli.main(MavenCli.java:287)
	at sun.reflect.NativeMethodAccessorImpl.invoke0(Native Method)
	at sun.reflect.NativeMethodAccessorImpl.invoke(NativeMethodAccessorImpl.java:39)
	at sun.reflect.DelegatingMethodAccessorImpl.invoke(DelegatingMethodAccessorImpl.java:25)
	at java.lang.reflect.Method.invoke(Method.java:585)
	at org.codehaus.classworlds.Launcher.launchEnhanced(Launcher.java:315)
	at org.codehaus.classworlds.Launcher.launch(Launcher.java:255)
	at org.codehaus.classworlds.Launcher.mainWithExitCode(Launcher.java:430)
	at org.codehaus.classworlds.Launcher.main(Launcher.java:375)
Caused by: org.apache.maven.artifact.resolver.MultipleArtifactsNotFoundException: Missing:
----------
1) org.mortbay.jetty:jetty-client:jar:6.1.12

  Try downloading the file manually from the project website.

  Then, install it using the command: 
      mvn install:install-file -DgroupId=org.mortbay.jetty -DartifactId=jetty-client -Dversion=6.1.12
-Dpackaging=jar -Dfile=/path/to/file

  Alternatively, if you host your own repository you can deploy the file there: 
      mvn deploy:deploy-file -DgroupId=org.mortbay.jetty -DartifactId=jetty-client -Dversion=6.1.12
-Dpackaging=jar -Dfile=/path/to/file -Durl=[url] -DrepositoryId=[id]

  Path to dependency: 
  	1) org.apache.maven.mercury:mercury-transport-http:jar:1.0.0-alpha-2-SNAPSHOT
  	2) org.mortbay.jetty:jetty-client:jar:6.1.12

2) org.mortbay.jetty:servlet-api-2.5:jar:6.1.12

  Try downloading the file manually from the project website.

  Then, install it using the command: 
      mvn install:install-file -DgroupId=org.mortbay.jetty -DartifactId=servlet-api-2.5 -Dversion=6.1.12
-Dpackaging=jar -Dfile=/path/to/file

  Alternatively, if you host your own repository you can deploy the file there: 
      mvn deploy:deploy-file -DgroupId=org.mortbay.jetty -DartifactId=servlet-api-2.5 -Dversion=6.1.12
-Dpackaging=jar -Dfile=/path/to/file -Durl=[url] -DrepositoryId=[id]

  Path to dependency: 
  	1) org.apache.maven.mercury:mercury-transport-http:jar:1.0.0-alpha-2-SNAPSHOT
  	2) org.mortbay.jetty:servlet-api-2.5:jar:6.1.12

----------
2 required artifacts are missing.

for artifact: 
  org.apache.maven.mercury:mercury-transport-http:jar:1.0.0-alpha-2-SNAPSHOT

from the specified remote repositories:
  sona.staging (http://repository.sonatype.org/content/repositories/staging),
  Nexus (http://localhost:8081/content/groups/public),
  sona.central (http://repository.sonatype.org/content/groups/public)

	at org.apache.maven.artifact.resolver.DefaultArtifactResolver.resolveTransitively(DefaultArtifactResolver.java:324)
	at org.apache.maven.artifact.resolver.DefaultArtifactResolver.resolveTransitively(DefaultArtifactResolver.java:288)
	at org.apache.maven.plugin.DefaultPluginManager.resolveTransitiveDependencies(DefaultPluginManager.java:1415)
	at org.apache.maven.plugin.DefaultPluginManager.executeMojo(DefaultPluginManager.java:405)
	at org.apache.maven.lifecycle.DefaultLifecycleExecutor.executeGoals(DefaultLifecycleExecutor.java:558)
	... 16 more
[INFO] ------------------------------------------------------------------------
[INFO] Total time: 1 minute 10 seconds
[INFO] Finished at: Wed Nov 05 00:48:37 CST 2008
[INFO] Final Memory: 48M/128M
[INFO] ------------------------------------------------------------------------


Mime
View raw message