maven-notifications mailing list archives

Site index · List index
Message view « Date » · « Thread »
Top « Date » · « Thread »
From Hudson <Hud...@sonatype.org>
Subject Build failed in Hudson: maven-core-integration-testing » 1.5,jeos1 #42
Date Wed, 05 Nov 2008 02:01:48 GMT
See http://grid.sonatype.com/ci/job/maven-core-integration-testing/./jdk=1.5,label=jeos1/42/changes

Changes:

[Benjamin Bentmann] o Decoupled IT for MNG-3134 from production plugins

------------------------------------------
[...truncated 95 lines...]
[INFO] Using encoding: 'UTF-8' to copy filtered resources.
[INFO] [compiler:testCompile]
[INFO] No sources to compile
[INFO] [surefire:test]
[INFO] Surefire report directory: /home/hudson/workspace/maven-core-integration-testing/jdk/1.5/label/jeos1/maven-its/core-it-support/maven-it-helper/target/surefire-reports

-------------------------------------------------------
 T E S T S
-------------------------------------------------------
There are no tests to run.

Results :

Tests run: 0, Failures: 0, Errors: 0, Skipped: 0

[INFO] [jar:jar]
[INFO] Building jar: /home/hudson/workspace/maven-core-integration-testing/jdk/1.5/label/jeos1/maven-its/core-it-support/maven-it-helper/target/maven-it-helper-2.1-SNAPSHOT.jar
[INFO] [install:install]
[INFO] Installing /home/hudson/workspace/maven-core-integration-testing/jdk/1.5/label/jeos1/maven-its/core-it-support/maven-it-helper/target/maven-it-helper-2.1-SNAPSHOT.jar
to /opt/repos/local-repository/org/apache/maven/its/maven-it-helper/2.1-SNAPSHOT/maven-it-helper-2.1-SNAPSHOT.jar
[INFO] [deploy:deploy]
altDeploymentRepository = null
[INFO] Retrieving previous build number from apache.snapshots
Uploading: http://repository.sonatype.org:8081/content/repositories/maven.snapshots/org/apache/maven/its/maven-it-helper/2.1-SNAPSHOT/maven-it-helper-2.1-20081105.020137-62.jar
9K uploaded
[INFO] Uploading project information for maven-it-helper 2.1-20081105.020137-62
[INFO] Retrieving previous metadata from apache.snapshots
[INFO] Uploading repository metadata for: 'snapshot org.apache.maven.its:maven-it-helper:2.1-SNAPSHOT'
[INFO] Retrieving previous metadata from apache.snapshots
[INFO] Uploading repository metadata for: 'artifact org.apache.maven.its:maven-it-helper'
[INFO] ------------------------------------------------------------------------
[INFO] Building Maven Integration Tests :: Plugins
[INFO]    task-segment: [clean, deploy]
[INFO] ------------------------------------------------------------------------
[INFO] [clean:clean]
[INFO] Deleting directory /home/hudson/workspace/maven-core-integration-testing/jdk/1.5/label/jeos1/maven-its/core-it-support/core-it-plugins/target
[INFO] [remote-resources:process {execution: default}]
[INFO] [site:attach-descriptor]
[INFO] [install:install]
[INFO] Installing /home/hudson/workspace/maven-core-integration-testing/jdk/1.5/label/jeos1/maven-its/core-it-support/core-it-plugins/pom.xml
to /opt/repos/local-repository/org/apache/maven/its/plugins/maven-it-plugins/2.1-SNAPSHOT/maven-it-plugins-2.1-SNAPSHOT.pom
[INFO] [deploy:deploy]
altDeploymentRepository = null
[INFO] Retrieving previous build number from apache.snapshots
Uploading: http://repository.sonatype.org:8081/content/repositories/maven.snapshots/org/apache/maven/its/plugins/maven-it-plugins/2.1-SNAPSHOT/maven-it-plugins-2.1-20081105.020137-178.pom
3K uploaded
[INFO] Retrieving previous metadata from apache.snapshots
[INFO] Uploading repository metadata for: 'artifact org.apache.maven.its.plugins:maven-it-plugins'
[INFO] Retrieving previous metadata from apache.snapshots
[INFO] Uploading repository metadata for: 'snapshot org.apache.maven.its.plugins:maven-it-plugins:2.1-SNAPSHOT'
[INFO] ------------------------------------------------------------------------
[INFO] Building Maven Integration Tests :: Core Plugin Stubs
[INFO]    task-segment: [clean, deploy]
[INFO] ------------------------------------------------------------------------
[INFO] [clean:clean]
[INFO] Deleting directory /home/hudson/workspace/maven-core-integration-testing/jdk/1.5/label/jeos1/maven-its/core-it-support/core-it-plugins/maven-it-plugin-core-stubs/target
[INFO] [remote-resources:process {execution: default}]
[INFO] [site:attach-descriptor]
[INFO] [install:install]
[INFO] Installing /home/hudson/workspace/maven-core-integration-testing/jdk/1.5/label/jeos1/maven-its/core-it-support/core-it-plugins/maven-it-plugin-core-stubs/pom.xml
to /opt/repos/local-repository/org/apache/maven/its/plugins/maven-it-plugin-core-stubs/2.1-SNAPSHOT/maven-it-plugin-core-stubs-2.1-SNAPSHOT.pom
[INFO] [deploy:deploy]
altDeploymentRepository = null
[INFO] Retrieving previous build number from apache.snapshots
Uploading: http://repository.sonatype.org:8081/content/repositories/maven.snapshots/org/apache/maven/its/plugins/maven-it-plugin-core-stubs/2.1-SNAPSHOT/maven-it-plugin-core-stubs-2.1-20081105.020137-64.pom
1K uploaded
[INFO] Retrieving previous metadata from apache.snapshots
[INFO] Uploading repository metadata for: 'artifact org.apache.maven.its.plugins:maven-it-plugin-core-stubs'
[INFO] Retrieving previous metadata from apache.snapshots
[INFO] Uploading repository metadata for: 'snapshot org.apache.maven.its.plugins:maven-it-plugin-core-stubs:2.1-SNAPSHOT'
[INFO] ------------------------------------------------------------------------
[INFO] Building Maven Integration Test Plugin :: Maven Surefire Plugin Stub
[INFO]    task-segment: [clean, deploy]
[INFO] ------------------------------------------------------------------------
[INFO] [clean:clean]
[INFO] Deleting directory /home/hudson/workspace/maven-core-integration-testing/jdk/1.5/label/jeos1/maven-its/core-it-support/core-it-plugins/maven-it-plugin-core-stubs/maven-surefire-plugin/target
[INFO] [plugin:descriptor]
[INFO] Using 2 extractors.
[INFO] Applying extractor for language: java
[INFO] Extractor for language: java found 1 mojo descriptors.
[INFO] Applying extractor for language: bsh
[INFO] Extractor for language: bsh found 0 mojo descriptors.
[INFO] [remote-resources:process {execution: default}]
[INFO] [resources:resources]
[INFO] Using encoding: 'UTF-8' to copy filtered resources.
[INFO] [compiler:compile]
[INFO] Compiling 1 source file to /home/hudson/workspace/maven-core-integration-testing/jdk/1.5/label/jeos1/maven-its/core-it-support/core-it-plugins/maven-it-plugin-core-stubs/maven-surefire-plugin/target/classes
[INFO] [resources:testResources]
[INFO] Using encoding: 'UTF-8' to copy filtered resources.
[INFO] [compiler:testCompile]
[INFO] Not compiling test sources
[INFO] [surefire:test]
[INFO] Tests are skipped.
[INFO] [jar:jar]
[INFO] Building jar: /home/hudson/workspace/maven-core-integration-testing/jdk/1.5/label/jeos1/maven-its/core-it-support/core-it-plugins/maven-it-plugin-core-stubs/maven-surefire-plugin/target/maven-surefire-plugin-0.1-stub-SNAPSHOT.jar
[INFO] [plugin:addPluginArtifactMetadata]
[INFO] [install:install]
[INFO] Installing /home/hudson/workspace/maven-core-integration-testing/jdk/1.5/label/jeos1/maven-its/core-it-support/core-it-plugins/maven-it-plugin-core-stubs/maven-surefire-plugin/target/maven-surefire-plugin-0.1-stub-SNAPSHOT.jar
to /opt/repos/local-repository/org/apache/maven/plugins/maven-surefire-plugin/0.1-stub-SNAPSHOT/maven-surefire-plugin-0.1-stub-SNAPSHOT.jar
[INFO] [plugin:updateRegistry]
[INFO] [deploy:deploy]
altDeploymentRepository = null
[INFO] Retrieving previous build number from apache.snapshots
Uploading: http://repository.sonatype.org:8081/content/repositories/maven.snapshots/org/apache/maven/plugins/maven-surefire-plugin/0.1-stub-SNAPSHOT/maven-surefire-plugin-0.1-stub-20081105.020137-64.jar
9K uploaded
[INFO] Retrieving previous metadata from apache.snapshots
[INFO] Uploading repository metadata for: 'snapshot org.apache.maven.plugins:maven-surefire-plugin:0.1-stub-SNAPSHOT'
[INFO] Uploading project information for maven-surefire-plugin 0.1-stub-20081105.020137-64
[INFO] Retrieving previous metadata from apache.snapshots
[INFO] Uploading repository metadata for: 'org.apache.maven.plugins'
[INFO] Retrieving previous metadata from apache.snapshots
[INFO] Uploading repository metadata for: 'artifact org.apache.maven.plugins:maven-surefire-plugin'
[INFO] ------------------------------------------------------------------------
[INFO] Building Maven Integration Test Plugin :: Maven JAR Plugin Stub
[INFO]    task-segment: [clean, deploy]
[INFO] ------------------------------------------------------------------------
[INFO] [clean:clean]
[INFO] Deleting directory /home/hudson/workspace/maven-core-integration-testing/jdk/1.5/label/jeos1/maven-its/core-it-support/core-it-plugins/maven-it-plugin-core-stubs/maven-jar-plugin/target
[INFO] [plugin:descriptor]
[INFO] Using 2 extractors.
[INFO] Applying extractor for language: java
[INFO] Extractor for language: java found 1 mojo descriptors.
[INFO] Applying extractor for language: bsh
[INFO] Extractor for language: bsh found 0 mojo descriptors.
[INFO] [remote-resources:process {execution: default}]
[INFO] [resources:resources]
[INFO] Using encoding: 'UTF-8' to copy filtered resources.
[INFO] [compiler:compile]
[INFO] Compiling 1 source file to /home/hudson/workspace/maven-core-integration-testing/jdk/1.5/label/jeos1/maven-its/core-it-support/core-it-plugins/maven-it-plugin-core-stubs/maven-jar-plugin/target/classes
[INFO] [resources:testResources]
[INFO] Using encoding: 'UTF-8' to copy filtered resources.
[INFO] [compiler:testCompile]
[INFO] Not compiling test sources
[INFO] [surefire:test]
[INFO] Tests are skipped.
[INFO] [jar:jar]
[INFO] Building jar: /home/hudson/workspace/maven-core-integration-testing/jdk/1.5/label/jeos1/maven-its/core-it-support/core-it-plugins/maven-it-plugin-core-stubs/maven-jar-plugin/target/maven-jar-plugin-0.1-stub-SNAPSHOT.jar
[INFO] [plugin:addPluginArtifactMetadata]
[INFO] [install:install]
[INFO] Installing /home/hudson/workspace/maven-core-integration-testing/jdk/1.5/label/jeos1/maven-its/core-it-support/core-it-plugins/maven-it-plugin-core-stubs/maven-jar-plugin/target/maven-jar-plugin-0.1-stub-SNAPSHOT.jar
to /opt/repos/local-repository/org/apache/maven/plugins/maven-jar-plugin/0.1-stub-SNAPSHOT/maven-jar-plugin-0.1-stub-SNAPSHOT.jar
[INFO] [plugin:updateRegistry]
[INFO] [deploy:deploy]
altDeploymentRepository = null
[INFO] Retrieving previous build number from apache.snapshots
Uploading: http://repository.sonatype.org:8081/content/repositories/maven.snapshots/org/apache/maven/plugins/maven-jar-plugin/0.1-stub-SNAPSHOT/maven-jar-plugin-0.1-stub-20081105.020137-64.jar
9K uploaded
[INFO] Retrieving previous metadata from apache.snapshots
[INFO] Uploading repository metadata for: 'artifact org.apache.maven.plugins:maven-jar-plugin'
[INFO] Retrieving previous metadata from apache.snapshots
[INFO] Uploading repository metadata for: 'org.apache.maven.plugins'
[INFO] Uploading project information for maven-jar-plugin 0.1-stub-20081105.020137-64
[INFO] Retrieving previous metadata from apache.snapshots
[INFO] Uploading repository metadata for: 'snapshot org.apache.maven.plugins:maven-jar-plugin:0.1-stub-SNAPSHOT'
[INFO] ------------------------------------------------------------------------
[INFO] Building Maven Integration Tests
[INFO]    task-segment: [clean, deploy]
[INFO] ------------------------------------------------------------------------
[INFO] [clean:clean]
[INFO] Deleting directory /home/hudson/workspace/maven-core-integration-testing/jdk/1.5/label/jeos1/maven-its/core-it-suite/target
[INFO] [remote-resources:process {execution: default}]
[INFO] [resources:resources]
[INFO] Using encoding: 'UTF-8' to copy filtered resources.
[INFO] [compiler:compile]
[INFO] No sources to compile
[INFO] [resources:testResources]
[INFO] Using encoding: 'UTF-8' to copy filtered resources.
[INFO] [compiler:testCompile]
[INFO] Compiling 207 source files to /home/hudson/workspace/maven-core-integration-testing/jdk/1.5/label/jeos1/maven-its/core-it-suite/target/test-classes
[INFO] ------------------------------------------------------------------------
[ERROR] BUILD FAILURE
[INFO] ------------------------------------------------------------------------
[INFO] Compilation failure

/home/hudson/workspace/maven-core-integration-testing/jdk/1.5/label/jeos1/maven-its/core-it-suite/src/test/java/org/apache/maven/it/MavenITmng2883LegacyRepoOfflineTest.java:[66,53]
cannot find symbol
symbol  : method newDefaultFilterProperties()
location: class org.apache.maven.it.Verifier

/home/hudson/workspace/maven-core-integration-testing/jdk/1.5/label/jeos1/maven-its/core-it-suite/src/test/java/org/apache/maven/it/MavenITmng2883LegacyRepoOfflineTest.java:[165,53]
cannot find symbol
symbol  : method newDefaultFilterProperties()
location: class org.apache.maven.it.Verifier

/home/hudson/workspace/maven-core-integration-testing/jdk/1.5/label/jeos1/maven-its/core-it-suite/src/test/java/org/apache/maven/it/MavenITmng2883LegacyRepoOfflineTest.java:[266,53]
cannot find symbol
symbol  : method newDefaultFilterProperties()
location: class org.apache.maven.it.Verifier

/home/hudson/workspace/maven-core-integration-testing/jdk/1.5/label/jeos1/maven-its/core-it-suite/src/test/java/org/apache/maven/it/MavenITmng3052DepRepoAggregationTest.java:[72,41]
cannot find symbol
symbol  : method newDefaultFilterProperties()
location: class org.apache.maven.it.Verifier

/home/hudson/workspace/maven-core-integration-testing/jdk/1.5/label/jeos1/maven-its/core-it-suite/src/test/java/org/apache/maven/it/MavenITmng3052DepRepoAggregationTest.java:[73,16]
cannot find symbol
symbol  : method filterFile(java.lang.String,java.lang.String,java.lang.String,java.util.Properties)
location: class org.apache.maven.it.Verifier

/home/hudson/workspace/maven-core-integration-testing/jdk/1.5/label/jeos1/maven-its/core-it-suite/src/test/java/org/apache/maven/it/MavenITmng3052DepRepoAggregationTest.java:[74,16]
cannot find symbol
symbol  : method filterFile(java.lang.String,java.lang.String,java.lang.String,java.util.Properties)
location: class org.apache.maven.it.Verifier

/home/hudson/workspace/maven-core-integration-testing/jdk/1.5/label/jeos1/maven-its/core-it-suite/src/test/java/org/apache/maven/it/MavenITmng3052DepRepoAggregationTest.java:[75,16]
cannot find symbol
symbol  : method filterFile(java.lang.String,java.lang.String,java.lang.String,java.util.Properties)
location: class org.apache.maven.it.Verifier

/home/hudson/workspace/maven-core-integration-testing/jdk/1.5/label/jeos1/maven-its/core-it-suite/src/test/java/org/apache/maven/it/MavenITmng3482DependencyPomInterpolationTest.java:[60,53]
cannot find symbol
symbol  : method newDefaultFilterProperties()
location: class org.apache.maven.it.Verifier

/home/hudson/workspace/maven-core-integration-testing/jdk/1.5/label/jeos1/maven-its/core-it-suite/src/test/java/org/apache/maven/it/MavenITmng3415JunkRepositoryMetadataTest.java:[101,41]
cannot find symbol
symbol  : method newDefaultFilterProperties()
location: class org.apache.maven.it.Verifier

/home/hudson/workspace/maven-core-integration-testing/jdk/1.5/label/jeos1/maven-its/core-it-suite/src/test/java/org/apache/maven/it/MavenITmng3415JunkRepositoryMetadataTest.java:[103,32]
cannot find symbol
symbol  : method filterFile(java.lang.String,java.lang.String,java.lang.String,java.util.Properties)
location: class org.apache.maven.it.Verifier

/home/hudson/workspace/maven-core-integration-testing/jdk/1.5/label/jeos1/maven-its/core-it-suite/src/test/java/org/apache/maven/it/MavenITmng3415JunkRepositoryMetadataTest.java:[178,41]
cannot find symbol
symbol  : method newDefaultFilterProperties()
location: class org.apache.maven.it.Verifier

/home/hudson/workspace/maven-core-integration-testing/jdk/1.5/label/jeos1/maven-its/core-it-suite/src/test/java/org/apache/maven/it/MavenITmng3415JunkRepositoryMetadataTest.java:[179,32]
cannot find symbol
symbol  : method filterFile(java.lang.String,java.lang.String,java.lang.String,java.util.Properties)
location: class org.apache.maven.it.Verifier


[INFO] ------------------------------------------------------------------------
[INFO] Trace
org.apache.maven.BuildFailureException: Compilation failure
	at org.apache.maven.lifecycle.DefaultLifecycleExecutor.executeGoals(DefaultLifecycleExecutor.java:697)
	at org.apache.maven.lifecycle.DefaultLifecycleExecutor.executeGoalWithLifecycle(DefaultLifecycleExecutor.java:538)
	at org.apache.maven.lifecycle.DefaultLifecycleExecutor.executeGoal(DefaultLifecycleExecutor.java:517)
	at org.apache.maven.lifecycle.DefaultLifecycleExecutor.executeGoalAndHandleFailures(DefaultLifecycleExecutor.java:369)
	at org.apache.maven.lifecycle.DefaultLifecycleExecutor.executeTaskSegments(DefaultLifecycleExecutor.java:330)
	at org.apache.maven.lifecycle.DefaultLifecycleExecutor.execute(DefaultLifecycleExecutor.java:181)
	at org.apache.maven.DefaultMaven.doExecute(DefaultMaven.java:336)
	at org.apache.maven.DefaultMaven.execute(DefaultMaven.java:129)
	at org.apache.maven.cli.MavenCli.main(MavenCli.java:302)
	at sun.reflect.NativeMethodAccessorImpl.invoke0(Native Method)
	at sun.reflect.NativeMethodAccessorImpl.invoke(NativeMethodAccessorImpl.java:39)
	at sun.reflect.DelegatingMethodAccessorImpl.invoke(DelegatingMethodAccessorImpl.java:25)
	at java.lang.reflect.Method.invoke(Method.java:585)
	at org.codehaus.classworlds.Launcher.launchEnhanced(Launcher.java:315)
	at org.codehaus.classworlds.Launcher.launch(Launcher.java:255)
	at org.codehaus.classworlds.Launcher.mainWithExitCode(Launcher.java:430)
	at org.codehaus.classworlds.Launcher.main(Launcher.java:375)
Caused by: org.apache.maven.plugin.CompilationFailureException: Compilation failure
	at org.apache.maven.plugin.AbstractCompilerMojo.execute(AbstractCompilerMojo.java:516)
	at org.apache.maven.plugin.TestCompilerMojo.execute(TestCompilerMojo.java:102)
	at org.apache.maven.plugin.DefaultPluginManager.executeMojo(DefaultPluginManager.java:458)
	at org.apache.maven.lifecycle.DefaultLifecycleExecutor.executeGoals(DefaultLifecycleExecutor.java:676)
	... 16 more
[INFO] ------------------------------------------------------------------------
[INFO] Total time: 14 seconds
[INFO] Finished at: Tue Nov 04 20:01:47 GMT-06:00 2008
[INFO] Final Memory: 28M/82M
[INFO] ------------------------------------------------------------------------


Mime
View raw message