maven-notifications mailing list archives

Site index · List index
Message view « Date » · « Thread »
Top « Date » · « Thread »
From Hudson <Hud...@sonatype.org>
Subject Build failed in Hudson: Maven-2.1.x-bootstrap » 1.4,osx #70
Date Wed, 04 Feb 2009 14:48:02 GMT
See http://grid.sonatype.org/ci/job/Maven-2.1.x-bootstrap/./jdk=1.4,label=osx/70/changes

Changes:

[brett] [MNG-1957] added a test case for the JDK profile activator

------------------------------------------
[...truncated 4550 lines...]
     [exec] mng1992SystemPropOverridesPomProp(itMNG1992)................OK (2.2 s)
     [exec] mng1908LegacySnapshotUpdate(itMNG1908)......................OK (3.1 s)
     [exec] mng1830ShowVersion(Version).................................OK (1.2 s)
     [exec] mng1703PluginMgmtDepInheritance(itMNG1703)..................OK (3.6 s)
     [exec] mng1493NonStandardModulePomNames(itMNG1493).................OK (1.4 s)
     [exec] mng1491ReactorArtifactIdCollision(itMNG1491)................OK (2.2 s)
     [exec] mng1415QuotedSystemProperties(itMNG1415)....................OK (2.2 s)
     [exec] mng1412DependenciesOrder(itMNG1412).........................OK (3.3 s)
     [exec] mng1349ChecksumFormats(itMNG1349)...........................OK (2.9 s)
     [exec] mng1323AntrunDependencies(itMNG1323)........................SKIPPED - version
2.1.0-M2-SNAPSHOT not in range [3.0-alpha-1,)
     [exec] mng1233WarDepWithProvidedScope(itMNG1233)...................OK (3.1 s)
     [exec] mng1088ReactorDepResolution(itMNG1088)......................OK (3.0 s)
     [exec] mng1052PluginMngtConfig(itMNG1052)..........................OK (2.6 s)
     [exec] mng1021EqualAttachmentBuildNumber(itMNG1021)................OK (3.4 s)
     [exec] mng0985NonExecutedPluginMngtGoals(itMNG0985)................OK (1.4 s)
     [exec] mng0956ComponentInjectionViaProjectLevelPluginDep(itMNG0956)..OK (4.0 s)
     [exec] mng0870ReactorAwarePluginDiscovery(itMNG0870)...............OK (2.6 s)
     [exec] mng0866EvaluateDefaultValue(itMNG866).......................OK (3.0 s)
     [exec] mng0848SystemPropOverridesDefaultValue(itMNG848)............OK (2.2 s)
     [exec] mng0836PluginParentResolution(itMNG836).....................OK (2.3 s)
     [exec] mng0823MojoContextPassing(itMNG0823)........................OK (2.4 s)
     [exec] mng0820ConflictResolution(itMNG0820)........................OK (3.0 s)
     [exec] mng0818WarDepsNotTransitive(itMNG0818)......................OK (2.9 s)
     [exec] mng0814ExplicitProfileActivation(itMNG814)..................OK (2.0 s)
     [exec] mng0786ProfileAwareReactor(itMNG0786).......................OK (2.6 s)
     [exec] mng0781PluginConfigVsExecConfig(itMNG0781)..................OK (2.4 s)
     [exec] mng0773SettingsProfileReactorPollution(itMNG773)............OK (1.5 s)
     [exec] mng0768OfflineMode(itMNG768)................................OK (6.2 s)
     [exec] mng0761MissingSnapshotDistRepo(itMNG761)....................OK (3.8 s)
     [exec] mng0731LegacyRepoLayout(itMNG731)...........................OK (2.2 s)
     [exec] mng0680ParentBasedir(itMNG680)..............................OK (2.1 s)
     [exec] mng0674PluginParameterAlias(itMNG674).......................OK (2.8 s)
     [exec] mng0666IgnoreLegacyPom(itMNG666)............................OK (2.3 s)
     [exec] mng0557UserSettingsCliOption(itMNG557)......................OK (2.2 s)
     [exec] mng0553SettingsAuthzEncryption(it0553)......................OK (2.8 s)
     [exec] mng0522PluginMgmtConfig(itMNG522)...........................OK (2.3 s)
     [exec] mng0507ArtifactRelocation(itMNG507).........................OK (2.5 s)
     [exec] mng0505VersionRange(itMNG505)...............................FAILURE (2.3 s)
     [exec] mng0496IgnoreUnknownPluginParameters(itMNG496)..............OK (2.8 s)
     [exec] mng0479OverrideCentralRepo(itMNG479)........................OK (4.2 s)
     [exec] mng0471CustomLifecycle(itMNG471)............................OK (3.7 s)
     [exec] mng0469ReportConfig(itReportConfigOverridesBuildDefaults)...OK (2.5 s)
     [exec] mng0469ReportConfig(itBuildConfigDominantDuringBuild).......OK (1.9 s)
     [exec] mng0469ReportConfig(itBuildConfigIrrelevantForReports)......OK (3.4 s)
     [exec] mng0377PluginLookupFromPrefix(itMNG377).....................OK (3.6 s)
     [exec] mng0294MergeGlobalAndUserSettings(itMNG294).................OK (2.6 s)
     [exec] mng0282NonReactorExecWhenProjectIndependent(itMNG282).......OK (2.3 s)
     [exec] mng0249ResolveDepsFromReactor(itMNG0249)....................OK (2.8 s)
     [exec] mng0095ReactorFailureBehavior(itFailFast)...................OK (3.1 s)
     [exec] mng0095ReactorFailureBehavior(itFailNever)..................OK (3.1 s)
     [exec] mng0095ReactorFailureBehavior(itFailAtEnd)..................OK (2.6 s)
     [exec] 0144LifecycleExecutionOrder(it0144).........................OK (8.1 s)
     [exec] 0143TransitiveDependencyScopes(itCompileScope)..............OK (4.4 s)
     [exec] 0143TransitiveDependencyScopes(itProvidedScope).............OK (2.6 s)
     [exec] 0143TransitiveDependencyScopes(itRuntimeScope)..............OK (2.4 s)
     [exec] 0143TransitiveDependencyScopes(itTestScope).................OK (2.8 s)
     [exec] 0142DirectDependencyScopes(it0142)..........................OK (2.5 s)
     [exec] 0140(it0140)................................................OK (3.3 s)
     [exec] 0139(it0139)................................................OK (3.0 s)
     [exec] 0138PluginLifecycle(it0138).................................OK (4.5 s)
     [exec] 0137EarLifecycle(it0137)....................................OK (4.1 s)
     [exec] 0136RarLifecycle(it0136)....................................OK (3.9 s)
     [exec] 0135EjbLifecycle(it0135)....................................OK (3.6 s)
     [exec] 0134WarLifecycle(it0134)....................................OK (3.7 s)
     [exec] 0133JarLifecycle(it0133)....................................OK (4.0 s)
     [exec] 0132PomLifecycle(it0132)....................................OK (3.4 s)
     [exec] 0131SiteLifecycle(it0131)...................................OK (2.8 s)
     [exec] 0130CleanLifecycle(it0130)..................................OK (2.5 s)
     [exec] 0113ServerAuthzAvailableToWagonMgrInPlugin(it0113)..........OK (2.4 s)
     [exec] 0090(it0090)................................................OK (2.2 s)
     [exec] 0087(it0087)................................................OK (3.2 s)
     [exec] 0086(it0086)................................................OK (3.6 s)
     [exec] 0085(it0085)................................................OK (2.4 s)
     [exec] 0072(it0072)................................................OK (2.8 s)
     [exec] 0071(it0071)................................................OK (2.9 s)
     [exec] 0064(it0064)................................................OK (2.7 s)
     [exec] 0063(it0063)................................................OK (3.9 s)
     [exec] 0056(it0056)................................................OK (3.5 s)
     [exec] 0052(it0052)................................................OK (4.5 s)
     [exec] 0051(it0051)................................................OK (8.9 s)
     [exec] 0041(it0041)................................................OK (3.8 s)
     [exec] 0040(it0040)................................................OK (3.9 s)
     [exec] 0039(it0039)................................................OK (4.0 s)
     [exec] 0038(it0038)................................................OK (3.0 s)
     [exec] 0037(it0037)................................................OK (3.2 s)
     [exec] 0036(it0036)................................................OK (3.9 s)
     [exec] 0032(it0032)................................................OK (2.6 s)
     [exec] 0030(it0030)................................................OK (13.1 s)
     [exec] 0025(it0025)................................................OK (3.8 s)
     [exec] 0024(it0024)................................................OK (3.4 s)
     [exec] 0023(it0023)................................................OK (3.1 s)
     [exec] 0021(it0021)................................................OK (4.1 s)
     [exec] 0019(it0019)................................................OK (5.8 s)
     [exec] 0018(it0018)................................................OK (5.4 s)
     [exec] 0012(it0012)................................................OK (6.5 s)
     [exec] 0011(it0011)................................................OK (5.5 s)
     [exec] 0010(it0010)................................................OK (6.2 s)
     [exec] 0009(it0009)................................................OK (5.7 s)
     [exec] 0008(it0008)................................................OK (3.6 s)
     [exec] 0007(it0007)................................................OK (2.5 s)
     [exec] Tests run: 309, Failures: 0, Errors: 1, Skipped: 0, Time elapsed: 1,471.629 sec
<<< FAILURE!
     [exec] testitMNG505(org.apache.maven.it.MavenITmng0505VersionRangeTest)  Time elapsed:
2.35 sec  <<< ERROR!
     [exec] org.apache.maven.it.VerificationException: Exit code was non-zero: 1; command
line and log = 
     [exec] /tmp/apache-maven-2.1.0-M2-SNAPSHOT/bin/mvn -e --batch-mode -Dmaven.repo.local=/opt/repos/local-repository
validate
     [exec] + Error stacktraces are turned on.
     [exec] [INFO] Scanning for projects...
     [exec] [INFO] ------------------------------------------------------------------------
     [exec] [INFO] Building Maven Integration Test :: MNG-505
     [exec] [INFO]    task-segment: [validate]
     [exec] [INFO] ------------------------------------------------------------------------
     [exec] [INFO] snapshot org.apache.maven.its.plugins:maven-it-plugin-dependency-resolution:2.1-SNAPSHOT:
checking for updates from central
     [exec] [INFO] snapshot org.apache.maven.its.plugins:maven-it-plugin-dependency-resolution:2.1-SNAPSHOT:
checking for updates from central
     [exec] [INFO] snapshot org.apache.maven.its.plugins:maven-it-plugins:2.1-SNAPSHOT: checking
for updates from central
     [exec] [INFO] snapshot org.apache.maven.its.plugins:maven-it-plugins:2.1-SNAPSHOT: checking
for updates from central
     [exec] [INFO] snapshot org.apache.maven.its:core-integration-testing:2.1-SNAPSHOT: checking
for updates from central
     [exec] [INFO] snapshot org.apache.maven.its:core-integration-testing:2.1-SNAPSHOT: checking
for updates from central
     [exec] [INFO] artifact org.apache.maven.its.mng0505:a: checking for updates from central
     [exec] [INFO] ------------------------------------------------------------------------
     [exec] [ERROR] BUILD ERROR
     [exec] [INFO] ------------------------------------------------------------------------
     [exec] [INFO] Failed to resolve artifact.
     [exec] No versions are present in the repository for the artifact with a range [1.1,)
     [exec]   org.apache.maven.its.mng0505:a:jar:null
     [exec] from the specified remote repositories:
     [exec]   central (http://Nexus)
     [exec] Path to dependency: 
     [exec] 	1) org.apache.maven.its.mng0505:test:jar:1.0
     [exec] [INFO] ------------------------------------------------------------------------
     [exec] [INFO] Trace
     [exec] org.apache.maven.lifecycle.LifecycleExecutionException: No versions are present
in the repository for the artifact with a range [1.1,)
     [exec]   org.apache.maven.its.mng0505:a:jar:null
     [exec] from the specified remote repositories:
     [exec]   central (http://Nexus)
     [exec] Path to dependency: 
     [exec] 	1) org.apache.maven.its.mng0505:test:jar:1.0
     [exec] 	at org.apache.maven.lifecycle.DefaultLifecycleExecutor.executeGoals(DefaultLifecycleExecutor.java:694)
     [exec] 	at org.apache.maven.lifecycle.DefaultLifecycleExecutor.executeGoalWithLifecycle(DefaultLifecycleExecutor.java:539)
     [exec] 	at org.apache.maven.lifecycle.DefaultLifecycleExecutor.executeGoal(DefaultLifecycleExecutor.java:518)
     [exec] 	at org.apache.maven.lifecycle.DefaultLifecycleExecutor.executeGoalAndHandleFailures(DefaultLifecycleExecutor.java:370)
     [exec] 	at org.apache.maven.lifecycle.DefaultLifecycleExecutor.executeTaskSegments(DefaultLifecycleExecutor.java:331)
     [exec] 	at org.apache.maven.lifecycle.DefaultLifecycleExecutor.execute(DefaultLifecycleExecutor.java:181)
     [exec] 	at org.apache.maven.DefaultMaven.doExecute(DefaultMaven.java:345)
     [exec] 	at org.apache.maven.DefaultMaven.execute(DefaultMaven.java:132)
     [exec] 	at org.apache.maven.cli.MavenCli.main(MavenCli.java:299)
     [exec] 	at sun.reflect.NativeMethodAccessorImpl.invoke0(Native Method)
     [exec] 	at sun.reflect.NativeMethodAccessorImpl.invoke(NativeMethodAccessorImpl.java:39)
     [exec] 	at sun.reflect.DelegatingMethodAccessorImpl.invoke(DelegatingMethodAccessorImpl.java:25)
     [exec] 	at java.lang.reflect.Method.invoke(Method.java:324)
     [exec] 	at org.codehaus.classworlds.Launcher.launchEnhanced(Launcher.java:315)
     [exec] 	at org.codehaus.classworlds.Launcher.launch(Launcher.java:255)
     [exec] 	at org.codehaus.classworlds.Launcher.mainWithExitCode(Launcher.java:430)
     [exec] 	at org.codehaus.classworlds.Launcher.main(Launcher.java:375)
     [exec] Caused by: org.apache.maven.artifact.versioning.OverConstrainedVersionException:
No versions are present in the repository for the artifact with a range [1.1,)
     [exec]   org.apache.maven.its.mng0505:a:jar:null
     [exec] from the specified remote repositories:
     [exec]   central (http://Nexus)
     [exec] Path to dependency: 
     [exec] 	1) org.apache.maven.its.mng0505:test:jar:1.0
     [exec] 	at org.apache.maven.artifact.resolver.DefaultArtifactCollector.recurse(DefaultArtifactCollector.java:370)
     [exec] 	at org.apache.maven.artifact.resolver.DefaultArtifactCollector.collect(DefaultArtifactCollector.java:74)
     [exec] 	at org.apache.maven.artifact.resolver.DefaultArtifactResolver.resolveTransitively(DefaultArtifactResolver.java:300)
     [exec] 	at org.apache.maven.artifact.resolver.DefaultArtifactResolver.resolveTransitively(DefaultArtifactResolver.java:288)
     [exec] 	at org.apache.maven.plugin.DefaultPluginManager.resolveTransitiveDependencies(DefaultPluginManager.java:1441)
     [exec] 	at org.apache.maven.plugin.DefaultPluginManager.executeMojo(DefaultPluginManager.java:412)
     [exec] 	at org.apache.maven.lifecycle.DefaultLifecycleExecutor.executeGoals(DefaultLifecycleExecutor.java:677)
     [exec] 	... 16 more
     [exec] [INFO] ------------------------------------------------------------------------
     [exec] [INFO] Total time: 1 second
     [exec] [INFO] Finished at: Wed Feb 04 08:44:04 CST 2009
     [exec] [INFO] Final Memory: 1M/3M
     [exec] [INFO] ------------------------------------------------------------------------
     [exec] 	at org.apache.maven.it.Verifier.executeGoals(Verifier.java:1274)
     [exec] 	at org.apache.maven.it.Verifier.executeGoal(Verifier.java:1126)
     [exec] 	at org.apache.maven.it.Verifier.executeGoal(Verifier.java:1120)
     [exec] 	at org.apache.maven.it.MavenITmng0505VersionRangeTest.testitMNG505(MavenITmng0505VersionRangeTest.java:50)
     [exec] 	at org.apache.maven.it.MavenITmng0505VersionRangeTest.testitMNG505(MavenITmng0505VersionRangeTest.java:50)
     [exec] 	at sun.reflect.NativeMethodAccessorImpl.invoke0(Native Method)
     [exec] 	at sun.reflect.NativeMethodAccessorImpl.invoke(NativeMethodAccessorImpl.java:39)
     [exec] 	at sun.reflect.DelegatingMethodAccessorImpl.invoke(DelegatingMethodAccessorImpl.java:25)
     [exec] 	at java.lang.reflect.Method.invoke(Method.java:324)
     [exec] 	at junit.framework.TestCase.runTest(TestCase.java:164)
     [exec] 	at org.apache.maven.it.AbstractMavenIntegrationTestCase.runTest(AbstractMavenIntegrationTestCase.java:178)
     [exec] 	at junit.framework.TestCase.runBare(TestCase.java:130)
     [exec] 	at junit.framework.TestResult$1.protect(TestResult.java:106)
     [exec] 	at junit.framework.TestResult.runProtected(TestResult.java:124)
     [exec] 	at junit.framework.TestResult.run(TestResult.java:109)
     [exec] 	at junit.framework.TestCase.run(TestCase.java:120)
     [exec] 	at junit.framework.TestSuite.runTest(TestSuite.java:230)
     [exec] 	at junit.framework.TestSuite.run(TestSuite.java:225)
     [exec] 	at junit.framework.TestSuite.runTest(TestSuite.java:230)
     [exec] 	at junit.framework.TestSuite.run(TestSuite.java:225)
     [exec] 	at sun.reflect.NativeMethodAccessorImpl.invoke0(Native Method)
     [exec] 	at sun.reflect.NativeMethodAccessorImpl.invoke(NativeMethodAccessorImpl.java:39)
     [exec] 	at sun.reflect.DelegatingMethodAccessorImpl.invoke(DelegatingMethodAccessorImpl.java:25)
     [exec] 	at java.lang.reflect.Method.invoke(Method.java:324)
     [exec] 	at org.apache.maven.surefire.junit.JUnitTestSet.execute(JUnitTestSet.java:213)
     [exec] 	at org.apache.maven.surefire.suite.AbstractDirectoryTestSuite.executeTestSet(AbstractDirectoryTestSuite.java:138)
     [exec] 	at org.apache.maven.surefire.suite.AbstractDirectoryTestSuite.execute(AbstractDirectoryTestSuite.java:125)
     [exec] 	at org.apache.maven.surefire.Surefire.run(Surefire.java:132)
     [exec] 	at sun.reflect.NativeMethodAccessorImpl.invoke0(Native Method)
     [exec] 	at sun.reflect.NativeMethodAccessorImpl.invoke(NativeMethodAccessorImpl.java:39)
     [exec] 	at sun.reflect.DelegatingMethodAccessorImpl.invoke(DelegatingMethodAccessorImpl.java:25)
     [exec] 	at java.lang.reflect.Method.invoke(Method.java:324)
     [exec] 	at org.apache.maven.surefire.booter.SurefireBooter.runSuitesInProcess(SurefireBooter.java:290)
     [exec] 	at org.apache.maven.surefire.booter.SurefireBooter.run(SurefireBooter.java:198)
     [exec] 	at org.apache.maven.plugin.surefire.SurefirePlugin.execute(SurefirePlugin.java:398)
     [exec] 	at org.apache.maven.plugin.DefaultPluginManager.executeMojo(DefaultPluginManager.java:460)
     [exec] 	at org.apache.maven.lifecycle.DefaultLifecycleExecutor.executeGoals(DefaultLifecycleExecutor.java:677)
     [exec] 	at org.apache.maven.lifecycle.DefaultLifecycleExecutor.executeGoalWithLifecycle(DefaultLifecycleExecutor.java:539)
     [exec] 	at org.apache.maven.lifecycle.DefaultLifecycleExecutor.executeGoal(DefaultLifecycleExecutor.java:518)
     [exec] 	at org.apache.maven.lifecycle.DefaultLifecycleExecutor.executeGoalAndHandleFailures(DefaultLifecycleExecutor.java:370)
     [exec] 	at org.apache.maven.lifecycle.DefaultLifecycleExecutor.executeTaskSegments(DefaultLifecycleExecutor.java:331)
     [exec] 	at org.apache.maven.lifecycle.DefaultLifecycleExecutor.execute(DefaultLifecycleExecutor.java:181)
     [exec] 	at org.apache.maven.DefaultMaven.doExecute(DefaultMaven.java:345)
     [exec] 	at org.apache.maven.DefaultMaven.execute(DefaultMaven.java:132)
     [exec] 	at org.apache.maven.cli.MavenCli.main(MavenCli.java:299)
     [exec] 	at sun.reflect.NativeMethodAccessorImpl.invoke0(Native Method)
     [exec] 	at sun.reflect.NativeMethodAccessorImpl.invoke(NativeMethodAccessorImpl.java:39)
     [exec] 	at sun.reflect.DelegatingMethodAccessorImpl.invoke(DelegatingMethodAccessorImpl.java:25)
     [exec] 	at java.lang.reflect.Method.invoke(Method.java:324)
     [exec] 	at org.codehaus.classworlds.Launcher.launchEnhanced(Launcher.java:315)
     [exec] 	at org.codehaus.classworlds.Launcher.launch(Launcher.java:255)
     [exec] 	at org.codehaus.classworlds.Launcher.mainWithExitCode(Launcher.java:430)
     [exec] 	at org.codehaus.classworlds.Launcher.main(Launcher.java:375)
     [exec] 
     [exec] 
     [exec] Results :
     [exec] 
     [exec] Tests in error: 
     [exec]   testitMNG505(org.apache.maven.it.MavenITmng0505VersionRangeTest)
     [exec] 
     [exec] Tests run: 309, Failures: 0, Errors: 1, Skipped: 0
     [exec] 
     [exec] [INFO] ------------------------------------------------------------------------
     [exec] [ERROR] BUILD FAILURE
     [exec] [INFO] ------------------------------------------------------------------------
     [exec] [INFO] There are test failures.
     [exec] [INFO] ------------------------------------------------------------------------
     [exec] [INFO] For more information, run Maven with the -e switch
     [exec] [INFO] ------------------------------------------------------------------------
     [exec] [INFO] Total time: 25 minutes 22 seconds
     [exec] [INFO] Finished at: Wed Feb 04 08:48:01 CST 2009
     [exec] [INFO] Final Memory: 30M/57M
     [exec] [INFO] ------------------------------------------------------------------------

BUILD FAILED
http://grid.sonatype.org/ci/job/Maven-2.1.x-bootstrap/./jdk=1.4,label=osx/ws/maven-2.1.x/build.xml
:279: exec returned: 1

Total time: 31 minutes 7 seconds


Mime
View raw message