maven-notifications mailing list archives

Site index · List index
Message view « Date » · « Thread »
Top « Date » · « Thread »
From Hudson <Hud...@sonatype.org>
Subject Build failed in Hudson: Maven-2.1.x-bootstrap » 1.4,ubuntu #114
Date Fri, 27 Feb 2009 21:09:22 GMT
See http://grid.sonatype.org/ci/job/Maven-2.1.x-bootstrap/./jdk=1.4,label=ubuntu/114/changes

------------------------------------------
[...truncated 2522 lines...]
     [exec] 1K downloaded  (surefire-booter-2.4.3.pom)
     [exec] Downloading: http://repository.sonatype.org:8081/content/groups/public/org/apache/maven/surefire/surefire-api/2.4.3/surefire-api-2.4.3.pom
     [exec] 2K downloaded  (surefire-api-2.4.3.pom)
     [exec] Downloading: http://repository.sonatype.org:8081/content/groups/public/org/apache/maven/maven-core/2.0.6/maven-core-2.0.6.pom
     [exec] 
     [exec] Downloading: http://repository.sonatype.org:8081/content/groups/public/org/apache/maven/maven-plugin-parameter-documenter/2.0.6/maven-plugin-parameter-documenter-2.0.6.pom
     [exec] 1K downloaded  (maven-plugin-parameter-documenter-2.0.6.pom)
     [exec] Downloading: http://repository.sonatype.org:8081/content/groups/public/org/apache/maven/reporting/maven-reporting-api/2.0.6/maven-reporting-api-2.0.6.pom
     [exec] 
     [exec] Downloading: http://repository.sonatype.org:8081/content/groups/public/org/apache/maven/reporting/maven-reporting/2.0.6/maven-reporting-2.0.6.pom
     [exec] 
     [exec] Downloading: http://repository.sonatype.org:8081/content/groups/public/org/apache/maven/maven-error-diagnostics/2.0.6/maven-error-diagnostics-2.0.6.pom
     [exec] 
     [exec] Downloading: http://repository.sonatype.org:8081/content/groups/public/org/apache/maven/maven-plugin-descriptor/2.0.6/maven-plugin-descriptor-2.0.6.pom
     [exec] 
     [exec] Downloading: http://repository.sonatype.org:8081/content/groups/public/org/apache/maven/maven-monitor/2.0.6/maven-monitor-2.0.6.pom
     [exec] 
     [exec] Downloading: http://repository.sonatype.org:8081/content/groups/public/org/apache/maven/maven-toolchain/1.0/maven-toolchain-1.0.pom
     [exec] 3K downloaded  (maven-toolchain-1.0.pom)
     [exec] Downloading: http://repository.sonatype.org:8081/content/groups/public/org/apache/maven/surefire/surefire-booter/2.4.3/surefire-booter-2.4.3.jar
     [exec] 261K downloaded  (surefire-booter-2.4.3.jar)
     [exec] Downloading: http://repository.sonatype.org:8081/content/groups/public/org/apache/maven/surefire/surefire-api/2.4.3/surefire-api-2.4.3.jar
     [exec] 503K downloaded  (surefire-api-2.4.3.jar)
     [exec] [INFO] [surefire:test]
     [exec] [INFO] No tests to run.
     [exec] Downloading: http://repository.sonatype.org:8081/content/groups/public/org/apache/maven/maven-archiver/2.3/maven-archiver-2.3.pom
     [exec] 
     [exec] Downloading: http://repository.sonatype.org:8081/content/groups/public/org/codehaus/plexus/plexus-archiver/1.0-alpha-9/plexus-archiver-1.0-alpha-9.pom
     [exec] 
     [exec] Downloading: http://repository.sonatype.org:8081/content/groups/public/org/codehaus/plexus/plexus-container-default/1.0-alpha-15/plexus-container-default-1.0-alpha-15.pom
     [exec] 1K downloaded  (plexus-container-default-1.0-alpha-15.pom)
     [exec] Downloading: http://repository.sonatype.org:8081/content/groups/public/org/codehaus/plexus/plexus-io/1.0-alpha-1/plexus-io-1.0-alpha-1.pom
     [exec] 
     [exec] Downloading: http://repository.sonatype.org:8081/content/groups/public/org/codehaus/plexus/plexus-utils/1.4.9/plexus-utils-1.4.9.pom
     [exec] 
     [exec] Downloading: http://repository.sonatype.org:8081/content/groups/public/org/apache/maven/maven-archiver/2.3/maven-archiver-2.3.jar
     [exec] Downloading: http://repository.sonatype.org:8081/content/groups/public/org/codehaus/plexus/plexus-utils/1.4.9/plexus-utils-1.4.9.jar
     [exec] 17K downloaded  (maven-archiver-2.3.jar)
     [exec] 199K downloaded  (plexus-utils-1.4.9.jar)
     [exec] Downloading: http://repository.sonatype.org:8081/content/groups/public/org/codehaus/plexus/plexus-archiver/1.0-alpha-9/plexus-archiver-1.0-alpha-9.jar
     [exec] 153K downloaded  (plexus-archiver-1.0-alpha-9.jar)
     [exec] Downloading: http://repository.sonatype.org:8081/content/groups/public/org/codehaus/plexus/plexus-io/1.0-alpha-1/plexus-io-1.0-alpha-1.jar
     [exec] 11K downloaded  (plexus-io-1.0-alpha-1.jar)
     [exec] [INFO] [jar:jar]
     [exec] [INFO] Building jar: /home/hudson/workspace/Maven-2.1.x-bootstrap/jdk/1.4/label/ubuntu/maven-2.1.x/maven-integration-tests/target/classes/target/maven-integration-tests-2.1.x.jar
     [exec] Downloading: http://repository.sonatype.org:8081/content/groups/public/org/apache/maven/scm/maven-scm-manager-plexus/1.1/maven-scm-manager-plexus-1.1.pom
     [exec] 2K downloaded  (maven-scm-manager-plexus-1.1.pom)
     [exec] Downloading: http://repository.sonatype.org:8081/content/groups/public/org/apache/maven/scm/maven-scm-managers/1.1/maven-scm-managers-1.1.pom
     [exec] 1K downloaded  (maven-scm-managers-1.1.pom)
     [exec] Downloading: http://repository.sonatype.org:8081/content/groups/public/org/apache/maven/scm/maven-scm/1.1/maven-scm-1.1.pom
     [exec] 19K downloaded  (maven-scm-1.1.pom)
     [exec] Downloading: http://repository.sonatype.org:8081/content/groups/public/org/apache/maven/scm/maven-scm-api/1.1/maven-scm-api-1.1.pom
     [exec] 1K downloaded  (maven-scm-api-1.1.pom)
     [exec] Downloading: http://repository.sonatype.org:8081/content/groups/public/org/apache/maven/scm/maven-scm-providers-standard/1.1/maven-scm-providers-standard-1.1.pom
     [exec] 3K downloaded  (maven-scm-providers-standard-1.1.pom)
     [exec] Downloading: http://repository.sonatype.org:8081/content/groups/public/org/apache/maven/scm/maven-scm-providers/1.1/maven-scm-providers-1.1.pom
     [exec] 3K downloaded  (maven-scm-providers-1.1.pom)
     [exec] Downloading: http://repository.sonatype.org:8081/content/groups/public/org/apache/maven/scm/maven-scm-provider-accurev/1.1/maven-scm-provider-accurev-1.1.pom
     [exec] 4K downloaded  (maven-scm-provider-accurev-1.1.pom)
     [exec] Downloading: http://repository.sonatype.org:8081/content/groups/public/org/apache/maven/scm/maven-scm-provider-bazaar/1.1/maven-scm-provider-bazaar-1.1.pom
     [exec] 1K downloaded  (maven-scm-provider-bazaar-1.1.pom)
     [exec] Downloading: http://repository.sonatype.org:8081/content/groups/public/org/apache/maven/scm/maven-scm-provider-clearcase/1.1/maven-scm-provider-clearcase-1.1.pom
     [exec] 2K downloaded  (maven-scm-provider-clearcase-1.1.pom)
     [exec] Downloading: http://repository.sonatype.org:8081/content/groups/public/org/apache/maven/scm/maven-scm-provider-cvsexe/1.1/maven-scm-provider-cvsexe-1.1.pom
     [exec] 2K downloaded  (maven-scm-provider-cvsexe-1.1.pom)
     [exec] Downloading: http://repository.sonatype.org:8081/content/groups/public/org/apache/maven/scm/maven-scm-providers-cvs/1.1/maven-scm-providers-cvs-1.1.pom
     [exec] 1K downloaded  (maven-scm-providers-cvs-1.1.pom)
     [exec] Downloading: http://repository.sonatype.org:8081/content/groups/public/org/apache/maven/scm/maven-scm-provider-cvs-commons/1.1/maven-scm-provider-cvs-commons-1.1.pom
     [exec] 2K downloaded  (maven-scm-provider-cvs-commons-1.1.pom)
     [exec] Downloading: http://repository.sonatype.org:8081/content/groups/public/org/apache/maven/scm/maven-scm-provider-cvsjava/1.1/maven-scm-provider-cvsjava-1.1.pom
     [exec] 2K downloaded  (maven-scm-provider-cvsjava-1.1.pom)
     [exec] Downloading: http://repository.sonatype.org:8081/content/groups/public/org/netbeans/lib/cvsclient/20060125/cvsclient-20060125.pom
     [exec] 
     [exec] Downloading: http://repository.sonatype.org:8081/content/groups/public/ch/ethz/ganymed/ganymed-ssh2/build210/ganymed-ssh2-build210.pom
     [exec] 
     [exec] Downloading: http://repository.sonatype.org:8081/content/groups/public/org/apache/maven/scm/maven-scm-provider-gitexe/1.1/maven-scm-provider-gitexe-1.1.pom
     [exec] 2K downloaded  (maven-scm-provider-gitexe-1.1.pom)
     [exec] Downloading: http://repository.sonatype.org:8081/content/groups/public/org/apache/maven/scm/maven-scm-providers-git/1.1/maven-scm-providers-git-1.1.pom
     [exec] 1K downloaded  (maven-scm-providers-git-1.1.pom)
     [exec] Downloading: http://repository.sonatype.org:8081/content/groups/public/org/apache/maven/scm/maven-scm-provider-git-commons/1.1/maven-scm-provider-git-commons-1.1.pom
     [exec] 2K downloaded  (maven-scm-provider-git-commons-1.1.pom)
     [exec] Downloading: http://repository.sonatype.org:8081/content/groups/public/org/apache/maven/scm/maven-scm-provider-hg/1.1/maven-scm-provider-hg-1.1.pom
     [exec] 2K downloaded  (maven-scm-provider-hg-1.1.pom)
     [exec] Downloading: http://repository.sonatype.org:8081/content/groups/public/org/apache/maven/scm/maven-scm-provider-perforce/1.1/maven-scm-provider-perforce-1.1.pom
     [exec] 2K downloaded  (maven-scm-provider-perforce-1.1.pom)
     [exec] Downloading: http://repository.sonatype.org:8081/content/groups/public/org/apache/maven/scm/maven-scm-provider-starteam/1.1/maven-scm-provider-starteam-1.1.pom
     [exec] 2K downloaded  (maven-scm-provider-starteam-1.1.pom)
     [exec] Downloading: http://repository.sonatype.org:8081/content/groups/public/org/apache/maven/scm/maven-scm-provider-svnexe/1.1/maven-scm-provider-svnexe-1.1.pom
     [exec] 2K downloaded  (maven-scm-provider-svnexe-1.1.pom)
     [exec] Downloading: http://repository.sonatype.org:8081/content/groups/public/org/apache/maven/scm/maven-scm-providers-svn/1.1/maven-scm-providers-svn-1.1.pom
     [exec] 1K downloaded  (maven-scm-providers-svn-1.1.pom)
     [exec] Downloading: http://repository.sonatype.org:8081/content/groups/public/org/apache/maven/scm/maven-scm-provider-svn-commons/1.1/maven-scm-provider-svn-commons-1.1.pom
     [exec] 1K downloaded  (maven-scm-provider-svn-commons-1.1.pom)
     [exec] Downloading: http://repository.sonatype.org:8081/content/groups/public/org/apache/maven/scm/maven-scm-provider-synergy/1.1/maven-scm-provider-synergy-1.1.pom
     [exec] 1K downloaded  (maven-scm-provider-synergy-1.1.pom)
     [exec] Downloading: http://repository.sonatype.org:8081/content/groups/public/org/apache/maven/scm/maven-scm-provider-vss/1.1/maven-scm-provider-vss-1.1.pom
     [exec] 2K downloaded  (maven-scm-provider-vss-1.1.pom)
     [exec] Downloading: http://repository.sonatype.org:8081/content/groups/public/org/apache/maven/scm/maven-scm-provider-local/1.1/maven-scm-provider-local-1.1.pom
     [exec] 2K downloaded  (maven-scm-provider-local-1.1.pom)
     [exec] Downloading: http://repository.sonatype.org:8081/content/groups/public/org/netbeans/lib/cvsclient/20060125/cvsclient-20060125.jar
     [exec] Downloading: http://repository.sonatype.org:8081/content/groups/public/org/apache/maven/scm/maven-scm-manager-plexus/1.1/maven-scm-manager-plexus-1.1.jar
     [exec] Downloading: http://repository.sonatype.org:8081/content/groups/public/ch/ethz/ganymed/ganymed-ssh2/build210/ganymed-ssh2-build210.jar
     [exec] 9K downloaded  (maven-scm-manager-plexus-1.1.jar)
     [exec] Downloading: http://repository.sonatype.org:8081/content/groups/public/org/apache/maven/scm/maven-scm-api/1.1/maven-scm-api-1.1.jar
     [exec] 80K downloaded  (maven-scm-api-1.1.jar)
     [exec] Downloading: http://repository.sonatype.org:8081/content/groups/public/org/apache/maven/scm/maven-scm-provider-accurev/1.1/maven-scm-provider-accurev-1.1.jar
     [exec] 25K downloaded  (maven-scm-provider-accurev-1.1.jar)
     [exec] Downloading: http://repository.sonatype.org:8081/content/groups/public/org/apache/maven/scm/maven-scm-provider-bazaar/1.1/maven-scm-provider-bazaar-1.1.jar
     [exec] 239K downloaded  (ganymed-ssh2-build210.jar)
     [exec] 45K downloaded  (maven-scm-provider-bazaar-1.1.jar)
     [exec] Downloading: http://repository.sonatype.org:8081/content/groups/public/org/apache/maven/scm/maven-scm-provider-clearcase/1.1/maven-scm-provider-clearcase-1.1.jar
     [exec] 58K downloaded  (maven-scm-provider-clearcase-1.1.jar)
     [exec] 604K downloaded  (cvsclient-20060125.jar)
     [exec] Downloading: http://repository.sonatype.org:8081/content/groups/public/org/apache/maven/scm/maven-scm-provider-cvsexe/1.1/maven-scm-provider-cvsexe-1.1.jar
     [exec] 25K downloaded  (maven-scm-provider-cvsexe-1.1.jar)
     [exec] Downloading: http://repository.sonatype.org:8081/content/groups/public/org/apache/maven/scm/maven-scm-provider-cvs-commons/1.1/maven-scm-provider-cvs-commons-1.1.jar
     [exec] 68K downloaded  (maven-scm-provider-cvs-commons-1.1.jar)
     [exec] Downloading: http://repository.sonatype.org:8081/content/groups/public/org/apache/maven/scm/maven-scm-provider-cvsjava/1.1/maven-scm-provider-cvsjava-1.1.jar
     [exec] 39K downloaded  (maven-scm-provider-cvsjava-1.1.jar)
     [exec] Downloading: http://repository.sonatype.org:8081/content/groups/public/org/apache/maven/scm/maven-scm-provider-gitexe/1.1/maven-scm-provider-gitexe-1.1.jar
     [exec] 44K downloaded  (maven-scm-provider-gitexe-1.1.jar)
     [exec] Downloading: http://repository.sonatype.org:8081/content/groups/public/org/apache/maven/scm/maven-scm-provider-git-commons/1.1/maven-scm-provider-git-commons-1.1.jar
     [exec] 34K downloaded  (maven-scm-provider-git-commons-1.1.jar)
     [exec] Downloading: http://repository.sonatype.org:8081/content/groups/public/org/apache/maven/scm/maven-scm-provider-hg/1.1/maven-scm-provider-hg-1.1.jar
     [exec] 50K downloaded  (maven-scm-provider-hg-1.1.jar)
     [exec] Downloading: http://repository.sonatype.org:8081/content/groups/public/org/apache/maven/scm/maven-scm-provider-perforce/1.1/maven-scm-provider-perforce-1.1.jar
     [exec] 63K downloaded  (maven-scm-provider-perforce-1.1.jar)
     [exec] Downloading: http://repository.sonatype.org:8081/content/groups/public/org/apache/maven/scm/maven-scm-provider-starteam/1.1/maven-scm-provider-starteam-1.1.jar
     [exec] 67K downloaded  (maven-scm-provider-starteam-1.1.jar)
     [exec] Downloading: http://repository.sonatype.org:8081/content/groups/public/org/apache/maven/scm/maven-scm-provider-svnexe/1.1/maven-scm-provider-svnexe-1.1.jar
     [exec] 57K downloaded  (maven-scm-provider-svnexe-1.1.jar)
     [exec] Downloading: http://repository.sonatype.org:8081/content/groups/public/org/apache/maven/scm/maven-scm-provider-svn-commons/1.1/maven-scm-provider-svn-commons-1.1.jar
     [exec] 36K downloaded  (maven-scm-provider-svn-commons-1.1.jar)
     [exec] Downloading: http://repository.sonatype.org:8081/content/groups/public/org/apache/maven/scm/maven-scm-provider-synergy/1.1/maven-scm-provider-synergy-1.1.jar
     [exec] 49K downloaded  (maven-scm-provider-synergy-1.1.jar)
     [exec] Downloading: http://repository.sonatype.org:8081/content/groups/public/org/apache/maven/scm/maven-scm-provider-vss/1.1/maven-scm-provider-vss-1.1.jar
     [exec] 53K downloaded  (maven-scm-provider-vss-1.1.jar)
     [exec] Downloading: http://repository.sonatype.org:8081/content/groups/public/org/apache/maven/scm/maven-scm-provider-local/1.1/maven-scm-provider-local-1.1.jar
     [exec] 39K downloaded  (maven-scm-provider-local-1.1.jar)
     [exec] [INFO] [scm:update {execution: scm}]
     [exec] [INFO] Executing: /bin/sh -c cd /tmp/maven-integration-tests-2.1.x &&
svn --non-interactive update /tmp/maven-integration-tests-2.1.x
     [exec] [INFO] Working directory: /tmp/maven-integration-tests-2.1.x
     [exec] [INFO] Storing revision in 'scm.revision' project property.
     [exec] [INFO] Project at revision 748698
     [exec] [INFO] ------------------------------------------------------------------------
     [exec] [INFO] BUILD SUCCESSFUL
     [exec] [INFO] ------------------------------------------------------------------------
     [exec] [INFO] Total time: 1 minute 18 seconds
     [exec] [INFO] Finished at: Fri Feb 27 15:09:21 GMT-06:00 2009
     [exec] [INFO] Final Memory: 13M/26M
     [exec] [INFO] ------------------------------------------------------------------------
     [echo] Running integration tests
     [exec] + Error stacktraces are turned on.
     [exec] [INFO] Scanning for projects...
     [exec] [WARNING] Profile with id: 'run-its' has not been activated.
     [exec] Downloading: http://repository.sonatype.org:8081/content/groups/public/org/apache/maven/maven-parent/9/maven-parent-9.pom
     [exec] [WARNING] Unable to get resource 'org.apache.maven:maven-parent:pom:9' from repository
central (http://Nexus): Error transferring file: Connection refused
     [exec] Downloading: http://repository.sonatype.org:8081/content/groups/nexus-staging/org/apache/maven/maven-parent/9/maven-parent-9.pom
     [exec] [WARNING] Unable to get resource 'org.apache.maven:maven-parent:pom:9' from repository
nexus-staging (http://repository.sonatype.org:8081/content/groups/nexus-staging): Error transferring
file: Connection refused
     [exec] Downloading: http://repository.sonatype.org:8081/content/groups/nexus-plugins-with-staging/org/apache/maven/maven-parent/9/maven-parent-9.pom
     [exec] [WARNING] Unable to get resource 'org.apache.maven:maven-parent:pom:9' from repository
nexus-plugins-staging (http://repository.sonatype.org:8081/content/groups/nexus-plugins-with-staging):
Error transferring file: Connection refused
     [exec] Downloading: http://repository.sonatype.org:8081/content/groups/public/org/apache/maven/maven-parent/9/maven-parent-9.pom
     [exec] [WARNING] Unable to get resource 'org.apache.maven:maven-parent:pom:9' from repository
central (http://repo1.maven.org/maven2): Error transferring file: Connection refused
     [exec] [INFO] ------------------------------------------------------------------------
     [exec] [ERROR] FATAL ERROR
     [exec] [INFO] ------------------------------------------------------------------------
     [exec] [INFO] Failed to resolve artifact.
     [exec] 
     [exec] GroupId: org.apache.maven
     [exec] ArtifactId: maven-parent
     [exec] Version: 9
     [exec] 
     [exec] Reason: Unable to download the artifact from any repository
     [exec] 
     [exec]   org.apache.maven:maven-parent:pom:9
     [exec] 
     [exec] from the specified remote repositories:
     [exec]   nexus-plugins-staging (http://repository.sonatype.org:8081/content/groups/nexus-plugins-with-staging),
     [exec]   Nexus (http://repository.sonatype.org:8081/content/groups/public),
     [exec]   nexus-staging (http://repository.sonatype.org:8081/content/groups/nexus-staging)
     [exec] 
     [exec] 
     [exec] 
     [exec] [INFO] ------------------------------------------------------------------------
     [exec] [INFO] Trace
     [exec] org.apache.maven.reactor.MavenExecutionException: Cannot find parent: org.apache.maven:maven-parent
for project: org.apache.maven.its:core-integration-testing:pom:2.1-SNAPSHOT for project org.apache.maven.its:core-integration-testing:pom:2.1-SNAPSHOT
     [exec] 	at org.apache.maven.DefaultMaven.getProjects(DefaultMaven.java:388)
     [exec] 	at org.apache.maven.DefaultMaven.doExecute(DefaultMaven.java:296)
     [exec] 	at org.apache.maven.DefaultMaven.execute(DefaultMaven.java:133)
     [exec] 	at org.apache.maven.cli.MavenCli.main(MavenCli.java:356)
     [exec] 	at sun.reflect.NativeMethodAccessorImpl.invoke0(Native Method)
     [exec] 	at sun.reflect.NativeMethodAccessorImpl.invoke(NativeMethodAccessorImpl.java:39)
     [exec] 	at sun.reflect.DelegatingMethodAccessorImpl.invoke(DelegatingMethodAccessorImpl.java:25)
     [exec] 	at java.lang.reflect.Method.invoke(Method.java:324)
     [exec] 	at org.codehaus.classworlds.Launcher.launchEnhanced(Launcher.java:315)
     [exec] 	at org.codehaus.classworlds.Launcher.launch(Launcher.java:255)
     [exec] 	at org.codehaus.classworlds.Launcher.mainWithExitCode(Launcher.java:430)
     [exec] 	at org.codehaus.classworlds.Launcher.main(Launcher.java:375)
     [exec] Caused by: org.apache.maven.project.ProjectBuildingException: Cannot find parent:
org.apache.maven:maven-parent for project: org.apache.maven.its:core-integration-testing:pom:2.1-SNAPSHOT
for project org.apache.maven.its:core-integration-testing:pom:2.1-SNAPSHOT
     [exec] 	at org.apache.maven.project.DefaultMavenProjectBuilder.assembleLineage(DefaultMavenProjectBuilder.java:1424)
     [exec] 	at org.apache.maven.project.DefaultMavenProjectBuilder.buildInternal(DefaultMavenProjectBuilder.java:823)
     [exec] 	at org.apache.maven.project.DefaultMavenProjectBuilder.buildFromSourceFileInternal(DefaultMavenProjectBuilder.java:508)
     [exec] 	at org.apache.maven.project.DefaultMavenProjectBuilder.build(DefaultMavenProjectBuilder.java:200)
     [exec] 	at org.apache.maven.DefaultMaven.getProject(DefaultMaven.java:588)
     [exec] 	at org.apache.maven.DefaultMaven.collectProjects(DefaultMaven.java:471)
     [exec] 	at org.apache.maven.DefaultMaven.collectProjects(DefaultMaven.java:544)
     [exec] 	at org.apache.maven.DefaultMaven.getProjects(DefaultMaven.java:375)
     [exec] 	... 11 more
     [exec] Caused by: org.apache.maven.project.ProjectBuildingException: POM 'org.apache.maven:maven-parent'
not found in repository: Unable to download the artifact from any repository
     [exec] 
     [exec]   org.apache.maven:maven-parent:pom:9
     [exec] 
     [exec] from the specified remote repositories:
     [exec]   nexus-plugins-staging (http://repository.sonatype.org:8081/content/groups/nexus-plugins-with-staging),
     [exec]   Nexus (http://repository.sonatype.org:8081/content/groups/public),
     [exec]   nexus-staging (http://repository.sonatype.org:8081/content/groups/nexus-staging)
     [exec] 
     [exec]  for project org.apache.maven:maven-parent
     [exec] 	at org.apache.maven.project.DefaultMavenProjectBuilder.findModelFromRepository(DefaultMavenProjectBuilder.java:605)
     [exec] 	at org.apache.maven.project.DefaultMavenProjectBuilder.assembleLineage(DefaultMavenProjectBuilder.java:1420)
     [exec] 	... 18 more
     [exec] Caused by: org.apache.maven.artifact.resolver.ArtifactNotFoundException: Unable
to download the artifact from any repository
     [exec] 
     [exec]   org.apache.maven:maven-parent:pom:9
     [exec] 
     [exec] from the specified remote repositories:
     [exec]   nexus-plugins-staging (http://repository.sonatype.org:8081/content/groups/nexus-plugins-with-staging),
     [exec]   Nexus (http://repository.sonatype.org:8081/content/groups/public),
     [exec]   nexus-staging (http://repository.sonatype.org:8081/content/groups/nexus-staging)
     [exec] 
     [exec] 
     [exec] 	at org.apache.maven.artifact.resolver.DefaultArtifactResolver.resolve(DefaultArtifactResolver.java:228)
     [exec] 	at org.apache.maven.artifact.resolver.DefaultArtifactResolver.resolve(DefaultArtifactResolver.java:90)
     [exec] 	at org.apache.maven.project.DefaultMavenProjectBuilder.findModelFromRepository(DefaultMavenProjectBuilder.java:558)
     [exec] 	... 19 more
     [exec] Caused by: org.apache.maven.wagon.ResourceDoesNotExistException: Unable to download
the artifact from any repository
     [exec] 	at org.apache.maven.artifact.manager.DefaultWagonManager.getArtifact(DefaultWagonManager.java:349)
     [exec] 	at org.apache.maven.artifact.resolver.DefaultArtifactResolver.resolve(DefaultArtifactResolver.java:216)
     [exec] 	... 21 more
     [exec] [INFO] ------------------------------------------------------------------------
     [exec] [INFO] Total time: < 1 second
     [exec] [INFO] Finished at: Fri Feb 27 15:09:22 GMT-06:00 2009
     [exec] [INFO] Final Memory: 1M/3M
     [exec] [INFO] ------------------------------------------------------------------------

BUILD FAILED
/home/hudson/workspace/Maven-2.1.x-bootstrap/jdk/1.4/label/ubuntu/maven-2.1.x/build.xml:289:
exec returned: 1

Total time: 4 minutes 17 seconds


Mime
View raw message