maven-notifications mailing list archives

Site index · List index
Message view « Date » · « Thread »
Top « Date » · « Thread »
From Hudson <Hud...@sonatype.org>
Subject Build failed in Hudson: Maven-2.0.10-RC-bootstrap » 1.4,ubuntu #61
Date Tue, 10 Feb 2009 02:34:55 GMT
See http://grid.sonatype.org/ci/job/Maven-2.0.10-RC-bootstrap/./jdk=1.4,label=ubuntu/61/changes

Changes:

[Brian Fox] added new distro mgt

------------------------------------------
[...truncated 3217 lines...]
     [exec] mng3288SystemScopeDir(itMNG3288)............................OK (1.2 s)
     [exec] mng3284UsingCachedPlugins(itMNG3284)........................SKIPPED - version
2.0.10-RC9-SNAPSHOT not in range [3.0-alpha-1,)
     [exec] mng3271DefaultReportsSuppression(itMNG3271).................OK (1.4 s)
     [exec] mng3221InfiniteForking(itMNG3221a)..........................OK (15.6 s)
     [exec] mng3221InfiniteForking(itMNG3221b)..........................OK (11.2 s)
     [exec] mng3268MultipleDashPCommandLine(MultipleProfileParams)......OK (4.7 s)
     [exec] mng3259DepsDroppedInMultiModuleBuild(itMNG3259).............OK (13.6 s)
     [exec] mng3220ImportScope(itMNG3220a)..............................OK (9.0 s)
     [exec] mng3220ImportScope(itMNG3220b)..............................OK (0.9 s)
     [exec] mng3106ProfileMultipleActivators(ProfilesWithMultipleActivators)..OK (4.6 s)
     [exec] mng3099SettingsProfilesWithNoPom(itMNG3099).................OK (8.6 s)
     [exec] mng3052DepRepoAggregation(itMNG3052)........................OK (15.1 s)
     [exec] mng3023ReactorDependencyResolution(itMNG3023A)..............OK (2.1 s)
     [exec] mng3023ReactorDependencyResolution(itMNG3023B)..............OK (3.9 s)
     [exec] mng3023ReactorDependencyResolution(itMNG3023C)..............FAILURE (7.2 s)
     [exec] mng3012CoreClassImport(itMNG3012)...........................OK (1.9 s)
     [exec] mng2972OverridePluginDependency(itLifecycleInvocation)......OK (1.7 s)
     [exec] mng2972OverridePluginDependency(itCommandLineInvocation)....OK (1.6 s)
     [exec] mng2926PluginPrefixOrder(itMNG2926).........................OK (12.4 s)
     [exec] mng2921ActiveAttachedArtifacts(itMNG2921)...................OK (2.0 s)
     [exec] mng2892HideCorePlexusUtils(itMNG2892).......................OK (1.8 s)
     [exec] mng2883LegacyRepoOffline(ParentUnresolvable)................OK (2.5 s)
     [exec] mng2883LegacyRepoOffline(DependencyUnresolvable)............OK (5.3 s)
     [exec] mng2883LegacyRepoOffline(PluginUnresolvable)................OK (3.1 s)
     [exec] mng2878DefaultReportXmlImport(itMNG2878)....................OK (2.9 s)
     [exec] mng2871PrePackageSubartifactResolution(itMNG2871)...........SKIPPED - version
2.0.10-RC9-SNAPSHOT not in range [3.0-alpha-1,)
     [exec] mng2865MirrorWildcard(itUserRepos)..........................OK (1.4 s)
     [exec] mng2865MirrorWildcard(itCentralRepo)........................OK (1.4 s)
     [exec] mng2861RelocationsAndRanges(itMNG2861)......................OK (9.1 s)
     [exec] mng2843PluginConfigPropertiesInjection(itMNG2843)...........OK (1.4 s)
     [exec] mng2831CustomArtifactHandlerAndCustomLifecycle(itMNG2831)...OK (1.4 s)
     [exec] mng2790LastUpdatedMetadata(itMNG2790).......................OK (3.1 s)
     [exec] mng2749ExtensionAvailableToPlugin(itMNG2749)................OK (1.8 s)
     [exec] mng2744checksumVerification(itMNG2744)......................OK (1.6 s)
     [exec] mng2739RequiredRepositoryElements(itMNG2739_RepositoryId)...OK (0.7 s)
     [exec] mng2739RequiredRepositoryElements(itMNG2739_RepositoryUrl)..OK (0.7 s)
     [exec] mng2720SiblingClasspathArtifacts(IT)........................SKIPPED - version
2.0.10-RC9-SNAPSHOT not in range (2.0.99,2.99.99)
     [exec] mng2695OfflinePluginSnapshots(itMNG2695)....................OK (2.4 s)
     [exec] mng2668UsePluginDependenciesForSorting(mng2668).............SKIPPED - version
2.0.10-RC9-SNAPSHOT not in range (2.1.0-M1,3.0-alpha-1)
     [exec] mng2605BogusProfileActivation(itMNG2605)....................SKIPPED - version
2.0.10-RC9-SNAPSHOT not in range (2.0.10,2.1.0-M1),(2.1.0-M1,3.0-alpha-1),(3.0-alpha-1,)
     [exec] mng2591MergeInheritedPluginConfig(itMNG2591)................OK (1.4 s)
     [exec] mng2562Timestamp(itMNG2562).................................SKIPPED - version
2.0.10-RC9-SNAPSHOT not in range [2.1.0-M1,)
     [exec] mng2539PluginDependenciesComeFromPluginRepos(itMNG2539).....OK (1.6 s)
     [exec] mng2339BadProjectInterpolation(itMNG2339a)..................OK (2.2 s)
     [exec] mng2339BadProjectInterpolation(itMNG2339b)..................OK (4.3 s)
     [exec] mng2318LocalParentResolution(itMNG2318).....................OK (1.7 s)
     [exec] mng2293CustomPluginParamImpl(itMNG2293).....................OK (2.1 s)
     [exec] mng2277AggregatorAndResolutionPlugins(itMNG2277)............OK (2.2 s)
     [exec] mng2254PomEncoding(itMNG2254)...............................OK (1.6 s)
     [exec] mng2234ActiveProfilesFromSettings(itMNG2234)................OK (4.8 s)
     [exec] mng2228ComponentInjection(itMNG2228)........................OK (2.2 s)
     [exec] mng2201PluginConfigInterpolation(itMNG2201).................OK (1.5 s)
     [exec] mng2196ParentResolution(itMNG2196)..........................OK (6.2 s)
     [exec] mng2136ActiveByDefaultProfile(itMNG2136)....................OK (1.5 s)
     [exec] mng2130ParentLookupFromReactorCache(itMNG2130)..............OK (6.1 s)
     [exec] mng2124PomInterpolationWithParentValues(itMNG2124)..........OK (2.1 s)
     [exec] mng2123VersionRangeDependency(itMNG2123)....................OK (18.8 s)
     [exec] mng2068ReactorRelativeParents(itInheritedIdFields)..........OK (0.9 s)
     [exec] mng2068ReactorRelativeParents(itExplicitIdFields)...........OK (1.0 s)
     [exec] mng2068ReactorRelativeParents(itComplex)....................OK (1.0 s)
     [exec] mng2054PluginExecutionInheritance(itMNG2054)................OK (1.6 s)
     [exec] mng2052InterpolateWithSettingsProfileProperties(itMNG2052)..OK (1.3 s)
     [exec] mng2045testJarDependenciesBrokenInReactor(itMNG2045)........OK (7.2 s)
     [exec] mng2006ChildPathAwareUrlInheritance(itMNG2006)..............OK (1.5 s)
     [exec] mng1999DefaultReportsInheritance(itInheritSuppression)......OK (1.6 s)
     [exec] mng1999DefaultReportsInheritance(itOverrideSuppression).....OK (8.2 s)
     [exec] mng1995InterpolateBooleanModelElements(itMNG1995)...........SKIPPED - version
2.0.10-RC9-SNAPSHOT not in range [3.0-alpha-1,)
     [exec] mng1992SystemPropOverridesPomProp(itMNG1992)................SKIPPED - version
2.0.10-RC9-SNAPSHOT not in range (2.1.0-M1,)
     [exec] mng1957JdkActivationWithVersionRange(itMNG1957).............SKIPPED - version
2.0.10-RC9-SNAPSHOT not in range [2.1.0-M2,)
     [exec] mng1908LegacySnapshotUpdate(itMNG1908)......................OK (1.7 s)
     [exec] mng1830ShowVersion(Version).................................SKIPPED - version
2.0.10-RC9-SNAPSHOT not in range (2.0.10,2.1.0-M1),(2.1.0-M1,3.0-alpha-1)
     [exec] mng1703PluginMgmtDepInheritance(itMNG1703)..................OK (2.0 s)
     [exec] mng1493NonStandardModulePomNames(itMNG1493).................OK (0.9 s)
     [exec] mng1491ReactorArtifactIdCollision(itMNG1491)................OK (1.0 s)
     [exec] mng1415QuotedSystemProperties(itMNG1415)....................OK (1.6 s)
     [exec] mng1412DependenciesOrder(itMNG1412).........................OK (2.4 s)
     [exec] mng1349ChecksumFormats(itMNG1349)...........................SKIPPED - version
2.0.10-RC9-SNAPSHOT not in range (2.0.10,2.1.0-M1),(2.1.0-M1,)
     [exec] mng1323AntrunDependencies(itMNG1323)........................SKIPPED - version
2.0.10-RC9-SNAPSHOT not in range [3.0-alpha-1,)
     [exec] mng1233WarDepWithProvidedScope(itMNG1233)...................OK (1.7 s)
     [exec] mng1088ReactorDepResolution(itMNG1088)......................OK (2.2 s)
     [exec] mng1052PluginMngtConfig(itMNG1052)..........................OK (1.7 s)
     [exec] mng1021EqualAttachmentBuildNumber(itMNG1021)................OK (1.8 s)
     [exec] mng0985NonExecutedPluginMngtGoals(itMNG0985)................OK (0.9 s)
     [exec] mng0956ComponentInjectionViaProjectLevelPluginDep(itMNG0956)..OK (1.8 s)
     [exec] mng0870ReactorAwarePluginDiscovery(itMNG0870)...............OK (1.8 s)
     [exec] mng0866EvaluateDefaultValue(itMNG866).......................OK (1.5 s)
     [exec] mng0848SystemPropOverridesDefaultValue(itMNG848)............OK (1.5 s)
     [exec] mng0836PluginParentResolution(itMNG836).....................OK (1.2 s)
     [exec] mng0823MojoContextPassing(itMNG0823)........................OK (1.4 s)
     [exec] mng0820ConflictResolution(itMNG0820)........................OK (1.9 s)
     [exec] mng0818WarDepsNotTransitive(itMNG0818)......................OK (1.8 s)
     [exec] mng0814ExplicitProfileActivation(itMNG814)..................OK (1.5 s)
     [exec] mng0786ProfileAwareReactor(itMNG0786).......................OK (1.5 s)
     [exec] mng0781PluginConfigVsExecConfig(itMNG0781)..................OK (1.8 s)
     [exec] mng0773SettingsProfileReactorPollution(itMNG773)............OK (0.8 s)
     [exec] mng0768OfflineMode(itMNG768)................................OK (4.4 s)
     [exec] mng0761MissingSnapshotDistRepo(itMNG761)....................OK (1.7 s)
     [exec] mng0731LegacyRepoLayout(itMNG731)...........................OK (1.6 s)
     [exec] mng0680ParentBasedir(itMNG680)..............................OK (1.4 s)
     [exec] mng0674PluginParameterAlias(itMNG674).......................OK (1.7 s)
     [exec] mng0666IgnoreLegacyPom(itMNG666)............................OK (1.7 s)
     [exec] mng0557UserSettingsCliOption(itMNG557)......................OK (1.5 s)
     [exec] mng0553SettingsAuthzEncryption(it0553)......................SKIPPED - version
2.0.10-RC9-SNAPSHOT not in range (2.1.0-M1,3.0-alpha-1)
     [exec] mng0522PluginMgmtConfig(itMNG522)...........................OK (1.5 s)
     [exec] mng0507ArtifactRelocation(itMNG507).........................OK (1.7 s)
     [exec] mng0505VersionRange(itMNG505)...............................OK (1.4 s)
     [exec] mng0496IgnoreUnknownPluginParameters(itMNG496)..............OK (1.5 s)
     [exec] mng0479OverrideCentralRepo(itMNG479)........................OK (2.6 s)
     [exec] mng0471CustomLifecycle(itMNG471)............................OK (1.7 s)
     [exec] mng0469ReportConfig(itReportConfigOverridesBuildDefaults)...OK (1.4 s)
     [exec] mng0469ReportConfig(itBuildConfigDominantDuringBuild).......OK (1.5 s)
     [exec] mng0469ReportConfig(itBuildConfigIrrelevantForReports)......OK (2.0 s)
     [exec] mng0377PluginLookupFromPrefix(itMNG377).....................OK (2.2 s)
     [exec] mng0294MergeGlobalAndUserSettings(itMNG294).................OK (1.5 s)
     [exec] mng0282NonReactorExecWhenProjectIndependent(itMNG282).......OK (1.4 s)
     [exec] mng0249ResolveDepsFromReactor(itMNG0249)....................OK (1.9 s)
     [exec] mng0095ReactorFailureBehavior(itFailFast)...................OK (1.7 s)
     [exec] mng0095ReactorFailureBehavior(itFailNever)..................OK (1.8 s)
     [exec] mng0095ReactorFailureBehavior(itFailAtEnd)..................OK (1.7 s)
     [exec] 0144LifecycleExecutionOrder(it0144).........................OK (3.6 s)
     [exec] 0143TransitiveDependencyScopes(itCompileScope)..............OK (1.6 s)
     [exec] 0143TransitiveDependencyScopes(itProvidedScope).............OK (2.0 s)
     [exec] 0143TransitiveDependencyScopes(itRuntimeScope)..............OK (2.8 s)
     [exec] 0143TransitiveDependencyScopes(itTestScope).................OK (3.0 s)
     [exec] 0142DirectDependencyScopes(it0142)..........................OK (3.3 s)
     [exec] 0140(it0140)................................................OK (2.5 s)
     [exec] 0139(it0139)................................................OK (2.0 s)
     [exec] 0138PluginLifecycle(it0138).................................OK (3.1 s)
     [exec] 0137EarLifecycle(it0137)....................................OK (2.7 s)
     [exec] 0136RarLifecycle(it0136)....................................OK (2.9 s)
     [exec] 0135EjbLifecycle(it0135)....................................OK (3.0 s)
     [exec] 0134WarLifecycle(it0134)....................................OK (2.9 s)
     [exec] 0133JarLifecycle(it0133)....................................OK (3.0 s)
     [exec] 0132PomLifecycle(it0132)....................................OK (2.2 s)
     [exec] 0131SiteLifecycle(it0131)...................................OK (1.7 s)
     [exec] 0130CleanLifecycle(it0130)..................................OK (1.7 s)
     [exec] 0113ServerAuthzAvailableToWagonMgrInPlugin(it0113)..........OK (1.5 s)
     [exec] 0090(it0090)................................................OK (1.5 s)
     [exec] 0087(it0087)................................................OK (2.0 s)
     [exec] 0086(it0086)................................................OK (2.0 s)
     [exec] 0085(it0085)................................................OK (1.8 s)
     [exec] 0072(it0072)................................................OK (1.4 s)
     [exec] 0071(it0071)................................................OK (1.8 s)
     [exec] 0064(it0064)................................................OK (1.4 s)
     [exec] 0063(it0063)................................................OK (1.5 s)
     [exec] 0056(it0056)................................................OK (1.4 s)
     [exec] 0052(it0052)................................................OK (2.3 s)
     [exec] 0051(it0051)................................................OK (3.0 s)
     [exec] 0041(it0041)................................................OK (1.8 s)
     [exec] 0040(it0040)................................................OK (1.4 s)
     [exec] 0039(it0039)................................................OK (2.0 s)
     [exec] 0038(it0038)................................................OK (1.3 s)
     [exec] 0037(it0037)................................................OK (1.3 s)
     [exec] 0036(it0036)................................................OK (1.4 s)
     [exec] 0032(it0032)................................................OK (0.9 s)
     [exec] 0030(it0030)................................................OK (6.2 s)
     [exec] 0025(it0025)................................................OK (1.7 s)
     [exec] 0024(it0024)................................................OK (1.4 s)
     [exec] 0023(it0023)................................................OK (1.4 s)
     [exec] 0021(it0021)................................................OK (1.8 s)
     [exec] 0019(it0019)................................................OK (2.2 s)
     [exec] 0018(it0018)................................................OK (1.9 s)
     [exec] 0012(it0012)................................................OK (1.8 s)
     [exec] 0011(it0011)................................................OK (1.6 s)
     [exec] 0010(it0010)................................................OK (1.9 s)
     [exec] 0009(it0009)................................................OK (1.8 s)
     [exec] 0008(it0008)................................................OK (1.8 s)
     [exec] 0007(it0007)................................................OK (1.0 s)
     [exec] Tests run: 319, Failures: 1, Errors: 0, Skipped: 0, Time elapsed: 864.499 sec
<<< FAILURE!
     [exec] testitMNG3023C(org.apache.maven.it.MavenITmng3023ReactorDependencyResolutionTest)
 Time elapsed: 7.206 sec  <<< FAILURE!
     [exec] junit.framework.AssertionFailedError
     [exec] 	at junit.framework.Assert.fail(Assert.java:47)
     [exec] 	at junit.framework.Assert.assertTrue(Assert.java:20)
     [exec] 	at junit.framework.Assert.assertTrue(Assert.java:27)
     [exec] 	at org.apache.maven.it.MavenITmng3023ReactorDependencyResolutionTest.testitMNG3023C(MavenITmng3023ReactorDependencyResolutionTest.java:123)
     [exec] 	at org.apache.maven.it.MavenITmng3023ReactorDependencyResolutionTest.testitMNG3023C(MavenITmng3023ReactorDependencyResolutionTest.java:123)
     [exec] 	at sun.reflect.NativeMethodAccessorImpl.invoke0(Native Method)
     [exec] 	at sun.reflect.NativeMethodAccessorImpl.invoke(NativeMethodAccessorImpl.java:39)
     [exec] 	at sun.reflect.DelegatingMethodAccessorImpl.invoke(DelegatingMethodAccessorImpl.java:25)
     [exec] 	at java.lang.reflect.Method.invoke(Method.java:324)
     [exec] 	at junit.framework.TestCase.runTest(TestCase.java:164)
     [exec] 	at org.apache.maven.it.AbstractMavenIntegrationTestCase.runTest(AbstractMavenIntegrationTestCase.java:178)
     [exec] 	at junit.framework.TestCase.runBare(TestCase.java:130)
     [exec] 	at junit.framework.TestResult$1.protect(TestResult.java:106)
     [exec] 	at junit.framework.TestResult.runProtected(TestResult.java:124)
     [exec] 	at junit.framework.TestResult.run(TestResult.java:109)
     [exec] 	at junit.framework.TestCase.run(TestCase.java:120)
     [exec] 	at junit.framework.TestSuite.runTest(TestSuite.java:230)
     [exec] 	at junit.framework.TestSuite.run(TestSuite.java:225)
     [exec] 	at junit.framework.TestSuite.runTest(TestSuite.java:230)
     [exec] 	at junit.framework.TestSuite.run(TestSuite.java:225)
     [exec] 	at sun.reflect.NativeMethodAccessorImpl.invoke0(Native Method)
     [exec] 	at sun.reflect.NativeMethodAccessorImpl.invoke(NativeMethodAccessorImpl.java:39)
     [exec] 	at sun.reflect.DelegatingMethodAccessorImpl.invoke(DelegatingMethodAccessorImpl.java:25)
     [exec] 	at java.lang.reflect.Method.invoke(Method.java:324)
     [exec] 	at org.apache.maven.surefire.junit.JUnitTestSet.execute(JUnitTestSet.java:213)
     [exec] 	at org.apache.maven.surefire.suite.AbstractDirectoryTestSuite.executeTestSet(AbstractDirectoryTestSuite.java:138)
     [exec] 	at org.apache.maven.surefire.suite.AbstractDirectoryTestSuite.execute(AbstractDirectoryTestSuite.java:125)
     [exec] 	at org.apache.maven.surefire.Surefire.run(Surefire.java:132)
     [exec] 	at sun.reflect.NativeMethodAccessorImpl.invoke0(Native Method)
     [exec] 	at sun.reflect.NativeMethodAccessorImpl.invoke(NativeMethodAccessorImpl.java:39)
     [exec] 	at sun.reflect.DelegatingMethodAccessorImpl.invoke(DelegatingMethodAccessorImpl.java:25)
     [exec] 	at java.lang.reflect.Method.invoke(Method.java:324)
     [exec] 	at org.apache.maven.surefire.booter.SurefireBooter.runSuitesInProcess(SurefireBooter.java:290)
     [exec] 	at org.apache.maven.surefire.booter.SurefireBooter.run(SurefireBooter.java:198)
     [exec] 	at org.apache.maven.plugin.surefire.SurefirePlugin.execute(SurefirePlugin.java:398)
     [exec] 	at org.apache.maven.plugin.DefaultPluginManager.executeMojo(DefaultPluginManager.java:453)
     [exec] 	at org.apache.maven.lifecycle.DefaultLifecycleExecutor.executeGoals(DefaultLifecycleExecutor.java:559)
     [exec] 	at org.apache.maven.lifecycle.DefaultLifecycleExecutor.executeGoalWithLifecycle(DefaultLifecycleExecutor.java:500)
     [exec] 	at org.apache.maven.lifecycle.DefaultLifecycleExecutor.executeGoal(DefaultLifecycleExecutor.java:479)
     [exec] 	at org.apache.maven.lifecycle.DefaultLifecycleExecutor.executeGoalAndHandleFailures(DefaultLifecycleExecutor.java:331)
     [exec] 	at org.apache.maven.lifecycle.DefaultLifecycleExecutor.executeTaskSegments(DefaultLifecycleExecutor.java:292)
     [exec] 	at org.apache.maven.lifecycle.DefaultLifecycleExecutor.execute(DefaultLifecycleExecutor.java:142)
     [exec] 	at org.apache.maven.DefaultMaven.doExecute(DefaultMaven.java:336)
     [exec] 	at org.apache.maven.DefaultMaven.execute(DefaultMaven.java:129)
     [exec] 	at org.apache.maven.cli.MavenCli.main(MavenCli.java:301)
     [exec] 	at sun.reflect.NativeMethodAccessorImpl.invoke0(Native Method)
     [exec] 	at sun.reflect.NativeMethodAccessorImpl.invoke(NativeMethodAccessorImpl.java:39)
     [exec] 	at sun.reflect.DelegatingMethodAccessorImpl.invoke(DelegatingMethodAccessorImpl.java:25)
     [exec] 	at java.lang.reflect.Method.invoke(Method.java:324)
     [exec] 	at org.codehaus.classworlds.Launcher.launchEnhanced(Launcher.java:315)
     [exec] 	at org.codehaus.classworlds.Launcher.launch(Launcher.java:255)
     [exec] 	at org.codehaus.classworlds.Launcher.mainWithExitCode(Launcher.java:430)
     [exec] 	at org.codehaus.classworlds.Launcher.main(Launcher.java:375)
     [exec] 
     [exec] 
     [exec] Results :
     [exec] 
     [exec] Failed tests: 
     [exec]   testitMNG3023C(org.apache.maven.it.MavenITmng3023ReactorDependencyResolutionTest)
     [exec] 
     [exec] Tests run: 319, Failures: 1, Errors: 0, Skipped: 0
     [exec] 
     [exec] [INFO] ------------------------------------------------------------------------
     [exec] [ERROR] BUILD FAILURE
     [exec] [INFO] ------------------------------------------------------------------------
     [exec] [INFO] There are test failures.
     [exec] [INFO] ------------------------------------------------------------------------
     [exec] [INFO] For more information, run Maven with the -e switch
     [exec] [INFO] ------------------------------------------------------------------------
     [exec] [INFO] Total time: 15 minutes 52 seconds
     [exec] [INFO] Finished at: Mon Feb 09 20:34:55 GMT-06:00 2009
     [exec] [INFO] Final Memory: 31M/66M
     [exec] [INFO] ------------------------------------------------------------------------

BUILD FAILED
/home/hudson/workspace/Maven-2.0.10-RC-bootstrap/jdk/1.4/label/ubuntu/maven-2.0.10-RC/build.xml:260:
exec returned: 1

Total time: 18 minutes 6 seconds


Mime
View raw message