maven-notifications mailing list archives

Site index · List index
Message view « Date » · « Thread »
Top « Date » · « Thread »
From Apache Hudson Server <hud...@hudson.zones.apache.org>
Subject Build failed in Hudson: Maven-3.0.x-with-bootstrap #337
Date Sun, 22 Feb 2009 20:21:50 GMT
See http://hudson.zones.apache.org/hudson/job/Maven-3.0.x-with-bootstrap/337/changes

Changes:

[bentmann] o Fixed test descriptors due to r746432

------------------------------------------
[...truncated 1541 lines...]
     [java] [INFO] ------------------------------------------------------------------------
     [java] [INFO] [resources:resources]
     [java] [INFO] Using default encoding to copy filtered resources.
     [java] [INFO] [compiler:compile]
     [java] [INFO] Compiling 1 source file to /zonestorage/hudson/home/hudson/hudson/jobs/Maven-3.0.x-with-bootstrap/workspace/trunk/maven-embedder/target/embedder-test-project0/target/classes
     [java] [INFO] [resources:testResources]
     [java] [INFO] Using default encoding to copy filtered resources.
     [java] [INFO] [compiler:testCompile]
     [java] [INFO] Compiling 1 source file to /zonestorage/hudson/home/hudson/hudson/jobs/Maven-3.0.x-with-bootstrap/workspace/trunk/maven-embedder/target/embedder-test-project0/target/test-classes
     [java] Encountered 1 exception(s).
     [java] org.apache.maven.ProjectBuildFailureException: Build for project: org.apache.maven:embedder-test-project:jar:1.0-SNAPSHOT
failed during execution of mojo: org.apache.maven.plugins:maven-compiler-plugin:2.0.2:testCompile
     [java] 	at org.apache.maven.lifecycle.DefaultLifecycleExecutor.executeTaskSegmentForProject(DefaultLifecycleExecutor.java:286)
     [java] 	at org.apache.maven.lifecycle.DefaultLifecycleExecutor.executeTaskSegments(DefaultLifecycleExecutor.java:200)
     [java] 	at org.apache.maven.lifecycle.DefaultLifecycleExecutor.execute(DefaultLifecycleExecutor.java:163)
     [java] 	at org.apache.maven.DefaultMaven.execute(DefaultMaven.java:207)
     [java] 	at org.apache.maven.embedder.MavenEmbedder.execute(MavenEmbedder.java:851)
     [java] 	at org.apache.maven.embedder.MavenEmbedderTest.testExecutionUsingABaseDirectory(MavenEmbedderTest.java:126)
     [java] 	at sun.reflect.NativeMethodAccessorImpl.invoke0(Native Method)
     [java] 	at sun.reflect.NativeMethodAccessorImpl.invoke(NativeMethodAccessorImpl.java:39)
     [java] 	at sun.reflect.DelegatingMethodAccessorImpl.invoke(DelegatingMethodAccessorImpl.java:25)
     [java] 	at java.lang.reflect.Method.invoke(Method.java:585)
     [java] 	at junit.framework.TestCase.runTest(TestCase.java:154)
     [java] 	at junit.framework.TestCase.runBare(TestCase.java:127)
     [java] 	at junit.framework.TestResult$1.protect(TestResult.java:106)
     [java] 	at junit.framework.TestResult.runProtected(TestResult.java:124)
     [java] 	at junit.framework.TestResult.run(TestResult.java:109)
     [java] 	at junit.framework.TestCase.run(TestCase.java:118)
     [java] 	at junit.framework.TestSuite.runTest(TestSuite.java:208)
     [java] 	at junit.framework.TestSuite.run(TestSuite.java:203)
     [java] 	at sun.reflect.NativeMethodAccessorImpl.invoke0(Native Method)
     [java] 	at sun.reflect.NativeMethodAccessorImpl.invoke(NativeMethodAccessorImpl.java:39)
     [java] 	at sun.reflect.DelegatingMethodAccessorImpl.invoke(DelegatingMethodAccessorImpl.java:25)
     [java] 	at java.lang.reflect.Method.invoke(Method.java:585)
     [java] 	at org.apache.maven.surefire.junit.JUnitTestSet.execute(JUnitTestSet.java:213)
     [java] 	at org.apache.maven.surefire.suite.AbstractDirectoryTestSuite.executeTestSet(AbstractDirectoryTestSuite.java:140)
     [java] 	at org.apache.maven.surefire.suite.AbstractDirectoryTestSuite.execute(AbstractDirectoryTestSuite.java:127)
     [java] 	at org.apache.maven.surefire.Surefire.run(Surefire.java:177)
     [java] 	at sun.reflect.NativeMethodAccessorImpl.invoke0(Native Method)
     [java] 	at sun.reflect.NativeMethodAccessorImpl.invoke(NativeMethodAccessorImpl.java:39)
     [java] 	at sun.reflect.DelegatingMethodAccessorImpl.invoke(DelegatingMethodAccessorImpl.java:25)
     [java] 	at java.lang.reflect.Method.invoke(Method.java:585)
     [java] 	at org.apache.maven.surefire.booter.SurefireBooter.runSuitesInProcess(SurefireBooter.java:338)
     [java] 	at org.apache.maven.surefire.booter.SurefireBooter.main(SurefireBooter.java:997)
     [java] Caused by: org.apache.maven.plugin.CompilationFailureException: Compilation failure
     [java] 	at org.apache.maven.plugin.AbstractCompilerMojo.execute(AbstractCompilerMojo.java:516)
     [java] 	at org.apache.maven.plugin.TestCompilerMojo.execute(TestCompilerMojo.java:102)
     [java] 	at org.apache.maven.plugin.DefaultPluginManager.executeMojo(DefaultPluginManager.java:628)
     [java] 	at org.apache.maven.lifecycle.DefaultLifecycleExecutor.executeGoalAndHandleFailures(DefaultLifecycleExecutor.java:491)
     [java] 	at org.apache.maven.lifecycle.DefaultLifecycleExecutor.executeTaskSegmentForProject(DefaultLifecycleExecutor.java:258)
     [java] 	... 31 more
     [java] [INFO] Scanning for projects...
     [java] [INFO] Scanning for projects...
     [java] [INFO] ------------------------------------------------------------------------
     [java] [INFO] Building Maven Quick Start Archetype
     [java] [INFO] 
     [java] [INFO] Id: org.apache.maven:embedder-test-project:jar:1.0-SNAPSHOT
     [java] [INFO] task-segment: [package]
     [java] [INFO] ------------------------------------------------------------------------
     [java] [INFO] [resources:resources]
     [java] [INFO] Using default encoding to copy filtered resources.
     [java] [INFO] [compiler:compile]
     [java] [INFO] Compiling 1 source file to /zonestorage/hudson/home/hudson/hudson/jobs/Maven-3.0.x-with-bootstrap/workspace/trunk/maven-embedder/target/embedder-test-project1/target/classes
     [java] [INFO] [resources:testResources]
     [java] [INFO] Using default encoding to copy filtered resources.
     [java] [INFO] [compiler:testCompile]
     [java] [INFO] Compiling 1 source file to /zonestorage/hudson/home/hudson/hudson/jobs/Maven-3.0.x-with-bootstrap/workspace/trunk/maven-embedder/target/embedder-test-project1/target/test-classes
     [java] Encountered 1 exception(s).
     [java] org.apache.maven.ProjectBuildFailureException: Build for project: org.apache.maven:embedder-test-project:jar:1.0-SNAPSHOT
failed during execution of mojo: org.apache.maven.plugins:maven-compiler-plugin:2.0.2:testCompile
     [java] 	at org.apache.maven.lifecycle.DefaultLifecycleExecutor.executeTaskSegmentForProject(DefaultLifecycleExecutor.java:286)
     [java] 	at org.apache.maven.lifecycle.DefaultLifecycleExecutor.executeTaskSegments(DefaultLifecycleExecutor.java:200)
     [java] 	at org.apache.maven.lifecycle.DefaultLifecycleExecutor.execute(DefaultLifecycleExecutor.java:163)
     [java] 	at org.apache.maven.DefaultMaven.execute(DefaultMaven.java:207)
     [java] 	at org.apache.maven.embedder.MavenEmbedder.execute(MavenEmbedder.java:851)
     [java] 	at org.apache.maven.embedder.MavenEmbedderTest.testExecutionUsingAPomFile(MavenEmbedderTest.java:176)
     [java] 	at sun.reflect.NativeMethodAccessorImpl.invoke0(Native Method)
     [java] 	at sun.reflect.NativeMethodAccessorImpl.invoke(NativeMethodAccessorImpl.java:39)
     [java] 	at sun.reflect.DelegatingMethodAccessorImpl.invoke(DelegatingMethodAccessorImpl.java:25)
     [java] 	at java.lang.reflect.Method.invoke(Method.java:585)
     [java] 	at junit.framework.TestCase.runTest(TestCase.java:154)
     [java] 	at junit.framework.TestCase.runBare(TestCase.java:127)
     [java] 	at junit.framework.TestResult$1.protect(TestResult.java:106)
     [java] 	at junit.framework.TestResult.runProtected(TestResult.java:124)
     [java] 	at junit.framework.TestResult.run(TestResult.java:109)
     [java] 	at junit.framework.TestCase.run(TestCase.java:118)
     [java] 	at junit.framework.TestSuite.runTest(TestSuite.java:208)
     [java] 	at junit.framework.TestSuite.run(TestSuite.java:203)
     [java] 	at sun.reflect.NativeMethodAccessorImpl.invoke0(Native Method)
     [java] 	at sun.reflect.NativeMethodAccessorImpl.invoke(NativeMethodAccessorImpl.java:39)
     [java] 	at sun.reflect.DelegatingMethodAccessorImpl.invoke(DelegatingMethodAccessorImpl.java:25)
     [java] 	at java.lang.reflect.Method.invoke(Method.java:585)
     [java] 	at org.apache.maven.surefire.junit.JUnitTestSet.execute(JUnitTestSet.java:213)
     [java] 	at org.apache.maven.surefire.suite.AbstractDirectoryTestSuite.executeTestSet(AbstractDirectoryTestSuite.java:140)
     [java] 	at org.apache.maven.surefire.suite.AbstractDirectoryTestSuite.execute(AbstractDirectoryTestSuite.java:127)
     [java] 	at org.apache.maven.surefire.Surefire.run(Surefire.java:177)
     [java] 	at sun.reflect.NativeMethodAccessorImpl.invoke0(Native Method)
     [java] 	at sun.reflect.NativeMethodAccessorImpl.invoke(NativeMethodAccessorImpl.java:39)
     [java] 	at sun.reflect.DelegatingMethodAccessorImpl.invoke(DelegatingMethodAccessorImpl.java:25)
     [java] 	at java.lang.reflect.Method.invoke(Method.java:585)
     [java] 	at org.apache.maven.surefire.booter.SurefireBooter.runSuitesInProcess(SurefireBooter.java:338)
     [java] 	at org.apache.maven.surefire.booter.SurefireBooter.main(SurefireBooter.java:997)
     [java] Caused by: org.apache.maven.plugin.CompilationFailureException: Compilation failure
     [java] 	at org.apache.maven.plugin.AbstractCompilerMojo.execute(AbstractCompilerMojo.java:516)
     [java] 	at org.apache.maven.plugin.TestCompilerMojo.execute(TestCompilerMojo.java:102)
     [java] 	at org.apache.maven.plugin.DefaultPluginManager.executeMojo(DefaultPluginManager.java:628)
     [java] 	at org.apache.maven.lifecycle.DefaultLifecycleExecutor.executeGoalAndHandleFailures(DefaultLifecycleExecutor.java:491)
     [java] 	at org.apache.maven.lifecycle.DefaultLifecycleExecutor.executeTaskSegmentForProject(DefaultLifecycleExecutor.java:258)
     [java] 	... 31 more
     [java] [INFO] Scanning for projects...
     [java] [INFO] ------------------------------------------------------------------------
     [java] [INFO] Building Maven Quick Start Archetype
     [java] [INFO] 
     [java] [INFO] Id: org.apache.maven:embedder-test-project:jar:1.0-SNAPSHOT
     [java] [INFO] task-segment: [validate]
     [java] [INFO] ------------------------------------------------------------------------
     [java] [INFO] Scanning for projects...
     [java] [INFO] ------------------------------------------------------------------------
     [java] [INFO] Building Maven Quick Start Archetype
     [java] [INFO] 
     [java] [INFO] Id: org.apache.maven:embedder-test-project:jar:1.0-SNAPSHOT
     [java] [INFO] task-segment: [validate]
     [java] [INFO] ------------------------------------------------------------------------
     [java] [INFO] Scanning for projects...
     [java] [INFO] ------------------------------------------------------------------------
     [java] [INFO] Building Maven Quick Start Archetype
     [java] [INFO] 
     [java] [INFO] Id: org.apache.maven:embedder-test-project:jar:1.0-SNAPSHOT
     [java] [INFO] task-segment: [package]
     [java] [INFO] ------------------------------------------------------------------------
     [java] [INFO] [resources:resources]
     [java] [INFO] Using default encoding to copy filtered resources.
     [java] [INFO] [compiler:compile]
     [java] [INFO] Compiling 1 source file to /zonestorage/hudson/home/hudson/hudson/jobs/Maven-3.0.x-with-bootstrap/workspace/trunk/maven-embedder/target/embedder-test-project-caching/target/classes
     [java] [INFO] [resources:testResources]
     [java] [INFO] Using default encoding to copy filtered resources.
     [java] [INFO] [compiler:testCompile]
     [java] [INFO] Compiling 1 source file to /zonestorage/hudson/home/hudson/hudson/jobs/Maven-3.0.x-with-bootstrap/workspace/trunk/maven-embedder/target/embedder-test-project-caching/target/test-classes
     [java] Encountered 1 exception(s).
     [java] org.apache.maven.ProjectBuildFailureException: Build for project: org.apache.maven:embedder-test-project:jar:1.0-SNAPSHOT
failed during execution of mojo: org.apache.maven.plugins:maven-compiler-plugin:2.0.2:testCompile
     [java] 	at org.apache.maven.lifecycle.DefaultLifecycleExecutor.executeTaskSegmentForProject(DefaultLifecycleExecutor.java:286)
     [java] 	at org.apache.maven.lifecycle.DefaultLifecycleExecutor.executeTaskSegments(DefaultLifecycleExecutor.java:200)
     [java] 	at org.apache.maven.lifecycle.DefaultLifecycleExecutor.execute(DefaultLifecycleExecutor.java:163)
     [java] 	at org.apache.maven.DefaultMaven.execute(DefaultMaven.java:207)
     [java] 	at org.apache.maven.embedder.MavenEmbedder.execute(MavenEmbedder.java:851)
     [java] 	at org.apache.maven.embedder.MavenEmbedderTest.testTwoExecutionsDoNotCacheChangedData(MavenEmbedderTest.java:268)
     [java] 	at sun.reflect.NativeMethodAccessorImpl.invoke0(Native Method)
     [java] 	at sun.reflect.NativeMethodAccessorImpl.invoke(NativeMethodAccessorImpl.java:39)
     [java] 	at sun.reflect.DelegatingMethodAccessorImpl.invoke(DelegatingMethodAccessorImpl.java:25)
     [java] 	at java.lang.reflect.Method.invoke(Method.java:585)
     [java] 	at junit.framework.TestCase.runTest(TestCase.java:154)
     [java] 	at junit.framework.TestCase.runBare(TestCase.java:127)
     [java] 	at junit.framework.TestResult$1.protect(TestResult.java:106)
     [java] 	at junit.framework.TestResult.runProtected(TestResult.java:124)
     [java] 	at junit.framework.TestResult.run(TestResult.java:109)
     [java] 	at junit.framework.TestCase.run(TestCase.java:118)
     [java] 	at junit.framework.TestSuite.runTest(TestSuite.java:208)
     [java] 	at junit.framework.TestSuite.run(TestSuite.java:203)
     [java] 	at sun.reflect.NativeMethodAccessorImpl.invoke0(Native Method)
     [java] 	at sun.reflect.NativeMethodAccessorImpl.invoke(NativeMethodAccessorImpl.java:39)
     [java] 	at sun.reflect.DelegatingMethodAccessorImpl.invoke(DelegatingMethodAccessorImpl.java:25)
     [java] 	at java.lang.reflect.Method.invoke(Method.java:585)
     [java] 	at org.apache.maven.surefire.junit.JUnitTestSet.execute(JUnitTestSet.java:213)
     [java] 	at org.apache.maven.surefire.suite.AbstractDirectoryTestSuite.executeTestSet(AbstractDirectoryTestSuite.java:140)
     [java] 	at org.apache.maven.surefire.suite.AbstractDirectoryTestSuite.execute(AbstractDirectoryTestSuite.java:127)
     [java] 	at org.apache.maven.surefire.Surefire.run(Surefire.java:177)
     [java] 	at sun.reflect.NativeMethodAccessorImpl.invoke0(Native Method)
     [java] 	at sun.reflect.NativeMethodAccessorImpl.invoke(NativeMethodAccessorImpl.java:39)
     [java] 	at sun.reflect.DelegatingMethodAccessorImpl.invoke(DelegatingMethodAccessorImpl.java:25)
     [java] 	at java.lang.reflect.Method.invoke(Method.java:585)
     [java] 	at org.apache.maven.surefire.booter.SurefireBooter.runSuitesInProcess(SurefireBooter.java:338)
     [java] 	at org.apache.maven.surefire.booter.SurefireBooter.main(SurefireBooter.java:997)
     [java] Caused by: org.apache.maven.plugin.CompilationFailureException: Compilation failure
     [java] 	at org.apache.maven.plugin.AbstractCompilerMojo.execute(AbstractCompilerMojo.java:516)
     [java] 	at org.apache.maven.plugin.TestCompilerMojo.execute(TestCompilerMojo.java:102)
     [java] 	at org.apache.maven.plugin.DefaultPluginManager.executeMojo(DefaultPluginManager.java:628)
     [java] 	at org.apache.maven.lifecycle.DefaultLifecycleExecutor.executeGoalAndHandleFailures(DefaultLifecycleExecutor.java:491)
     [java] 	at org.apache.maven.lifecycle.DefaultLifecycleExecutor.executeTaskSegmentForProject(DefaultLifecycleExecutor.java:258)
     [java] 	... 31 more
     [java] Tests run: 17, Failures: 3, Errors: 0, Skipped: 0, Time elapsed: 7.987 sec <<<
FAILURE!
     [java] Running org.apache.maven.cli.CLIRequestUtilsTest
     [java] key=value
     [java] []
     [java] Tests run: 2, Failures: 0, Errors: 0, Skipped: 0, Time elapsed: 0.192 sec
     [java] 
     [java] Results :
     [java] 
     [java] Failed tests: 
     [java]   testExecutionUsingABaseDirectory(org.apache.maven.embedder.MavenEmbedderTest)
     [java]   testExecutionUsingAPomFile(org.apache.maven.embedder.MavenEmbedderTest)
     [java]   testTwoExecutionsDoNotCacheChangedData(org.apache.maven.embedder.MavenEmbedderTest)
     [java]   testExecutionUsingABaseDirectory(org.apache.maven.embedder.MavenEmbedderProjectWithExtensionReadingTest)
     [java]   testExecutionUsingAPomFile(org.apache.maven.embedder.MavenEmbedderProjectWithExtensionReadingTest)
     [java]   testTwoExecutionsDoNotCacheChangedData(org.apache.maven.embedder.MavenEmbedderProjectWithExtensionReadingTest)
     [java] 
     [java] Tests run: 58, Failures: 6, Errors: 0, Skipped: 0
     [java] 
     [java] [INFO] 
     [java] [INFO] 
     [java] [INFO] ------------------------------------------------------------------------
     [java] [INFO] Reactor Summary:
     [java] [INFO] ------------------------------------------------------------------------
     [java] [INFO] Apache Maven .......................................... SUCCESS [3.998s]
     [java] [INFO] Maven Lifecycle Model ................................. SUCCESS [10.545s]
     [java] [INFO] Maven Reporting API ................................... SUCCESS [2.781s]
     [java] [INFO] Maven Model ........................................... SUCCESS [6.789s]
     [java] [INFO] Maven Compat .......................................... SUCCESS [17.088s]
     [java] [INFO] Maven Plugin API ...................................... SUCCESS [5.273s]
     [java] [INFO] Maven Project Builder ................................. SUCCESS [5.656s]
     [java] [INFO] Maven Mercury ......................................... SUCCESS [5.988s]
     [java] [INFO] Maven Project ......................................... SUCCESS [23.399s]
     [java] [INFO] Maven Core ............................................ SUCCESS [26.886s]
     [java] [INFO] Maven Toolchains ...................................... SUCCESS [5.311s]
     [java] [INFO] Maven Embedder ........................................ FAILED [40.443s]
     [java] [INFO] Maven Distribution .................................... NOT BUILT
     [java] [INFO] ------------------------------------------------------------------------
     [java] [ERROR] 
     [java] There are test failures.
     [java] 
     [java] Please refer to /zonestorage/hudson/home/hudson/hudson/jobs/Maven-3.0.x-with-bootstrap/workspace/trunk/maven-embedder/target/surefire-reports
for the individual test results.null
     [java] Error stacktrace:
     [java] org.apache.maven.ProjectBuildFailureException: Build for project: org.apache.maven:maven-embedder:jar:3.0-SNAPSHOT
failed during execution of mojo: org.apache.maven.plugins:maven-surefire-plugin:2.4.2:test
     [java] 	at org.apache.maven.lifecycle.DefaultLifecycleExecutor.executeTaskSegmentForProject(DefaultLifecycleExecutor.java:286)
     [java] 	at org.apache.maven.lifecycle.DefaultLifecycleExecutor.executeTaskSegments(DefaultLifecycleExecutor.java:200)
     [java] 	at org.apache.maven.lifecycle.DefaultLifecycleExecutor.execute(DefaultLifecycleExecutor.java:163)
     [java] 	at org.apache.maven.DefaultMaven.execute(DefaultMaven.java:207)
     [java] 	at org.apache.maven.embedder.MavenEmbedder.execute(MavenEmbedder.java:851)
     [java] 	at org.apache.maven.cli.MavenCli.doMain(MavenCli.java:167)
     [java] 	at org.apache.maven.cli.MavenCli.main(MavenCli.java:62)
     [java] 	at org.apache.maven.cli.MavenCli.main(MavenCli.java:51)
     [java] Caused by: org.apache.maven.plugin.MojoFailureException: There are test failures.
     [java] 
     [java] Please refer to /zonestorage/hudson/home/hudson/hudson/jobs/Maven-3.0.x-with-bootstrap/workspace/trunk/maven-embedder/target/surefire-reports
for the individual test results.
     [java] 	at org.apache.maven.plugin.surefire.SurefirePlugin.execute(SurefirePlugin.java:530)
     [java] 	at org.apache.maven.plugin.DefaultPluginManager.executeMojo(DefaultPluginManager.java:628)
     [java] 	at org.apache.maven.lifecycle.DefaultLifecycleExecutor.executeGoalAndHandleFailures(DefaultLifecycleExecutor.java:491)
     [java] 	at org.apache.maven.lifecycle.DefaultLifecycleExecutor.executeTaskSegmentForProject(DefaultLifecycleExecutor.java:258)
     [java] 	... 7 more
     [java] 
     [java] [INFO] ------------------------------------------------------------------------
     [java] [INFO] BUILD FAILED
     [java] [INFO] ------------------------------------------------------------------------
     [java] [INFO] Total time: 2 minutes 55 seconds
     [java] [INFO] Finished at: Sun Feb 22 20:21:48 UTC 2009
     [java] [INFO] Final Memory: 41M/195M
     [java] [INFO] ------------------------------------------------------------------------

BUILD FAILED
/zonestorage/hudson/home/hudson/hudson/jobs/Maven-3.0.x-with-bootstrap/workspace/trunk/build.xml:203:
Java returned: 1

Total time: 4 minutes 28 seconds


Mime
View raw message