maven-notifications mailing list archives

Site index · List index
Message view « Date » · « Thread »
Top « Date » · « Thread »
From Hudson <Hud...@sonatype.org>
Subject Build failed in Hudson: maven-shared » 1.5,ubuntu #58
Date Sun, 15 Feb 2009 12:14:05 GMT
See http://grid.sonatype.org/ci/job/maven-shared/./jdk=1.5,label=ubuntu/58/changes

Changes:

[Benjamin Bentmann] o Printed path to local repo

------------------------------------------
[...truncated 300 lines...]
45K downloaded
Downloading: http://repository.sonatype.org:8081/content/groups/public/org/apache/maven/doxia/doxia-module-fml/1.0-alpha-11/doxia-module-fml-1.0-alpha-11.jar
17K downloaded
Downloading: http://repository.sonatype.org:8081/content/groups/public/org/apache/maven/doxia/doxia-module-xdoc/1.0-alpha-11/doxia-module-xdoc-1.0-alpha-11.jar
26K downloaded
Downloading: http://repository.sonatype.org:8081/content/groups/public/org/apache/maven/shared/maven-doxia-tools/1.0.1/maven-doxia-tools-1.0.1.jar
37K downloaded
Downloading: http://repository.sonatype.org:8081/content/groups/public/commons-io/commons-io/1.4/commons-io-1.4.jar
106K downloaded
Downloading: http://repository.sonatype.org:8081/content/groups/public/org/mortbay/jetty/jetty/6.1.5/jetty-6.1.5.jar
474K downloaded
Downloading: http://repository.sonatype.org:8081/content/groups/public/org/mortbay/jetty/jetty-util/6.1.5/jetty-util-6.1.5.jar
134K downloaded
Downloading: http://repository.sonatype.org:8081/content/groups/public/org/mortbay/jetty/servlet-api-2.5/6.1.5/servlet-api-2.5-6.1.5.jar
129K downloaded
[INFO] [site:attach-descriptor]
[INFO] Unable to load parent project from a relative path: Could not find the model file '/home/hudson/workspace/maven-shared/jdk/1.5/label/ubuntu/pom/maven/pom.xml'.
for project unknown
[INFO] Parent project loaded from repository.
Downloading: http://repository.sonatype.org:8081/content/groups/public/org/codehaus/plexus/plexus-digest/1.0/plexus-digest-1.0.pom
Downloading: http://repository.sonatype.org:8081/content/groups/public/org/codehaus/plexus/plexus-utils/1.1/plexus-utils-1.1.jar
164K downloaded
Downloading: http://repository.sonatype.org:8081/content/groups/public/org/codehaus/plexus/plexus-digest/1.0/plexus-digest-1.0.jar
11K downloaded
[INFO] [install:install]
[INFO] Installing /home/hudson/workspace/maven-shared/jdk/1.5/label/ubuntu/trunk/pom.xml to
/opt/repos/maven-shared/org/apache/maven/shared/maven-shared-components/11-SNAPSHOT/maven-shared-components-11-SNAPSHOT.pom
Downloading: http://repository.sonatype.org:8081/content/groups/public/org/apache/maven/maven-core/2.0.6/maven-core-2.0.6.pom
Downloading: http://repository.sonatype.org:8081/content/groups/public/org/apache/maven/maven-plugin-parameter-documenter/2.0.6/maven-plugin-parameter-documenter-2.0.6.pom
1K downloaded
Downloading: http://repository.sonatype.org:8081/content/groups/public/org/apache/maven/reporting/maven-reporting-api/2.0.6/maven-reporting-api-2.0.6.pom
Downloading: http://repository.sonatype.org:8081/content/groups/public/org/apache/maven/reporting/maven-reporting/2.0.6/maven-reporting-2.0.6.pom
Downloading: http://repository.sonatype.org:8081/content/groups/public/org/apache/maven/maven-error-diagnostics/2.0.6/maven-error-diagnostics-2.0.6.pom
Downloading: http://repository.sonatype.org:8081/content/groups/public/org/apache/maven/maven-plugin-descriptor/2.0.6/maven-plugin-descriptor-2.0.6.pom
Downloading: http://repository.sonatype.org:8081/content/groups/public/org/apache/maven/maven-monitor/2.0.6/maven-monitor-2.0.6.pom
[INFO] [deploy:deploy]
[INFO] Retrieving previous build number from apache.snapshots.https
Uploading: http://repository.sonatype.org:8081/content/repositories/maven.snapshots/org/apache/maven/shared/maven-shared-components/11-SNAPSHOT/maven-shared-components-11-20090215.121405-409.pom
[INFO] ------------------------------------------------------------------------
[INFO] SKIPPING Maven Shared I/O API
[INFO]    task-segment: [clean, deploy]
[INFO] This project has been banned from further executions due to previous failures.
[INFO] ------------------------------------------------------------------------
[INFO] ------------------------------------------------------------------------
[INFO] SKIPPING Maven File Management API
[INFO]    task-segment: [clean, deploy]
[INFO] This project has been banned from further executions due to previous failures.
[INFO] ------------------------------------------------------------------------
[INFO] ------------------------------------------------------------------------
[INFO] SKIPPING Maven Ant
[INFO]    task-segment: [clean, deploy]
[INFO] This project has been banned from further executions due to previous failures.
[INFO] ------------------------------------------------------------------------
[INFO] ------------------------------------------------------------------------
[INFO] SKIPPING Maven Applications Shared Configuration
[INFO]    task-segment: [clean, deploy]
[INFO] This project has been banned from further executions due to previous failures.
[INFO] ------------------------------------------------------------------------
[INFO] ------------------------------------------------------------------------
[INFO] SKIPPING Maven Shared Application Configuration Model
[INFO]    task-segment: [clean, deploy]
[INFO] This project has been banned from further executions due to previous failures.
[INFO] ------------------------------------------------------------------------
[INFO] ------------------------------------------------------------------------
[INFO] SKIPPING Maven Shared Application Configuration Web Components
[INFO]    task-segment: [clean, deploy]
[INFO] This project has been banned from further executions due to previous failures.
[INFO] ------------------------------------------------------------------------
[INFO] ------------------------------------------------------------------------
[INFO] SKIPPING Maven Archiver
[INFO]    task-segment: [clean, deploy]
[INFO] This project has been banned from further executions due to previous failures.
[INFO] ------------------------------------------------------------------------
[INFO] ------------------------------------------------------------------------
[INFO] SKIPPING Maven Common Artifact Filters
[INFO]    task-segment: [clean, deploy]
[INFO] This project has been banned from further executions due to previous failures.
[INFO] ------------------------------------------------------------------------
[INFO] ------------------------------------------------------------------------
[INFO] SKIPPING Maven Dependency Analyzer
[INFO]    task-segment: [clean, deploy]
[INFO] This project has been banned from further executions due to previous failures.
[INFO] ------------------------------------------------------------------------
[INFO] ------------------------------------------------------------------------
[INFO] SKIPPING Maven Dependency Tree
[INFO]    task-segment: [clean, deploy]
[INFO] This project has been banned from further executions due to previous failures.
[INFO] ------------------------------------------------------------------------
[INFO] ------------------------------------------------------------------------
[INFO] SKIPPING Maven Downloader
[INFO]    task-segment: [clean, deploy]
[INFO] This project has been banned from further executions due to previous failures.
[INFO] ------------------------------------------------------------------------
[INFO] ------------------------------------------------------------------------
[INFO] SKIPPING Maven Doxia Integration Tools
[INFO]    task-segment: [clean, deploy]
[INFO] This project has been banned from further executions due to previous failures.
[INFO] ------------------------------------------------------------------------
[INFO] ------------------------------------------------------------------------
[INFO] SKIPPING Maven Filtering
[INFO]    task-segment: [clean, deploy]
[INFO] This project has been banned from further executions due to previous failures.
[INFO] ------------------------------------------------------------------------
[INFO] ------------------------------------------------------------------------
[INFO] SKIPPING Maven Invoker
[INFO]    task-segment: [clean, deploy]
[INFO] This project has been banned from further executions due to previous failures.
[INFO] ------------------------------------------------------------------------
[INFO] ------------------------------------------------------------------------
[INFO] SKIPPING Maven Model Converter
[INFO]    task-segment: [clean, deploy]
[INFO] This project has been banned from further executions due to previous failures.
[INFO] ------------------------------------------------------------------------
[INFO] ------------------------------------------------------------------------
[INFO] SKIPPING Maven OSGi integration
[INFO]    task-segment: [clean, deploy]
[INFO] This project has been banned from further executions due to previous failures.
[INFO] ------------------------------------------------------------------------
[INFO] ------------------------------------------------------------------------
[INFO] SKIPPING Maven Reporting Implementation
[INFO]    task-segment: [clean, deploy]
[INFO] This project has been banned from further executions due to previous failures.
[INFO] ------------------------------------------------------------------------
[INFO] ------------------------------------------------------------------------
[INFO] SKIPPING Maven Repository Builder
[INFO]    task-segment: [clean, deploy]
[INFO] This project has been banned from further executions due to previous failures.
[INFO] ------------------------------------------------------------------------
[INFO] ------------------------------------------------------------------------
[INFO] SKIPPING Maven Runtime
[INFO]    task-segment: [clean, deploy]
[INFO] This project has been banned from further executions due to previous failures.
[INFO] ------------------------------------------------------------------------
[INFO] ------------------------------------------------------------------------
[INFO] SKIPPING Maven Script Support Root
[INFO]    task-segment: [clean, deploy]
[INFO] This project has been banned from further executions due to previous failures.
[INFO] ------------------------------------------------------------------------
[INFO] ------------------------------------------------------------------------
[INFO] SKIPPING Maven Ant Mojo Support
[INFO]    task-segment: [clean, deploy]
[INFO] This project has been banned from further executions due to previous failures.
[INFO] ------------------------------------------------------------------------
[INFO] ------------------------------------------------------------------------
[INFO] SKIPPING Maven Beanshell Mojo Support
[INFO]    task-segment: [clean, deploy]
[INFO] This project has been banned from further executions due to previous failures.
[INFO] ------------------------------------------------------------------------
[INFO] ------------------------------------------------------------------------
[INFO] SKIPPING Maven JAR Utilities
[INFO]    task-segment: [clean, deploy]
[INFO] This project has been banned from further executions due to previous failures.
[INFO] ------------------------------------------------------------------------
[INFO] ------------------------------------------------------------------------
[INFO] SKIPPING Maven Shared Monitor API
[INFO]    task-segment: [clean, deploy]
[INFO] This project has been banned from further executions due to previous failures.
[INFO] ------------------------------------------------------------------------
[INFO] ------------------------------------------------------------------------
[INFO] SKIPPING Maven Verifier Component
[INFO]    task-segment: [clean, deploy]
[INFO] This project has been banned from further executions due to previous failures.
[INFO] ------------------------------------------------------------------------
[INFO] ------------------------------------------------------------------------
[INFO] SKIPPING Maven Shared Web UI tests
[INFO]    task-segment: [clean, deploy]
[INFO] This project has been banned from further executions due to previous failures.
[INFO] ------------------------------------------------------------------------
[INFO] 
[INFO] 
[INFO] ------------------------------------------------------------------------
[INFO] Reactor Summary:
[INFO] ------------------------------------------------------------------------
[INFO] Maven Shared Components ............................... FAILED [7.201s]
[INFO] Maven Shared I/O API .................................. SKIPPED (dependency build failed
or was skipped)
[INFO] Maven File Management API ............................. SKIPPED (dependency build failed
or was skipped)
[INFO] Maven Ant ............................................. SKIPPED (dependency build failed
or was skipped)
[INFO] Maven Applications Shared Configuration ............... SKIPPED (dependency build failed
or was skipped)
[INFO] Maven Shared Application Configuration Model .......... SKIPPED (dependency build failed
or was skipped)
[INFO] Maven Shared Application Configuration Web Components . SKIPPED (dependency build failed
or was skipped)
[INFO] Maven Archiver ........................................ SKIPPED (dependency build failed
or was skipped)
[INFO] Maven Common Artifact Filters ......................... SKIPPED (dependency build failed
or was skipped)
[INFO] Maven Dependency Analyzer ............................. SKIPPED (dependency build failed
or was skipped)
[INFO] Maven Dependency Tree ................................. SKIPPED (dependency build failed
or was skipped)
[INFO] Maven Downloader ...................................... SKIPPED (dependency build failed
or was skipped)
[INFO] Maven Doxia Integration Tools ......................... SKIPPED (dependency build failed
or was skipped)
[INFO] Maven Filtering ....................................... SKIPPED (dependency build failed
or was skipped)
[INFO] Maven Invoker ......................................... SKIPPED (dependency build failed
or was skipped)
[INFO] Maven Model Converter ................................. SKIPPED (dependency build failed
or was skipped)
[INFO] Maven OSGi integration ................................ SKIPPED (dependency build failed
or was skipped)
[INFO] Maven Reporting Implementation ........................ SKIPPED (dependency build failed
or was skipped)
[INFO] Maven Repository Builder .............................. SKIPPED (dependency build failed
or was skipped)
[INFO] Maven Runtime ......................................... SKIPPED (dependency build failed
or was skipped)
[INFO] Maven Script Support Root ............................. SKIPPED (dependency build failed
or was skipped)
[INFO] Maven Ant Mojo Support ................................ SKIPPED (dependency build failed
or was skipped)
[INFO] Maven Beanshell Mojo Support .......................... SKIPPED (dependency build failed
or was skipped)
[INFO] Maven JAR Utilities ................................... SKIPPED (dependency build failed
or was skipped)
[INFO] Maven Shared Monitor API .............................. SKIPPED (dependency build failed
or was skipped)
[INFO] Maven Verifier Component .............................. SKIPPED (dependency build failed
or was skipped)
[INFO] Maven Shared Web UI tests ............................. SKIPPED (dependency build failed
or was skipped)
[INFO] ------------------------------------------------------------------------
[INFO] Error for project: Maven Shared Components (during deploy)
[INFO] ------------------------------------------------------------------------
[INFO] Error deploying artifact: Failed to transfer file: http://repository.sonatype.org:8081/content/repositories/maven.snapshots/org/apache/maven/shared/maven-shared-components/11-SNAPSHOT/maven-shared-components-11-20090215.121405-409.pom.
Return code is: 401

[INFO] ------------------------------------------------------------------------
[INFO] Trace
org.apache.maven.lifecycle.LifecycleExecutionException: Error deploying artifact: Failed to
transfer file: http://repository.sonatype.org:8081/content/repositories/maven.snapshots/org/apache/maven/shared/maven-shared-components/11-SNAPSHOT/maven-shared-components-11-20090215.121405-409.pom.
Return code is: 401
	at org.apache.maven.lifecycle.DefaultLifecycleExecutor.executeGoals(DefaultLifecycleExecutor.java:701)
	at org.apache.maven.lifecycle.DefaultLifecycleExecutor.executeGoalWithLifecycle(DefaultLifecycleExecutor.java:538)
	at org.apache.maven.lifecycle.DefaultLifecycleExecutor.executeGoal(DefaultLifecycleExecutor.java:517)
	at org.apache.maven.lifecycle.DefaultLifecycleExecutor.executeGoalAndHandleFailures(DefaultLifecycleExecutor.java:369)
	at org.apache.maven.lifecycle.DefaultLifecycleExecutor.executeTaskSegments(DefaultLifecycleExecutor.java:330)
	at org.apache.maven.lifecycle.DefaultLifecycleExecutor.execute(DefaultLifecycleExecutor.java:181)
	at org.apache.maven.DefaultMaven.doExecute(DefaultMaven.java:336)
	at org.apache.maven.DefaultMaven.execute(DefaultMaven.java:129)
	at org.apache.maven.cli.MavenCli.main(MavenCli.java:302)
	at sun.reflect.NativeMethodAccessorImpl.invoke0(Native Method)
	at sun.reflect.NativeMethodAccessorImpl.invoke(NativeMethodAccessorImpl.java:39)
	at sun.reflect.DelegatingMethodAccessorImpl.invoke(DelegatingMethodAccessorImpl.java:25)
	at java.lang.reflect.Method.invoke(Method.java:585)
	at org.codehaus.classworlds.Launcher.launchEnhanced(Launcher.java:315)
	at org.codehaus.classworlds.Launcher.launch(Launcher.java:255)
	at org.codehaus.classworlds.Launcher.mainWithExitCode(Launcher.java:430)
	at org.codehaus.classworlds.Launcher.main(Launcher.java:375)
Caused by: org.apache.maven.plugin.MojoExecutionException: Error deploying artifact: Failed
to transfer file: http://repository.sonatype.org:8081/content/repositories/maven.snapshots/org/apache/maven/shared/maven-shared-components/11-SNAPSHOT/maven-shared-components-11-20090215.121405-409.pom.
Return code is: 401
	at org.apache.maven.plugin.deploy.DeployMojo.execute(DeployMojo.java:195)
	at org.apache.maven.plugin.DefaultPluginManager.executeMojo(DefaultPluginManager.java:458)
	at org.apache.maven.lifecycle.DefaultLifecycleExecutor.executeGoals(DefaultLifecycleExecutor.java:676)
	... 16 more
Caused by: org.apache.maven.artifact.deployer.ArtifactDeploymentException: Error deploying
artifact: Failed to transfer file: http://repository.sonatype.org:8081/content/repositories/maven.snapshots/org/apache/maven/shared/maven-shared-components/11-SNAPSHOT/maven-shared-components-11-20090215.121405-409.pom.
Return code is: 401
	at org.apache.maven.artifact.deployer.DefaultArtifactDeployer.deploy(DefaultArtifactDeployer.java:94)
	at org.apache.maven.plugin.deploy.DeployMojo.execute(DeployMojo.java:165)
	... 18 more
Caused by: org.apache.maven.wagon.TransferFailedException: Failed to transfer file: http://repository.sonatype.org:8081/content/repositories/maven.snapshots/org/apache/maven/shared/maven-shared-components/11-SNAPSHOT/maven-shared-components-11-20090215.121405-409.pom.
Return code is: 401
	at org.apache.maven.wagon.providers.http.LightweightHttpWagon.finishPutTransfer(LightweightHttpWagon.java:197)
	at org.apache.maven.wagon.AbstractWagon.putTransfer(AbstractWagon.java:412)
	at org.apache.maven.wagon.AbstractWagon.transfer(AbstractWagon.java:391)
	at org.apache.maven.wagon.AbstractWagon.putTransfer(AbstractWagon.java:364)
	at org.apache.maven.wagon.StreamWagon.put(StreamWagon.java:160)
	at org.apache.maven.artifact.manager.DefaultWagonManager.putRemoteFile(DefaultWagonManager.java:263)
	at org.apache.maven.artifact.manager.DefaultWagonManager.putArtifact(DefaultWagonManager.java:172)
	at org.apache.maven.artifact.deployer.DefaultArtifactDeployer.deploy(DefaultArtifactDeployer.java:80)
	... 19 more
[INFO] ------------------------------------------------------------------------
[INFO] BUILD ERRORS
[INFO] ------------------------------------------------------------------------
[INFO] Total time: 8 seconds
[INFO] Finished at: Sun Feb 15 06:14:05 GMT-06:00 2009
[INFO] Final Memory: 18M/72M
[INFO] ------------------------------------------------------------------------


Mime
View raw message