maven-notifications mailing list archives

Site index · List index
Message view « Date » · « Thread »
Top « Date » · « Thread »
From Hudson <Hud...@sonatype.org>
Subject Build failed in Hudson: Maven-2.0.x-with-bootstrap » 1.4,osx #95
Date Fri, 27 Feb 2009 21:08:39 GMT
See http://grid.sonatype.org/ci/job/Maven-2.0.x-with-bootstrap/./jdk=1.4,label=osx/95/changes

------------------------------------------
[...truncated 1677 lines...]
     [java] [INFO] [site:attach-descriptor]
     [java] [INFO] [install:install]
     [java] [INFO] Installing http://grid.sonatype.org/ci/job/Maven-2.0.x-with-bootstrap/./jdk=1.4,label=osx/ws/maven-2.0.x/maven-script/pom.xml
 to /opt/repos/local-repository/org/apache/maven/maven-script/2.0.11-SNAPSHOT/maven-script-2.0.11-SNAPSHOT.pom
     [java] [INFO] ------------------------------------------------------------------------
     [java] [INFO] Building Maven Ant Mojo Support
     [java] [INFO]    task-segment: [clean, install]
     [java] [INFO] ------------------------------------------------------------------------
     [java] [INFO] [clean:clean]
     [java] [INFO] Deleting directory http://grid.sonatype.org/ci/job/Maven-2.0.x-with-bootstrap/./jdk=1.4,label=osx/ws/maven-2.0.x/maven-script/maven-script-ant/target

     [java] [INFO] Deleting directory http://grid.sonatype.org/ci/job/Maven-2.0.x-with-bootstrap/./jdk=1.4,label=osx/ws/maven-2.0.x/maven-script/maven-script-ant/target/classes

     [java] [INFO] Deleting directory http://grid.sonatype.org/ci/job/Maven-2.0.x-with-bootstrap/./jdk=1.4,label=osx/ws/maven-2.0.x/maven-script/maven-script-ant/target/test-classes

     [java] [INFO] Deleting directory http://grid.sonatype.org/ci/job/Maven-2.0.x-with-bootstrap/./jdk=1.4,label=osx/ws/maven-2.0.x/maven-script/maven-script-ant/target/site

     [java] Downloading: http://repository.sonatype.org:8081/content/groups/public/org/apache/ant/ant/1.7.1/ant-1.7.1.pom
     [java] [WARNING] Unable to get resource 'org.apache.ant:ant:pom:1.7.1' from repository
central (http://Nexus): Error transferring file
     [java] Downloading: http://repository.sonatype.org:8081/content/groups/nexus-staging/org/apache/ant/ant/1.7.1/ant-1.7.1.pom
     [java] [WARNING] Unable to get resource 'org.apache.ant:ant:pom:1.7.1' from repository
nexus-staging (http://repository.sonatype.org:8081/content/groups/nexus-staging): Error transferring
file
     [java] Downloading: http://repository.sonatype.org:8081/content/groups/nexus-plugins-with-staging/org/apache/ant/ant/1.7.1/ant-1.7.1.pom
     [java] [WARNING] Unable to get resource 'org.apache.ant:ant:pom:1.7.1' from repository
nexus-plugins-staging (http://repository.sonatype.org:8081/content/groups/nexus-plugins-with-staging):
Error transferring file
     [java] Downloading: http://repository.sonatype.org:8081/content/groups/public/org/apache/ant/ant-launcher/1.7.1/ant-launcher-1.7.1.pom
     [java] [WARNING] Unable to get resource 'org.apache.ant:ant-launcher:pom:1.7.1' from
repository central (http://Nexus): Error transferring file
     [java] Downloading: http://repository.sonatype.org:8081/content/groups/nexus-staging/org/apache/ant/ant-launcher/1.7.1/ant-launcher-1.7.1.pom
     [java] [WARNING] Unable to get resource 'org.apache.ant:ant-launcher:pom:1.7.1' from
repository nexus-staging (http://repository.sonatype.org:8081/content/groups/nexus-staging):
Error transferring file
     [java] Downloading: http://repository.sonatype.org:8081/content/groups/nexus-plugins-with-staging/org/apache/ant/ant-launcher/1.7.1/ant-launcher-1.7.1.pom
     [java] [WARNING] Unable to get resource 'org.apache.ant:ant-launcher:pom:1.7.1' from
repository nexus-plugins-staging (http://repository.sonatype.org:8081/content/groups/nexus-plugins-with-staging):
Error transferring file
     [java] Downloading: http://repository.sonatype.org:8081/content/groups/public/org/codehaus/plexus/plexus-ant-factory/1.0-alpha-2/plexus-ant-factory-1.0-alpha-2.pom
     [java] [WARNING] Unable to get resource 'org.codehaus.plexus:plexus-ant-factory:pom:1.0-alpha-2'
from repository central (http://Nexus): Error transferring file
     [java] Downloading: http://repository.sonatype.org:8081/content/groups/nexus-staging/org/codehaus/plexus/plexus-ant-factory/1.0-alpha-2/plexus-ant-factory-1.0-alpha-2.pom
     [java] [WARNING] Unable to get resource 'org.codehaus.plexus:plexus-ant-factory:pom:1.0-alpha-2'
from repository nexus-staging (http://repository.sonatype.org:8081/content/groups/nexus-staging):
Error transferring file
     [java] Downloading: http://repository.sonatype.org:8081/content/groups/nexus-plugins-with-staging/org/codehaus/plexus/plexus-ant-factory/1.0-alpha-2/plexus-ant-factory-1.0-alpha-2.pom
     [java] [WARNING] Unable to get resource 'org.codehaus.plexus:plexus-ant-factory:pom:1.0-alpha-2'
from repository nexus-plugins-staging (http://repository.sonatype.org:8081/content/groups/nexus-plugins-with-staging):
Error transferring file
     [java] Downloading: http://repository.sonatype.org:8081/content/groups/public/org/apache/ant/ant/1.7.1/ant-1.7.1.jar
     [java] [WARNING] Unable to get resource 'org.apache.ant:ant:jar:1.7.1' from repository
central (http://Nexus): Error transferring file
     [java] Downloading: http://repository.sonatype.org:8081/content/groups/nexus-staging/org/apache/ant/ant/1.7.1/ant-1.7.1.jar
     [java] [WARNING] Unable to get resource 'org.apache.ant:ant:jar:1.7.1' from repository
nexus-staging (http://repository.sonatype.org:8081/content/groups/nexus-staging): Error transferring
file
     [java] Downloading: http://repository.sonatype.org:8081/content/groups/nexus-plugins-with-staging/org/apache/ant/ant/1.7.1/ant-1.7.1.jar
     [java] [WARNING] Unable to get resource 'org.apache.ant:ant:jar:1.7.1' from repository
nexus-plugins-staging (http://repository.sonatype.org:8081/content/groups/nexus-plugins-with-staging):
Error transferring file
     [java] Downloading: http://repository.sonatype.org:8081/content/groups/public/org/apache/ant/ant-launcher/1.7.1/ant-launcher-1.7.1.jar
     [java] [WARNING] Unable to get resource 'org.apache.ant:ant-launcher:jar:1.7.1' from
repository central (http://Nexus): Error transferring file
     [java] Downloading: http://repository.sonatype.org:8081/content/groups/nexus-staging/org/apache/ant/ant-launcher/1.7.1/ant-launcher-1.7.1.jar
     [java] [WARNING] Unable to get resource 'org.apache.ant:ant-launcher:jar:1.7.1' from
repository nexus-staging (http://repository.sonatype.org:8081/content/groups/nexus-staging):
Error transferring file
     [java] Downloading: http://repository.sonatype.org:8081/content/groups/nexus-plugins-with-staging/org/apache/ant/ant-launcher/1.7.1/ant-launcher-1.7.1.jar
     [java] [WARNING] Unable to get resource 'org.apache.ant:ant-launcher:jar:1.7.1' from
repository nexus-plugins-staging (http://repository.sonatype.org:8081/content/groups/nexus-plugins-with-staging):
Error transferring file
     [java] Downloading: http://repository.sonatype.org:8081/content/groups/public/org/codehaus/plexus/plexus-ant-factory/1.0-alpha-2/plexus-ant-factory-1.0-alpha-2.jar
     [java] [WARNING] Unable to get resource 'org.codehaus.plexus:plexus-ant-factory:jar:1.0-alpha-2'
from repository central (http://Nexus): Error transferring file
     [java] Downloading: http://repository.sonatype.org:8081/content/groups/nexus-staging/org/codehaus/plexus/plexus-ant-factory/1.0-alpha-2/plexus-ant-factory-1.0-alpha-2.jar
     [java] [WARNING] Unable to get resource 'org.codehaus.plexus:plexus-ant-factory:jar:1.0-alpha-2'
from repository nexus-staging (http://repository.sonatype.org:8081/content/groups/nexus-staging):
Error transferring file
     [java] Downloading: http://repository.sonatype.org:8081/content/groups/nexus-plugins-with-staging/org/codehaus/plexus/plexus-ant-factory/1.0-alpha-2/plexus-ant-factory-1.0-alpha-2.jar
     [java] [WARNING] Unable to get resource 'org.codehaus.plexus:plexus-ant-factory:jar:1.0-alpha-2'
from repository nexus-plugins-staging (http://repository.sonatype.org:8081/content/groups/nexus-plugins-with-staging):
Error transferring file
     [java] [INFO] ------------------------------------------------------------------------
     [java] [ERROR] BUILD ERROR
     [java] [INFO] ------------------------------------------------------------------------
     [java] [INFO] Failed to resolve artifact.
     [java] 
     [java] Missing:
     [java] ----------
     [java] 1) org.apache.ant:ant:jar:1.7.1
     [java] 
     [java]   Try downloading the file manually from the project website.
     [java] 
     [java]   Then, install it using the command: 
     [java]       mvn install:install-file -DgroupId=org.apache.ant -DartifactId=ant -Dversion=1.7.1
-Dpackaging=jar -Dfile=/path/to/file
     [java] 
     [java]   Alternatively, if you host your own repository you can deploy the file there:

     [java]       mvn deploy:deploy-file -DgroupId=org.apache.ant -DartifactId=ant -Dversion=1.7.1
-Dpackaging=jar -Dfile=/path/to/file -Durl=[url] -DrepositoryId=[id]
     [java] 
     [java]   Path to dependency: 
     [java]   	1) org.apache.maven:maven-script-ant:jar:2.0.11-SNAPSHOT
     [java]   	2) org.apache.ant:ant:jar:1.7.1
     [java] 
     [java] 2) org.apache.ant:ant-launcher:jar:1.7.1
     [java] 
     [java]   Try downloading the file manually from the project website.
     [java] 
     [java]   Then, install it using the command: 
     [java]       mvn install:install-file -DgroupId=org.apache.ant -DartifactId=ant-launcher
-Dversion=1.7.1 -Dpackaging=jar -Dfile=/path/to/file
     [java] 
     [java]   Alternatively, if you host your own repository you can deploy the file there:

     [java]       mvn deploy:deploy-file -DgroupId=org.apache.ant -DartifactId=ant-launcher
-Dversion=1.7.1 -Dpackaging=jar -Dfile=/path/to/file -Durl=[url] -DrepositoryId=[id]
     [java] 
     [java]   Path to dependency: 
     [java]   	1) org.apache.maven:maven-script-ant:jar:2.0.11-SNAPSHOT
     [java]   	2) org.apache.ant:ant-launcher:jar:1.7.1
     [java] 
     [java] 3) org.codehaus.plexus:plexus-ant-factory:jar:1.0-alpha-2
     [java] 
     [java]   Try downloading the file manually from the project website.
     [java] 
     [java]   Then, install it using the command: 
     [java]       mvn install:install-file -DgroupId=org.codehaus.plexus -DartifactId=plexus-ant-factory
-Dversion=1.0-alpha-2 -Dpackaging=jar -Dfile=/path/to/file
     [java] 
     [java]   Alternatively, if you host your own repository you can deploy the file there:

     [java]       mvn deploy:deploy-file -DgroupId=org.codehaus.plexus -DartifactId=plexus-ant-factory
-Dversion=1.0-alpha-2 -Dpackaging=jar -Dfile=/path/to/file -Durl=[url] -DrepositoryId=[id]
     [java] 
     [java]   Path to dependency: 
     [java]   	1) org.apache.maven:maven-script-ant:jar:2.0.11-SNAPSHOT
     [java]   	2) org.codehaus.plexus:plexus-ant-factory:jar:1.0-alpha-2
     [java] 
     [java] ----------
     [java] 3 required artifacts are missing.
     [java] 
     [java] for artifact: 
     [java]   org.apache.maven:maven-script-ant:jar:2.0.11-SNAPSHOT
     [java] 
     [java] from the specified remote repositories:
     [java]   nexus-plugins-staging (http://repository.sonatype.org:8081/content/groups/nexus-plugins-with-staging),
     [java]   Nexus (http://repository.sonatype.org:8081/content/groups/public),
     [java]   nexus-staging (http://repository.sonatype.org:8081/content/groups/nexus-staging)
     [java] 
     [java] 
     [java] 
     [java] [INFO] ------------------------------------------------------------------------
     [java] [INFO] Trace
     [java] org.apache.maven.lifecycle.LifecycleExecutionException: Missing:
     [java] ----------
     [java] 1) org.apache.ant:ant:jar:1.7.1
     [java] 
     [java]   Try downloading the file manually from the project website.
     [java] 
     [java]   Then, install it using the command: 
     [java]       mvn install:install-file -DgroupId=org.apache.ant -DartifactId=ant -Dversion=1.7.1
-Dpackaging=jar -Dfile=/path/to/file
     [java] 
     [java]   Alternatively, if you host your own repository you can deploy the file there:

     [java]       mvn deploy:deploy-file -DgroupId=org.apache.ant -DartifactId=ant -Dversion=1.7.1
-Dpackaging=jar -Dfile=/path/to/file -Durl=[url] -DrepositoryId=[id]
     [java] 
     [java]   Path to dependency: 
     [java]   	1) org.apache.maven:maven-script-ant:jar:2.0.11-SNAPSHOT
     [java]   	2) org.apache.ant:ant:jar:1.7.1
     [java] 
     [java] 2) org.apache.ant:ant-launcher:jar:1.7.1
     [java] 
     [java]   Try downloading the file manually from the project website.
     [java] 
     [java]   Then, install it using the command: 
     [java]       mvn install:install-file -DgroupId=org.apache.ant -DartifactId=ant-launcher
-Dversion=1.7.1 -Dpackaging=jar -Dfile=/path/to/file
     [java] 
     [java]   Alternatively, if you host your own repository you can deploy the file there:

     [java]       mvn deploy:deploy-file -DgroupId=org.apache.ant -DartifactId=ant-launcher
-Dversion=1.7.1 -Dpackaging=jar -Dfile=/path/to/file -Durl=[url] -DrepositoryId=[id]
     [java] 
     [java]   Path to dependency: 
     [java]   	1) org.apache.maven:maven-script-ant:jar:2.0.11-SNAPSHOT
     [java]   	2) org.apache.ant:ant-launcher:jar:1.7.1
     [java] 
     [java] 3) org.codehaus.plexus:plexus-ant-factory:jar:1.0-alpha-2
     [java] 
     [java]   Try downloading the file manually from the project website.
     [java] 
     [java]   Then, install it using the command: 
     [java]       mvn install:install-file -DgroupId=org.codehaus.plexus -DartifactId=plexus-ant-factory
-Dversion=1.0-alpha-2 -Dpackaging=jar -Dfile=/path/to/file
     [java] 
     [java]   Alternatively, if you host your own repository you can deploy the file there:

     [java]       mvn deploy:deploy-file -DgroupId=org.codehaus.plexus -DartifactId=plexus-ant-factory
-Dversion=1.0-alpha-2 -Dpackaging=jar -Dfile=/path/to/file -Durl=[url] -DrepositoryId=[id]
     [java] 
     [java]   Path to dependency: 
     [java]   	1) org.apache.maven:maven-script-ant:jar:2.0.11-SNAPSHOT
     [java]   	2) org.codehaus.plexus:plexus-ant-factory:jar:1.0-alpha-2
     [java] 
     [java] ----------
     [java] 3 required artifacts are missing.
     [java] 
     [java] for artifact: 
     [java]   org.apache.maven:maven-script-ant:jar:2.0.11-SNAPSHOT
     [java] 
     [java] from the specified remote repositories:
     [java]   nexus-plugins-staging (http://repository.sonatype.org:8081/content/groups/nexus-plugins-with-staging),
     [java]   Nexus (http://repository.sonatype.org:8081/content/groups/public),
     [java]   nexus-staging (http://repository.sonatype.org:8081/content/groups/nexus-staging)
     [java] 
     [java] 
     [java] 	at org.apache.maven.lifecycle.DefaultLifecycleExecutor.executeGoals(Unknown Source)
     [java] 	at org.apache.maven.lifecycle.DefaultLifecycleExecutor.executeGoalWithLifecycle(Unknown
Source)
     [java] 	at org.apache.maven.lifecycle.DefaultLifecycleExecutor.executeGoal(Unknown Source)
     [java] 	at org.apache.maven.lifecycle.DefaultLifecycleExecutor.executeGoalAndHandleFailures(Unknown
Source)
     [java] 	at org.apache.maven.lifecycle.DefaultLifecycleExecutor.executeTaskSegments(Unknown
Source)
     [java] 	at org.apache.maven.lifecycle.DefaultLifecycleExecutor.execute(Unknown Source)
     [java] 	at org.apache.maven.DefaultMaven.doExecute(Unknown Source)
     [java] 	at org.apache.maven.DefaultMaven.execute(Unknown Source)
     [java] 	at org.apache.maven.cli.MavenCli.main(Unknown Source)
     [java] 	at org.apache.maven.cli.MavenCli.main(Unknown Source)
     [java] Caused by: org.apache.maven.artifact.resolver.MultipleArtifactsNotFoundException:
Missing:
     [java] ----------
     [java] 1) org.apache.ant:ant:jar:1.7.1
     [java] 
     [java]   Try downloading the file manually from the project website.
     [java] 
     [java]   Then, install it using the command: 
     [java]       mvn install:install-file -DgroupId=org.apache.ant -DartifactId=ant -Dversion=1.7.1
-Dpackaging=jar -Dfile=/path/to/file
     [java] 
     [java]   Alternatively, if you host your own repository you can deploy the file there:

     [java]       mvn deploy:deploy-file -DgroupId=org.apache.ant -DartifactId=ant -Dversion=1.7.1
-Dpackaging=jar -Dfile=/path/to/file -Durl=[url] -DrepositoryId=[id]
     [java] 
     [java]   Path to dependency: 
     [java]   	1) org.apache.maven:maven-script-ant:jar:2.0.11-SNAPSHOT
     [java]   	2) org.apache.ant:ant:jar:1.7.1
     [java] 
     [java] 2) org.apache.ant:ant-launcher:jar:1.7.1
     [java] 
     [java]   Try downloading the file manually from the project website.
     [java] 
     [java]   Then, install it using the command: 
     [java]       mvn install:install-file -DgroupId=org.apache.ant -DartifactId=ant-launcher
-Dversion=1.7.1 -Dpackaging=jar -Dfile=/path/to/file
     [java] 
     [java]   Alternatively, if you host your own repository you can deploy the file there:

     [java]       mvn deploy:deploy-file -DgroupId=org.apache.ant -DartifactId=ant-launcher
-Dversion=1.7.1 -Dpackaging=jar -Dfile=/path/to/file -Durl=[url] -DrepositoryId=[id]
     [java] 
     [java]   Path to dependency: 
     [java]   	1) org.apache.maven:maven-script-ant:jar:2.0.11-SNAPSHOT
     [java]   	2) org.apache.ant:ant-launcher:jar:1.7.1
     [java] 
     [java] 3) org.codehaus.plexus:plexus-ant-factory:jar:1.0-alpha-2
     [java] 
     [java]   Try downloading the file manually from the project website.
     [java] 
     [java]   Then, install it using the command: 
     [java]       mvn install:install-file -DgroupId=org.codehaus.plexus -DartifactId=plexus-ant-factory
-Dversion=1.0-alpha-2 -Dpackaging=jar -Dfile=/path/to/file
     [java] 
     [java]   Alternatively, if you host your own repository you can deploy the file there:

     [java]       mvn deploy:deploy-file -DgroupId=org.codehaus.plexus -DartifactId=plexus-ant-factory
-Dversion=1.0-alpha-2 -Dpackaging=jar -Dfile=/path/to/file -Durl=[url] -DrepositoryId=[id]
     [java] 
     [java]   Path to dependency: 
     [java]   	1) org.apache.maven:maven-script-ant:jar:2.0.11-SNAPSHOT
     [java]   	2) org.codehaus.plexus:plexus-ant-factory:jar:1.0-alpha-2
     [java] 
     [java] ----------
     [java] 3 required artifacts are missing.
     [java] 
     [java] for artifact: 
     [java]   org.apache.maven:maven-script-ant:jar:2.0.11-SNAPSHOT
     [java] 
     [java] from the specified remote repositories:
     [java]   nexus-plugins-staging (http://repository.sonatype.org:8081/content/groups/nexus-plugins-with-staging),
     [java]   Nexus (http://repository.sonatype.org:8081/content/groups/public),
     [java]   nexus-staging (http://repository.sonatype.org:8081/content/groups/nexus-staging)
     [java] 
     [java] 
     [java] 	at org.apache.maven.artifact.resolver.DefaultArtifactResolver.resolveTransitively(Unknown
Source)
     [java] 	at org.apache.maven.artifact.resolver.DefaultArtifactResolver.resolveTransitively(Unknown
Source)
     [java] 	at org.apache.maven.plugin.DefaultPluginManager.resolveTransitiveDependencies(Unknown
Source)
     [java] 	at org.apache.maven.plugin.DefaultPluginManager.executeMojo(Unknown Source)
     [java] 	... 10 more
     [java] [INFO] ------------------------------------------------------------------------
     [java] [INFO] Total time: 1 minute 51 seconds
     [java] [INFO] Finished at: Fri Feb 27 15:08:37 CST 2009
     [java] [INFO] Final Memory: 23M/48M
     [java] [INFO] ------------------------------------------------------------------------

BUILD FAILED
http://grid.sonatype.org/ci/job/Maven-2.0.x-with-bootstrap/./jdk=1.4,label=osx/ws/maven-2.0.x/build.xml
:168: Java returned: 1

Total time: 3 minutes 21 seconds


Mime
View raw message