maven-notifications mailing list archives

Site index · List index
Message view « Date » · « Thread »
Top « Date » · « Thread »
From Hudson <Hud...@sonatype.org>
Subject Build failed in Hudson: maven-shared » 1.5,windows #54
Date Sat, 14 Feb 2009 18:48:59 GMT
See http://grid.sonatype.org/ci/job/maven-shared/./jdk=1.5,label=windows/54/changes

Changes:

[Jason van Zyl] o new version of plexus-build-api

------------------------------------------
[...truncated 2603 lines...]
	at sun.reflect.NativeMethodAccessorImpl.invoke(NativeMethodAccessorImpl.java:39)
	at sun.reflect.DelegatingMethodAccessorImpl.invoke(DelegatingMethodAccessorImpl.java:25)
	at java.lang.reflect.Method.invoke(Method.java:585)
	at org.apache.maven.surefire.booter.SurefireBooter.runSuitesInProcess(SurefireBooter.java:345)
	at org.apache.maven.surefire.booter.SurefireBooter.main(SurefireBooter.java:1009)
Tests run: 11, Failures: 0, Errors: 0, Skipped: 0, Time elapsed: 1.469 sec
Running org.apache.maven.shared.jar.classes.ImportVisitorTest
Tests run: 2, Failures: 0, Errors: 0, Skipped: 0, Time elapsed: 0.078 sec
Running org.apache.maven.shared.jar.JarAnalyzerTest
Tests run: 5, Failures: 0, Errors: 0, Skipped: 0, Time elapsed: 0.109 sec
Running org.apache.maven.shared.jar.identification.JarIdentificationAnalyzerTest
Tests run: 3, Failures: 0, Errors: 0, Skipped: 0, Time elapsed: 1.016 sec
Running org.apache.maven.shared.jar.identification.exposers.EmbeddedMavenModelExposerTest
Tests run: 2, Failures: 0, Errors: 0, Skipped: 0, Time elapsed: 0.109 sec

Results :

Tests run: 23, Failures: 0, Errors: 0, Skipped: 0

[INFO] [jar:jar]
[INFO] Building jar: C:\home\hudson\workspace\maven-shared\jdk\1.5\label\windows\trunk\maven-shared-jar\target\maven-shared-jar-1.1-SNAPSHOT.jar
[INFO] [install:install]
[INFO] Installing C:\home\hudson\workspace\maven-shared\jdk\1.5\label\windows\trunk\maven-shared-jar\target\maven-shared-jar-1.1-SNAPSHOT.jar
to \opt\repos\maven-shared\org\apache\maven\shared\maven-shared-jar\1.1-SNAPSHOT\maven-shared-jar-1.1-SNAPSHOT.jar
[INFO] [deploy:deploy]
altDeploymentRepository = null
[INFO] Retrieving previous build number from apache.snapshots
[INFO] repository metadata for: 'snapshot org.apache.maven.shared:maven-shared-jar:1.1-SNAPSHOT'
could not be found on repository: apache.snapshots, so will be created
Uploading: file:/opt/repos/deploy-junk/org/apache/maven/shared/maven-shared-jar/1.1-SNAPSHOT/maven-shared-jar-1.1-20090214.184347-1.jar
36K uploaded
[INFO] Retrieving previous metadata from apache.snapshots
[INFO] repository metadata for: 'snapshot org.apache.maven.shared:maven-shared-jar:1.1-SNAPSHOT'
could not be found on repository: apache.snapshots, so will be created
[INFO] Uploading repository metadata for: 'snapshot org.apache.maven.shared:maven-shared-jar:1.1-SNAPSHOT'
[INFO] Retrieving previous metadata from apache.snapshots
[INFO] repository metadata for: 'artifact org.apache.maven.shared:maven-shared-jar' could
not be found on repository: apache.snapshots, so will be created
[INFO] Uploading repository metadata for: 'artifact org.apache.maven.shared:maven-shared-jar'
[INFO] Uploading project information for maven-shared-jar 1.1-20090214.184347-1
[INFO] ------------------------------------------------------------------------
[INFO] Building Maven Shared Monitor API
[INFO]    task-segment: [clean, deploy]
[INFO] ------------------------------------------------------------------------
[INFO] [clean:clean]
[INFO] Deleting directory C:\home\hudson\workspace\maven-shared\jdk\1.5\label\windows\trunk\maven-shared-monitor\target
[INFO] [remote-resources:process {execution: default}]
[INFO] [resources:resources]
[INFO] Using encoding: 'UTF-8' to copy filtered resources.
[INFO] [compiler:compile]
[INFO] Compiling 5 source files to C:\home\hudson\workspace\maven-shared\jdk\1.5\label\windows\trunk\maven-shared-monitor\target\classes
[INFO] [resources:testResources]
[INFO] Using encoding: 'UTF-8' to copy filtered resources.
[INFO] [compiler:testCompile]
[INFO] No sources to compile
[INFO] [surefire:test]
[INFO] Surefire report directory: C:\home\hudson\workspace\maven-shared\jdk\1.5\label\windows\trunk\maven-shared-monitor\target\surefire-reports

-------------------------------------------------------
 T E S T S
-------------------------------------------------------
There are no tests to run.

Results :

Tests run: 0, Failures: 0, Errors: 0, Skipped: 0

[INFO] [jar:jar]
[INFO] Building jar: C:\home\hudson\workspace\maven-shared\jdk\1.5\label\windows\trunk\maven-shared-monitor\target\maven-shared-monitor-1.0-SNAPSHOT.jar
[INFO] [install:install]
[INFO] Installing C:\home\hudson\workspace\maven-shared\jdk\1.5\label\windows\trunk\maven-shared-monitor\target\maven-shared-monitor-1.0-SNAPSHOT.jar
to \opt\repos\maven-shared\org\apache\maven\shared\maven-shared-monitor\1.0-SNAPSHOT\maven-shared-monitor-1.0-SNAPSHOT.jar
[INFO] [deploy:deploy]
altDeploymentRepository = null
[INFO] Retrieving previous build number from apache.snapshots
[INFO] repository metadata for: 'snapshot org.apache.maven.shared:maven-shared-monitor:1.0-SNAPSHOT'
could not be found on repository: apache.snapshots, so will be created
Uploading: file:/opt/repos/deploy-junk/org/apache/maven/shared/maven-shared-monitor/1.0-SNAPSHOT/maven-shared-monitor-1.0-20090214.184347-1.jar
12K uploaded
[INFO] Retrieving previous metadata from apache.snapshots
[INFO] repository metadata for: 'artifact org.apache.maven.shared:maven-shared-monitor' could
not be found on repository: apache.snapshots, so will be created
[INFO] Uploading repository metadata for: 'artifact org.apache.maven.shared:maven-shared-monitor'
[INFO] Uploading project information for maven-shared-monitor 1.0-20090214.184347-1
[INFO] Retrieving previous metadata from apache.snapshots
[INFO] repository metadata for: 'snapshot org.apache.maven.shared:maven-shared-monitor:1.0-SNAPSHOT'
could not be found on repository: apache.snapshots, so will be created
[INFO] Uploading repository metadata for: 'snapshot org.apache.maven.shared:maven-shared-monitor:1.0-SNAPSHOT'
[INFO] ------------------------------------------------------------------------
[INFO] Building Maven Verifier Component
[INFO]    task-segment: [clean, deploy]
[INFO] ------------------------------------------------------------------------
[INFO] [clean:clean]
[INFO] Deleting directory C:\home\hudson\workspace\maven-shared\jdk\1.5\label\windows\trunk\maven-verifier\target
[INFO] [remote-resources:process {execution: default}]
[INFO] [resources:resources]
[INFO] Using encoding: 'UTF-8' to copy filtered resources.
[INFO] [compiler:compile]
[INFO] Compiling 22 source files to C:\home\hudson\workspace\maven-shared\jdk\1.5\label\windows\trunk\maven-verifier\target\classes
[INFO] [resources:testResources]
[INFO] Using encoding: 'UTF-8' to copy filtered resources.
[INFO] [compiler:testCompile]
[INFO] No sources to compile
[INFO] [surefire:test]
[INFO] Surefire report directory: C:\home\hudson\workspace\maven-shared\jdk\1.5\label\windows\trunk\maven-verifier\target\surefire-reports

-------------------------------------------------------
 T E S T S
-------------------------------------------------------
There are no tests to run.

Results :

Tests run: 0, Failures: 0, Errors: 0, Skipped: 0

[INFO] [jar:jar]
[INFO] Building jar: C:\home\hudson\workspace\maven-shared\jdk\1.5\label\windows\trunk\maven-verifier\target\maven-verifier-1.2-SNAPSHOT.jar
[INFO] [install:install]
[INFO] Installing C:\home\hudson\workspace\maven-shared\jdk\1.5\label\windows\trunk\maven-verifier\target\maven-verifier-1.2-SNAPSHOT.jar
to \opt\repos\maven-shared\org\apache\maven\shared\maven-verifier\1.2-SNAPSHOT\maven-verifier-1.2-SNAPSHOT.jar
[INFO] [deploy:deploy]
altDeploymentRepository = null
[INFO] Retrieving previous build number from apache.snapshots
[INFO] repository metadata for: 'snapshot org.apache.maven.shared:maven-verifier:1.2-SNAPSHOT'
could not be found on repository: apache.snapshots, so will be created
Uploading: file:/opt/repos/deploy-junk/org/apache/maven/shared/maven-verifier/1.2-SNAPSHOT/maven-verifier-1.2-20090214.184347-1.jar
81K uploaded
[INFO] Uploading project information for maven-verifier 1.2-20090214.184347-1
[INFO] Retrieving previous metadata from apache.snapshots
[INFO] repository metadata for: 'artifact org.apache.maven.shared:maven-verifier' could not
be found on repository: apache.snapshots, so will be created
[INFO] Uploading repository metadata for: 'artifact org.apache.maven.shared:maven-verifier'
[INFO] Retrieving previous metadata from apache.snapshots
[INFO] repository metadata for: 'snapshot org.apache.maven.shared:maven-verifier:1.2-SNAPSHOT'
could not be found on repository: apache.snapshots, so will be created
[INFO] Uploading repository metadata for: 'snapshot org.apache.maven.shared:maven-verifier:1.2-SNAPSHOT'
[INFO] ------------------------------------------------------------------------
[INFO] Building Maven Shared Web UI tests
[INFO]    task-segment: [clean, deploy]
[INFO] ------------------------------------------------------------------------
[INFO] [clean:clean]
[INFO] Deleting directory C:\home\hudson\workspace\maven-shared\jdk\1.5\label\windows\trunk\maven-web-ui-tests\target
Downloading: http://repository.sonatype.org:8081/content/groups/public/org/openqa/selenium/client-drivers/selenium-java-client-driver/0.8.1/selenium-java-client-driver-0.8.1.pom
Downloading: http://repository.sonatype.org:8081/content/groups/public/org/openqa/selenium/selenium/0.8.1/selenium-0.8.1.pom
Downloading: http://repository.sonatype.org:8081/content/groups/public/org/openqa/selenium/server/selenium-server/0.8.1/selenium-server-0.8.1.pom
Downloading: http://repository.sonatype.org:8081/content/groups/public/org/openqa/selenium/client-drivers/selenium-java-client-driver/0.8.1/selenium-java-client-driver-0.8.1.jar
13K downloaded
Downloading: http://repository.sonatype.org:8081/content/groups/public/org/openqa/selenium/server/selenium-server/0.8.1/selenium-server-0.8.1.jar
2230K downloaded
[INFO] [remote-resources:process {execution: default}]
[INFO] [resources:resources]
[INFO] Using encoding: 'UTF-8' to copy filtered resources.
[INFO] [compiler:compile]
[INFO] Compiling 2 source files to C:\home\hudson\workspace\maven-shared\jdk\1.5\label\windows\trunk\maven-web-ui-tests\target\classes
[INFO] [resources:testResources]
[INFO] Using encoding: 'UTF-8' to copy filtered resources.
[INFO] [compiler:testCompile]
[INFO] No sources to compile
[INFO] [surefire:test]
[INFO] Surefire report directory: C:\home\hudson\workspace\maven-shared\jdk\1.5\label\windows\trunk\maven-web-ui-tests\target\surefire-reports

-------------------------------------------------------
 T E S T S
-------------------------------------------------------
There are no tests to run.

Results :

Tests run: 0, Failures: 0, Errors: 0, Skipped: 0

[INFO] [jar:jar]
[INFO] Building jar: C:\home\hudson\workspace\maven-shared\jdk\1.5\label\windows\trunk\maven-web-ui-tests\target\maven-web-ui-tests-1.0-SNAPSHOT.jar
[INFO] [install:install]
[INFO] Installing C:\home\hudson\workspace\maven-shared\jdk\1.5\label\windows\trunk\maven-web-ui-tests\target\maven-web-ui-tests-1.0-SNAPSHOT.jar
to \opt\repos\maven-shared\org\apache\maven\shared\maven-web-ui-tests\1.0-SNAPSHOT\maven-web-ui-tests-1.0-SNAPSHOT.jar
[INFO] [deploy:deploy]
altDeploymentRepository = null
[INFO] Retrieving previous build number from apache.snapshots
[INFO] repository metadata for: 'snapshot org.apache.maven.shared:maven-web-ui-tests:1.0-SNAPSHOT'
could not be found on repository: apache.snapshots, so will be created
Uploading: file:/opt/repos/deploy-junk/org/apache/maven/shared/maven-web-ui-tests/1.0-SNAPSHOT/maven-web-ui-tests-1.0-20090214.184347-1.jar
15K uploaded
[INFO] Uploading project information for maven-web-ui-tests 1.0-20090214.184347-1
[INFO] Retrieving previous metadata from apache.snapshots
[INFO] repository metadata for: 'snapshot org.apache.maven.shared:maven-web-ui-tests:1.0-SNAPSHOT'
could not be found on repository: apache.snapshots, so will be created
[INFO] Uploading repository metadata for: 'snapshot org.apache.maven.shared:maven-web-ui-tests:1.0-SNAPSHOT'
[INFO] Retrieving previous metadata from apache.snapshots
[INFO] repository metadata for: 'artifact org.apache.maven.shared:maven-web-ui-tests' could
not be found on repository: apache.snapshots, so will be created
[INFO] Uploading repository metadata for: 'artifact org.apache.maven.shared:maven-web-ui-tests'
[INFO] 
[INFO] 
[INFO] ------------------------------------------------------------------------
[INFO] Reactor Summary:
[INFO] ------------------------------------------------------------------------
[INFO] Maven Shared Components ............................... SUCCESS [11.625s]
[INFO] Maven Shared I/O API .................................. SUCCESS [13.344s]
[INFO] Maven File Management API ............................. SUCCESS [10.203s]
[INFO] Maven Ant ............................................. SUCCESS [6.297s]
[INFO] Maven Applications Shared Configuration ............... SUCCESS [1.734s]
[INFO] Maven Shared Application Configuration Model .......... SUCCESS [8.266s]
[INFO] Maven Shared Application Configuration Web Components . SUCCESS [5.109s]
[INFO] Maven Archiver ........................................ SUCCESS [7.641s]
[INFO] Maven Common Artifact Filters ......................... SUCCESS [12.828s]
[INFO] Maven Dependency Analyzer ............................. FAILED [42.995s]
[INFO] Maven Dependency Tree ................................. SUCCESS [10.500s]
[INFO] Maven Downloader ...................................... SUCCESS [3.610s]
[INFO] Maven Doxia Integration Tools ......................... SUCCESS [10.531s]
[INFO] Maven Filtering ....................................... SUCCESS [9.844s]
[INFO] Maven Invoker ......................................... SUCCESS [34.906s]
[INFO] Maven Model Converter ................................. SUCCESS [11.312s]
[INFO] Maven OSGi integration ................................ SUCCESS [6.266s]
[INFO] Maven Reporting Implementation ........................ SUCCESS [31.969s]
[INFO] Maven Repository Builder .............................. SUCCESS [8.109s]
[INFO] Maven Runtime ......................................... SUCCESS [40.156s]
[INFO] Maven Script Support Root ............................. SUCCESS [0.141s]
[INFO] Maven Ant Mojo Support ................................ SUCCESS [13.984s]
[INFO] Maven Beanshell Mojo Support .......................... SUCCESS [1.891s]
[INFO] Maven JAR Utilities ................................... SUCCESS [11.719s]
[INFO] Maven Shared Monitor API .............................. SUCCESS [2.000s]
[INFO] Maven Verifier Component .............................. SUCCESS [2.875s]
[INFO] Maven Shared Web UI tests ............................. SUCCESS [2.531s]
[INFO] ------------------------------------------------------------------------
[INFO] Error for project: Maven Dependency Analyzer (during deploy)
[INFO] ------------------------------------------------------------------------
[INFO] There are test failures.

Please refer to C:\home\hudson\workspace\maven-shared\jdk\1.5\label\windows\trunk\maven-dependency-analyzer\target\surefire-reports
for the individual test results.
[INFO] ------------------------------------------------------------------------
[INFO] Trace
org.apache.maven.BuildFailureException: There are test failures.

Please refer to C:\home\hudson\workspace\maven-shared\jdk\1.5\label\windows\trunk\maven-dependency-analyzer\target\surefire-reports
for the individual test results.
	at org.apache.maven.lifecycle.DefaultLifecycleExecutor.executeGoals(DefaultLifecycleExecutor.java:697)
	at org.apache.maven.lifecycle.DefaultLifecycleExecutor.executeGoalWithLifecycle(DefaultLifecycleExecutor.java:538)
	at org.apache.maven.lifecycle.DefaultLifecycleExecutor.executeGoal(DefaultLifecycleExecutor.java:517)
	at org.apache.maven.lifecycle.DefaultLifecycleExecutor.executeGoalAndHandleFailures(DefaultLifecycleExecutor.java:369)
	at org.apache.maven.lifecycle.DefaultLifecycleExecutor.executeTaskSegments(DefaultLifecycleExecutor.java:330)
	at org.apache.maven.lifecycle.DefaultLifecycleExecutor.execute(DefaultLifecycleExecutor.java:181)
	at org.apache.maven.DefaultMaven.doExecute(DefaultMaven.java:336)
	at org.apache.maven.DefaultMaven.execute(DefaultMaven.java:129)
	at org.apache.maven.cli.MavenCli.main(MavenCli.java:302)
	at sun.reflect.NativeMethodAccessorImpl.invoke0(Native Method)
	at sun.reflect.NativeMethodAccessorImpl.invoke(NativeMethodAccessorImpl.java:39)
	at sun.reflect.DelegatingMethodAccessorImpl.invoke(DelegatingMethodAccessorImpl.java:25)
	at java.lang.reflect.Method.invoke(Method.java:585)
	at org.codehaus.classworlds.Launcher.launchEnhanced(Launcher.java:315)
	at org.codehaus.classworlds.Launcher.launch(Launcher.java:255)
	at org.codehaus.classworlds.Launcher.mainWithExitCode(Launcher.java:430)
	at org.codehaus.classworlds.Launcher.main(Launcher.java:375)
Caused by: org.apache.maven.plugin.MojoFailureException: There are test failures.

Please refer to C:\home\hudson\workspace\maven-shared\jdk\1.5\label\windows\trunk\maven-dependency-analyzer\target\surefire-reports
for the individual test results.
	at org.apache.maven.plugin.surefire.SurefirePlugin.execute(SurefirePlugin.java:575)
	at org.apache.maven.plugin.DefaultPluginManager.executeMojo(DefaultPluginManager.java:458)
	at org.apache.maven.lifecycle.DefaultLifecycleExecutor.executeGoals(DefaultLifecycleExecutor.java:676)
	... 16 more
[INFO] ------------------------------------------------------------------------
[INFO] BUILD ERRORS
[INFO] ------------------------------------------------------------------------
[INFO] Total time: 5 minutes 24 seconds
[INFO] Finished at: Sat Feb 14 10:48:58 PST 2009
[INFO] Final Memory: 47M/85M
[INFO] ------------------------------------------------------------------------


Mime
View raw message