maven-notifications mailing list archives

Site index · List index
Message view « Date » · « Thread »
Top « Date » · « Thread »
From Hudson <Hud...@sonatype.org>
Subject Build failed in Hudson: maven-core-integration-testing » 1.5,windows #225
Date Thu, 26 Feb 2009 14:08:44 GMT
See http://grid.sonatype.org/ci/job/maven-core-integration-testing/./jdk=1.5,label=windows/225/changes

Changes:

[Brett Porter] [MNG-3811] Report plugins don't inherit configuration

[Brett Porter] fix quoting

[Brett Porter] [MNG-3621] site url inheritance broken for UNC paths

[Brett Porter] [MNG-3641] Lack of error checks on profiles
Submitted by: Torben S. Giesselmann

[Brett Porter] imports

------------------------------------------
[...truncated 1840 lines...]
[INFO] [compiler:testCompile]
[INFO] No sources to compile
[INFO] [surefire:test]
[INFO] Surefire report directory: C:\home\hudson\workspace\maven-core-integration-testing\jdk\1.5\label\windows\maven-its\core-it-support\core-it-plugins\maven-it-plugin-plexus-utils-11\target\surefire-reports

-------------------------------------------------------
 T E S T S
-------------------------------------------------------
There are no tests to run.

Results :

Tests run: 0, Failures: 0, Errors: 0, Skipped: 0

[INFO] [jar:jar]
[INFO] Building jar: C:\home\hudson\workspace\maven-core-integration-testing\jdk\1.5\label\windows\maven-its\core-it-support\core-it-plugins\maven-it-plugin-plexus-utils-11\target\maven-it-plugin-plexus-utils-11-2.1-SNAPSHOT.jar
[INFO] [plugin:addPluginArtifactMetadata]
[INFO] [install:install]
[INFO] Installing C:\home\hudson\workspace\maven-core-integration-testing\jdk\1.5\label\windows\maven-its\core-it-support\core-it-plugins\maven-it-plugin-plexus-utils-11\target\maven-it-plugin-plexus-utils-11-2.1-SNAPSHOT.jar
to \opt\repos\local-repository\org\apache\maven\its\plugins\maven-it-plugin-plexus-utils-11\2.1-SNAPSHOT\maven-it-plugin-plexus-utils-11-2.1-SNAPSHOT.jar
[INFO] [plugin:updateRegistry]
[INFO] [deploy:deploy]
altDeploymentRepository = null
[INFO] Retrieving previous build number from maven.it
Uploading: file:/opt/repos/deploy-junk/org/apache/maven/its/plugins/maven-it-plugin-plexus-utils-11/2.1-SNAPSHOT/maven-it-plugin-plexus-utils-11-2.1-20090226.140544-2.jar
9K uploaded
[INFO] Uploading project information for maven-it-plugin-plexus-utils-11 2.1-20090226.140544-2
[INFO] Retrieving previous metadata from maven.it
[INFO] Uploading repository metadata for: 'snapshot org.apache.maven.its.plugins:maven-it-plugin-plexus-utils-11:2.1-SNAPSHOT'
[INFO] Retrieving previous metadata from maven.it
[INFO] Uploading repository metadata for: 'org.apache.maven.its.plugins'
[INFO] Retrieving previous metadata from maven.it
[INFO] Uploading repository metadata for: 'artifact org.apache.maven.its.plugins:maven-it-plugin-plexus-utils-11'
[INFO] ------------------------------------------------------------------------
[INFO] Building Maven Integration Test Plugin :: Plexus Utils New
[INFO]    task-segment: [clean, deploy]
[INFO] ------------------------------------------------------------------------
[INFO] [clean:clean]
[INFO] Deleting directory C:\home\hudson\workspace\maven-core-integration-testing\jdk\1.5\label\windows\maven-its\core-it-support\core-it-plugins\maven-it-plugin-plexus-utils-new\target
[INFO] [plugin:descriptor]
[INFO] Using 2 extractors.
[INFO] Applying extractor for language: java
[INFO] Extractor for language: java found 1 mojo descriptors.
[INFO] Applying extractor for language: bsh
[INFO] Extractor for language: bsh found 0 mojo descriptors.
[INFO] [remote-resources:process {execution: default}]
[INFO] [resources:resources]
[INFO] Using encoding: 'UTF-8' to copy filtered resources.
[INFO] [compiler:compile]
[INFO] Compiling 4 source files to C:\home\hudson\workspace\maven-core-integration-testing\jdk\1.5\label\windows\maven-its\core-it-support\core-it-plugins\maven-it-plugin-plexus-utils-new\target\classes
[INFO] [resources:testResources]
[INFO] Using encoding: 'UTF-8' to copy filtered resources.
[INFO] [compiler:testCompile]
[INFO] No sources to compile
[INFO] [surefire:test]
[INFO] Surefire report directory: C:\home\hudson\workspace\maven-core-integration-testing\jdk\1.5\label\windows\maven-its\core-it-support\core-it-plugins\maven-it-plugin-plexus-utils-new\target\surefire-reports

-------------------------------------------------------
 T E S T S
-------------------------------------------------------
There are no tests to run.

Results :

Tests run: 0, Failures: 0, Errors: 0, Skipped: 0

[INFO] [jar:jar]
[INFO] Building jar: C:\home\hudson\workspace\maven-core-integration-testing\jdk\1.5\label\windows\maven-its\core-it-support\core-it-plugins\maven-it-plugin-plexus-utils-new\target\maven-it-plugin-plexus-utils-new-2.1-SNAPSHOT.jar
[INFO] [plugin:addPluginArtifactMetadata]
[INFO] [install:install]
[INFO] Installing C:\home\hudson\workspace\maven-core-integration-testing\jdk\1.5\label\windows\maven-its\core-it-support\core-it-plugins\maven-it-plugin-plexus-utils-new\target\maven-it-plugin-plexus-utils-new-2.1-SNAPSHOT.jar
to \opt\repos\local-repository\org\apache\maven\its\plugins\maven-it-plugin-plexus-utils-new\2.1-SNAPSHOT\maven-it-plugin-plexus-utils-new-2.1-SNAPSHOT.jar
[INFO] [plugin:updateRegistry]
[INFO] [deploy:deploy]
altDeploymentRepository = null
[INFO] Retrieving previous build number from maven.it
Uploading: file:/opt/repos/deploy-junk/org/apache/maven/its/plugins/maven-it-plugin-plexus-utils-new/2.1-SNAPSHOT/maven-it-plugin-plexus-utils-new-2.1-20090226.140544-2.jar
12K uploaded
[INFO] Uploading project information for maven-it-plugin-plexus-utils-new 2.1-20090226.140544-2
[INFO] Retrieving previous metadata from maven.it
[INFO] Uploading repository metadata for: 'artifact org.apache.maven.its.plugins:maven-it-plugin-plexus-utils-new'
[INFO] Retrieving previous metadata from maven.it
[INFO] Uploading repository metadata for: 'snapshot org.apache.maven.its.plugins:maven-it-plugin-plexus-utils-new:2.1-SNAPSHOT'
[INFO] Retrieving previous metadata from maven.it
[INFO] Uploading repository metadata for: 'org.apache.maven.its.plugins'
[INFO] ------------------------------------------------------------------------
[INFO] Building Maven Integration Test Plugin :: Plexus Component API
[INFO]    task-segment: [clean, deploy]
[INFO] ------------------------------------------------------------------------
[INFO] [clean:clean]
[INFO] Deleting directory C:\home\hudson\workspace\maven-core-integration-testing\jdk\1.5\label\windows\maven-its\core-it-support\core-it-plugins\maven-it-plugin-plexus-component-api\target
[INFO] [plugin:descriptor]
[INFO] Using 2 extractors.
[INFO] Applying extractor for language: java
[INFO] Extractor for language: java found 1 mojo descriptors.
[INFO] Applying extractor for language: bsh
[INFO] Extractor for language: bsh found 0 mojo descriptors.
[INFO] [remote-resources:process {execution: default}]
[INFO] [resources:resources]
[INFO] Using encoding: 'UTF-8' to copy filtered resources.
[INFO] [compiler:compile]
[INFO] Compiling 1 source file to C:\home\hudson\workspace\maven-core-integration-testing\jdk\1.5\label\windows\maven-its\core-it-support\core-it-plugins\maven-it-plugin-plexus-component-api\target\classes
[INFO] [resources:testResources]
[INFO] Using encoding: 'UTF-8' to copy filtered resources.
[INFO] [compiler:testCompile]
[INFO] No sources to compile
[INFO] [surefire:test]
[INFO] Surefire report directory: C:\home\hudson\workspace\maven-core-integration-testing\jdk\1.5\label\windows\maven-its\core-it-support\core-it-plugins\maven-it-plugin-plexus-component-api\target\surefire-reports

-------------------------------------------------------
 T E S T S
-------------------------------------------------------
There are no tests to run.

Results :

Tests run: 0, Failures: 0, Errors: 0, Skipped: 0

[INFO] [jar:jar]
[INFO] Building jar: C:\home\hudson\workspace\maven-core-integration-testing\jdk\1.5\label\windows\maven-its\core-it-support\core-it-plugins\maven-it-plugin-plexus-component-api\target\maven-it-plugin-plexus-component-api-2.1-SNAPSHOT.jar
[INFO] [plugin:addPluginArtifactMetadata]
[INFO] [install:install]
[INFO] Installing C:\home\hudson\workspace\maven-core-integration-testing\jdk\1.5\label\windows\maven-its\core-it-support\core-it-plugins\maven-it-plugin-plexus-component-api\target\maven-it-plugin-plexus-component-api-2.1-SNAPSHOT.jar
to \opt\repos\local-repository\org\apache\maven\its\plugins\maven-it-plugin-plexus-component-api\2.1-SNAPSHOT\maven-it-plugin-plexus-component-api-2.1-SNAPSHOT.jar
[INFO] [plugin:updateRegistry]
[INFO] [deploy:deploy]
altDeploymentRepository = null
[INFO] Retrieving previous build number from maven.it
Uploading: file:/opt/repos/deploy-junk/org/apache/maven/its/plugins/maven-it-plugin-plexus-component-api/2.1-SNAPSHOT/maven-it-plugin-plexus-component-api-2.1-20090226.140544-2.jar
9K uploaded
[INFO] Retrieving previous metadata from maven.it
[INFO] Uploading repository metadata for: 'snapshot org.apache.maven.its.plugins:maven-it-plugin-plexus-component-api:2.1-SNAPSHOT'
[INFO] Retrieving previous metadata from maven.it
[INFO] Uploading repository metadata for: 'artifact org.apache.maven.its.plugins:maven-it-plugin-plexus-component-api'
[INFO] Retrieving previous metadata from maven.it
[INFO] Uploading repository metadata for: 'org.apache.maven.its.plugins'
[INFO] Uploading project information for maven-it-plugin-plexus-component-api 2.1-20090226.140544-2
[INFO] ------------------------------------------------------------------------
[INFO] Building Maven Integration Test Wagon
[INFO]    task-segment: [clean, deploy]
[INFO] ------------------------------------------------------------------------
[INFO] [clean:clean]
[INFO] Deleting directory C:\home\hudson\workspace\maven-core-integration-testing\jdk\1.5\label\windows\maven-its\core-it-support\core-it-wagon\target
[INFO] [plexus:descriptor {execution: default}]
[INFO] [remote-resources:process {execution: default}]
[INFO] [resources:resources]
[INFO] Using encoding: 'UTF-8' to copy filtered resources.
[INFO] [compiler:compile]
[INFO] Compiling 1 source file to C:\home\hudson\workspace\maven-core-integration-testing\jdk\1.5\label\windows\maven-its\core-it-support\core-it-wagon\target\classes
[INFO] [resources:testResources]
[INFO] Using encoding: 'UTF-8' to copy filtered resources.
[INFO] [compiler:testCompile]
[INFO] No sources to compile
[INFO] [surefire:test]
[INFO] Surefire report directory: C:\home\hudson\workspace\maven-core-integration-testing\jdk\1.5\label\windows\maven-its\core-it-support\core-it-wagon\target\surefire-reports

-------------------------------------------------------
 T E S T S
-------------------------------------------------------
There are no tests to run.

Results :

Tests run: 0, Failures: 0, Errors: 0, Skipped: 0

[INFO] [jar:jar]
[INFO] Building jar: C:\home\hudson\workspace\maven-core-integration-testing\jdk\1.5\label\windows\maven-its\core-it-support\core-it-wagon\target\core-it-wagon-2.1-SNAPSHOT.jar
[INFO] [install:install]
[INFO] Installing C:\home\hudson\workspace\maven-core-integration-testing\jdk\1.5\label\windows\maven-its\core-it-support\core-it-wagon\target\core-it-wagon-2.1-SNAPSHOT.jar
to \opt\repos\local-repository\org\apache\maven\its\core-it-wagon\2.1-SNAPSHOT\core-it-wagon-2.1-SNAPSHOT.jar
[INFO] [deploy:deploy]
altDeploymentRepository = null
[INFO] Retrieving previous build number from apache.snapshots
Uploading: file:/opt/repos/deploy-junk/org/apache/maven/its/core-it-wagon/2.1-SNAPSHOT/core-it-wagon-2.1-20090226.140544-2.jar
10K uploaded
[INFO] Retrieving previous metadata from apache.snapshots
[INFO] Uploading repository metadata for: 'snapshot org.apache.maven.its:core-it-wagon:2.1-SNAPSHOT'
[INFO] Uploading project information for core-it-wagon 2.1-20090226.140544-2
[INFO] Retrieving previous metadata from apache.snapshots
[INFO] Uploading repository metadata for: 'artifact org.apache.maven.its:core-it-wagon'
[INFO] ------------------------------------------------------------------------
[INFO] Building Maven Integration Test Support Artifacts
[INFO]    task-segment: [clean, deploy]
[INFO] ------------------------------------------------------------------------
[INFO] [clean:clean]
[INFO] Deleting directory C:\home\hudson\workspace\maven-core-integration-testing\jdk\1.5\label\windows\maven-its\core-it-support\core-it-support-artifacts\target
[INFO] [remote-resources:process {execution: default}]
[INFO] [site:attach-descriptor]
[WARNING] DEPRECATED [descriptor]: Please use descriptors instead
[INFO] [assembly:single {execution: default}]
[INFO] Building zip: C:\home\hudson\workspace\maven-core-integration-testing\jdk\1.5\label\windows\maven-its\core-it-support\core-it-support-artifacts\target\core-it-support-artifacts-2.1-SNAPSHOT-repo.zip
[INFO] [install:install]
[INFO] Installing C:\home\hudson\workspace\maven-core-integration-testing\jdk\1.5\label\windows\maven-its\core-it-support\core-it-support-artifacts\pom.xml
to \opt\repos\local-repository\org\apache\maven\its\core-it-support-artifacts\2.1-SNAPSHOT\core-it-support-artifacts-2.1-SNAPSHOT.pom
[INFO] Installing C:\home\hudson\workspace\maven-core-integration-testing\jdk\1.5\label\windows\maven-its\core-it-support\core-it-support-artifacts\target\core-it-support-artifacts-2.1-SNAPSHOT-repo.zip
to \opt\repos\local-repository\org\apache\maven\its\core-it-support-artifacts\2.1-SNAPSHOT\core-it-support-artifacts-2.1-SNAPSHOT-repo.zip
[INFO] [deploy:deploy]
altDeploymentRepository = null
[INFO] Retrieving previous build number from apache.snapshots
Uploading: file:/opt/repos/deploy-junk/org/apache/maven/its/core-it-support-artifacts/2.1-SNAPSHOT/core-it-support-artifacts-2.1-20090226.140544-2.pom
1K uploaded
[INFO] Retrieving previous metadata from apache.snapshots
[INFO] Uploading repository metadata for: 'artifact org.apache.maven.its:core-it-support-artifacts'
[INFO] Retrieving previous metadata from apache.snapshots
[INFO] Uploading repository metadata for: 'snapshot org.apache.maven.its:core-it-support-artifacts:2.1-SNAPSHOT'
[INFO] Retrieving previous build number from apache.snapshots
Uploading: file:/opt/repos/deploy-junk/org/apache/maven/its/core-it-support-artifacts/2.1-SNAPSHOT/core-it-support-artifacts-2.1-20090226.140544-2-repo.zip
15K uploaded
[INFO] ------------------------------------------------------------------------
[INFO] Building Maven Integration Tests
[INFO]    task-segment: [clean, deploy]
[INFO] ------------------------------------------------------------------------
[INFO] [clean:clean]
[INFO] Deleting directory C:\home\hudson\workspace\maven-core-integration-testing\jdk\1.5\label\windows\maven-its\core-it-suite\target
[INFO] ------------------------------------------------------------------------
[ERROR] BUILD ERROR
[INFO] ------------------------------------------------------------------------
[INFO] Failed to delete directory: C:\home\hudson\workspace\maven-core-integration-testing\jdk\1.5\label\windows\maven-its\core-it-suite\target.
Reason: Unable to delete directory C:\home\hudson\workspace\maven-core-integration-testing\jdk\1.5\label\windows\maven-its\core-it-suite\target

[INFO] ------------------------------------------------------------------------
[INFO] Trace
org.apache.maven.lifecycle.LifecycleExecutionException: Failed to delete directory: C:\home\hudson\workspace\maven-core-integration-testing\jdk\1.5\label\windows\maven-its\core-it-suite\target.
Reason: Unable to delete directory C:\home\hudson\workspace\maven-core-integration-testing\jdk\1.5\label\windows\maven-its\core-it-suite\target
	at org.apache.maven.lifecycle.DefaultLifecycleExecutor.executeGoals(DefaultLifecycleExecutor.java:701)
	at org.apache.maven.lifecycle.DefaultLifecycleExecutor.executeGoalWithLifecycle(DefaultLifecycleExecutor.java:538)
	at org.apache.maven.lifecycle.DefaultLifecycleExecutor.executeGoal(DefaultLifecycleExecutor.java:517)
	at org.apache.maven.lifecycle.DefaultLifecycleExecutor.executeGoalAndHandleFailures(DefaultLifecycleExecutor.java:369)
	at org.apache.maven.lifecycle.DefaultLifecycleExecutor.executeTaskSegments(DefaultLifecycleExecutor.java:330)
	at org.apache.maven.lifecycle.DefaultLifecycleExecutor.execute(DefaultLifecycleExecutor.java:181)
	at org.apache.maven.DefaultMaven.doExecute(DefaultMaven.java:336)
	at org.apache.maven.DefaultMaven.execute(DefaultMaven.java:129)
	at org.apache.maven.cli.MavenCli.main(MavenCli.java:302)
	at sun.reflect.NativeMethodAccessorImpl.invoke0(Native Method)
	at sun.reflect.NativeMethodAccessorImpl.invoke(NativeMethodAccessorImpl.java:39)
	at sun.reflect.DelegatingMethodAccessorImpl.invoke(DelegatingMethodAccessorImpl.java:25)
	at java.lang.reflect.Method.invoke(Method.java:585)
	at org.codehaus.classworlds.Launcher.launchEnhanced(Launcher.java:315)
	at org.codehaus.classworlds.Launcher.launch(Launcher.java:255)
	at org.codehaus.classworlds.Launcher.mainWithExitCode(Launcher.java:430)
	at org.codehaus.classworlds.Launcher.main(Launcher.java:375)
Caused by: org.apache.maven.plugin.MojoExecutionException: Failed to delete directory: C:\home\hudson\workspace\maven-core-integration-testing\jdk\1.5\label\windows\maven-its\core-it-suite\target.
Reason: Unable to delete directory C:\home\hudson\workspace\maven-core-integration-testing\jdk\1.5\label\windows\maven-its\core-it-suite\target
	at org.apache.maven.plugin.clean.CleanMojo.removeDirectory(CleanMojo.java:265)
	at org.apache.maven.plugin.clean.CleanMojo.execute(CleanMojo.java:173)
	at org.apache.maven.plugin.DefaultPluginManager.executeMojo(DefaultPluginManager.java:458)
	at org.apache.maven.lifecycle.DefaultLifecycleExecutor.executeGoals(DefaultLifecycleExecutor.java:676)
	... 16 more
Caused by: java.io.IOException: Unable to delete directory C:\home\hudson\workspace\maven-core-integration-testing\jdk\1.5\label\windows\maven-its\core-it-suite\target
	at org.apache.maven.shared.model.fileset.util.FileSetManager.removeDir(FileSetManager.java:599)
	at org.apache.maven.shared.model.fileset.util.FileSetManager.delete(FileSetManager.java:309)
	at org.apache.maven.plugin.clean.CleanMojo.removeDirectory(CleanMojo.java:261)
	... 19 more
[INFO] ------------------------------------------------------------------------
[INFO] Total time: 3 minutes 10 seconds
[INFO] Finished at: Thu Feb 26 06:08:44 PST 2009
[INFO] Final Memory: 32M/63M
[INFO] ------------------------------------------------------------------------


Mime
View raw message