maven-notifications mailing list archives

Site index · List index
Message view « Date » · « Thread »
Top « Date » · « Thread »
From Hudson <Hud...@sonatype.org>
Subject Build failed in Hudson: Maven-2.0.x-with-bootstrap » 1.4,windows #95
Date Fri, 27 Feb 2009 21:08:52 GMT
See http://grid.sonatype.org/ci/job/Maven-2.0.x-with-bootstrap/./jdk=1.4,label=windows/95/changes

------------------------------------------
[...truncated 1549 lines...]
     [java] -------------------------------------------------------
     [java]  T E S T S
     [java] -------------------------------------------------------
     [java] Running org.apache.maven.settings.GlobalSettingsTest
     [java] Tests run: 1, Failures: 0, Errors: 0, Skipped: 0, Time elapsed: 0.046 sec
     [java] 
     [java] Results :
     [java] 
     [java] Tests run: 1, Failures: 0, Errors: 0, Skipped: 0
     [java] 
     [java] [INFO] [jar:jar]
     [java] [INFO] Building jar: C:\home\hudson\workspace\Maven-2.0.x-with-bootstrap\jdk\1.4\label\windows\maven-2.0.x\apache-maven\target\apache-maven-2.0.11-SNAPSHOT.jar
     [java] [INFO] [shade:shade {execution: default}]
     [java] [INFO] Including org.apache.maven:maven-core:jar:2.0.11-SNAPSHOT in the shaded
jar.
     [java] [INFO] Including org.apache.maven:maven-settings:jar:2.0.11-SNAPSHOT in the shaded
jar.
     [java] [INFO] Including org.apache.maven:maven-model:jar:2.0.11-SNAPSHOT in the shaded
jar.
     [java] [INFO] Including org.codehaus.plexus:plexus-utils:jar:1.5.6 in the shaded jar.
     [java] [INFO] Including org.codehaus.plexus:plexus-interpolation:jar:1.1 in the shaded
jar.
     [java] [INFO] Including org.codehaus.plexus:plexus-container-default:jar:1.0-alpha-9-stable-1
in the shaded jar.
     [java] [INFO] Excluding classworlds:classworlds:jar:1.1 from the shaded jar.
     [java] [INFO] Including org.apache.maven.wagon:wagon-file:jar:1.0-beta-2 in the shaded
jar.
     [java] [INFO] Including org.apache.maven.wagon:wagon-provider-api:jar:1.0-beta-2 in the
shaded jar.
     [java] [INFO] Including org.apache.maven:maven-plugin-parameter-documenter:jar:2.0.11-SNAPSHOT
in the shaded jar.
     [java] [INFO] Including org.apache.maven.wagon:wagon-webdav:jar:1.0-beta-2 in the shaded
jar.
     [java] [INFO] Including slide:slide-webdavlib:jar:2.1 in the shaded jar.
     [java] [INFO] Including commons-httpclient:commons-httpclient:jar:2.0.2 in the shaded
jar.
     [java] [INFO] Including commons-logging:commons-logging:jar:1.0.4 in the shaded jar.
     [java] [INFO] Including jdom:jdom:jar:1.0 in the shaded jar.
     [java] [INFO] Including de.zeigermann.xml:xml-im-exporter:jar:1.1 in the shaded jar.
     [java] [INFO] Including org.apache.maven.wagon:wagon-http-lightweight:jar:1.0-beta-2
in the shaded jar.
     [java] [INFO] Including org.apache.maven.wagon:wagon-http-shared:jar:1.0-beta-2 in the
shaded jar.
     [java] [INFO] Including jtidy:jtidy:jar:4aug2000r7-dev in the shaded jar.
     [java] [INFO] Excluding xml-apis:xml-apis:jar:1.0.b2 from the shaded jar.
     [java] [INFO] Including org.apache.maven.reporting:maven-reporting-api:jar:2.0.11-SNAPSHOT
in the shaded jar.
     [java] [INFO] Including org.apache.maven.doxia:doxia-sink-api:jar:1.0 in the shaded jar.
     [java] [INFO] Including org.apache.maven:maven-profile:jar:2.0.11-SNAPSHOT in the shaded
jar.
     [java] [INFO] Including org.apache.maven:maven-artifact:jar:2.0.11-SNAPSHOT in the shaded
jar.
     [java] [INFO] Including org.apache.maven:maven-repository-metadata:jar:2.0.11-SNAPSHOT
in the shaded jar.
     [java] [INFO] Including org.apache.maven:maven-error-diagnostics:jar:2.0.11-SNAPSHOT
in the shaded jar.
     [java] [INFO] Including org.apache.maven:maven-project:jar:2.0.11-SNAPSHOT in the shaded
jar.
     [java] [INFO] Including org.apache.maven:maven-artifact-manager:jar:2.0.11-SNAPSHOT in
the shaded jar.
     [java] [INFO] Including org.apache.maven:maven-plugin-registry:jar:2.0.11-SNAPSHOT in
the shaded jar.
     [java] [INFO] Including commons-cli:commons-cli:jar:1.0 in the shaded jar.
     [java] [INFO] Including org.apache.maven:maven-plugin-api:jar:2.0.11-SNAPSHOT in the
shaded jar.
     [java] [INFO] Including org.apache.maven.wagon:wagon-ssh-external:jar:1.0-beta-2 in the
shaded jar.
     [java] [INFO] Including org.apache.maven.wagon:wagon-ssh-common:jar:1.0-beta-2 in the
shaded jar.
     [java] [INFO] Including org.codehaus.plexus:plexus-interactivity-api:jar:1.0-alpha-4
in the shaded jar.
     [java] [INFO] Including org.apache.maven:maven-plugin-descriptor:jar:2.0.11-SNAPSHOT
in the shaded jar.
     [java] [INFO] Including org.apache.maven:maven-monitor:jar:2.0.11-SNAPSHOT in the shaded
jar.
     [java] [INFO] Including org.apache.maven.wagon:wagon-ssh:jar:1.0-beta-2 in the shaded
jar.
     [java] [INFO] Including com.jcraft:jsch:jar:0.1.27 in the shaded jar.
     [java] [INFO] Including org.apache.maven:maven-toolchain:jar:2.0.11-SNAPSHOT in the shaded
jar.
     [java] [INFO] Replacing original artifact with shaded artifact.
     [java] [INFO] Replacing C:\home\hudson\workspace\Maven-2.0.x-with-bootstrap\jdk\1.4\label\windows\maven-2.0.x\apache-maven\target\maven-2.0.11-SNAPSHOT-uber.jar
with C:\home\hudson\workspace\Maven-2.0.x-with-bootstrap\jdk\1.4\label\windows\maven-2.0.x\apache-maven\target\apache-maven-2.0.11-SNAPSHOT-shaded.jar
     [java] Downloading: http://repository.sonatype.org:8081/content/groups/public/org/apache/maven/wagon/wagon-file/1.0-alpha-7/wagon-file-1.0-alpha-7.pom
     [java] Downloading: http://repository.sonatype.org:8081/content/groups/public/org/apache/maven/wagon/wagon-providers/1.0-alpha-6/wagon-providers-1.0-alpha-6.pom
     [java] Downloading: http://repository.sonatype.org:8081/content/groups/public/org/apache/maven/maven-plugin-parameter-documenter/2.0.4/maven-plugin-parameter-documenter-2.0.4.pom
     [java] Downloading: http://repository.sonatype.org:8081/content/groups/public/org/apache/maven/wagon/wagon-http-lightweight/1.0-alpha-6/wagon-http-lightweight-1.0-alpha-6.pom
     [java] Downloading: http://repository.sonatype.org:8081/content/groups/public/org/apache/maven/maven-error-diagnostics/2.0.4/maven-error-diagnostics-2.0.4.pom
     [java] Downloading: http://repository.sonatype.org:8081/content/groups/public/org/apache/maven/maven-plugin-registry/2.0.4/maven-plugin-registry-2.0.4.pom
     [java] Downloading: http://repository.sonatype.org:8081/content/groups/public/org/apache/maven/wagon/wagon-ssh-external/1.0-alpha-6/wagon-ssh-external-1.0-alpha-6.pom
     [java] [WARNING] Unable to get resource 'org.apache.maven.wagon:wagon-ssh-external:pom:1.0-alpha-6'
from repository central (http://Nexus): Error transferring file
     [java] Downloading: http://repository.sonatype.org:8081/content/groups/public/org/apache/maven/wagon/wagon-ssh-external/1.0-alpha-6/wagon-ssh-external-1.0-alpha-6.pom
     [java] [WARNING] Unable to get resource 'org.apache.maven.wagon:wagon-ssh-external:pom:1.0-alpha-6'
from repository central (http://Nexus): Error transferring file
     [java] Downloading: http://repository.sonatype.org:8081/content/groups/public/org/apache/maven/maven-plugin-descriptor/2.0.4/maven-plugin-descriptor-2.0.4.pom
     [java] [WARNING] Unable to get resource 'org.apache.maven:maven-plugin-descriptor:pom:2.0.4'
from repository central (http://Nexus): Error transferring file
     [java] Downloading: http://repository.sonatype.org:8081/content/groups/public/org/apache/maven/maven-plugin-descriptor/2.0.4/maven-plugin-descriptor-2.0.4.pom
     [java] [WARNING] Unable to get resource 'org.apache.maven:maven-plugin-descriptor:pom:2.0.4'
from repository central (http://Nexus): Error transferring file
     [java] Downloading: http://repository.sonatype.org:8081/content/groups/public/org/apache/maven/maven-monitor/2.0.4/maven-monitor-2.0.4.pom
     [java] [WARNING] Unable to get resource 'org.apache.maven:maven-monitor:pom:2.0.4' from
repository central (http://Nexus): Error transferring file
     [java] Downloading: http://repository.sonatype.org:8081/content/groups/public/org/apache/maven/maven-monitor/2.0.4/maven-monitor-2.0.4.pom
     [java] [WARNING] Unable to get resource 'org.apache.maven:maven-monitor:pom:2.0.4' from
repository central (http://Nexus): Error transferring file
     [java] Downloading: http://repository.sonatype.org:8081/content/groups/public/org/apache/maven/wagon/wagon-ssh/1.0-alpha-7/wagon-ssh-1.0-alpha-7.pom
     [java] [WARNING] Unable to get resource 'org.apache.maven.wagon:wagon-ssh:pom:1.0-alpha-7'
from repository central (http://Nexus): Error transferring file
     [java] Downloading: http://repository.sonatype.org:8081/content/groups/public/org/apache/maven/wagon/wagon-ssh/1.0-alpha-7/wagon-ssh-1.0-alpha-7.pom
     [java] [WARNING] Unable to get resource 'org.apache.maven.wagon:wagon-ssh:pom:1.0-alpha-7'
from repository central (http://Nexus): Error transferring file
     [java] Downloading: http://repository.sonatype.org:8081/content/groups/public/org/apache/maven/maven-archiver/2.0.4/maven-archiver-2.0.4.pom
     [java] [WARNING] Unable to get resource 'org.apache.maven:maven-archiver:pom:2.0.4' from
repository central (http://Nexus): Error transferring file
     [java] Downloading: http://repository.sonatype.org:8081/content/groups/public/org/apache/maven/maven-archiver/2.0.4/maven-archiver-2.0.4.pom
     [java] [WARNING] Unable to get resource 'org.apache.maven:maven-archiver:pom:2.0.4' from
repository central (http://Nexus): Error transferring file
     [java] Downloading: http://repository.sonatype.org:8081/content/groups/public/org/codehaus/plexus/plexus-archiver/1.0-alpha-6/plexus-archiver-1.0-alpha-6.pom
     [java] [WARNING] Unable to get resource 'org.codehaus.plexus:plexus-archiver:pom:1.0-alpha-6'
from repository central (http://Nexus): Error transferring file
     [java] Downloading: http://repository.sonatype.org:8081/content/groups/public/org/codehaus/plexus/plexus-archiver/1.0-alpha-6/plexus-archiver-1.0-alpha-6.pom
     [java] [WARNING] Unable to get resource 'org.codehaus.plexus:plexus-archiver:pom:1.0-alpha-6'
from repository central (http://Nexus): Error transferring file
     [java] Downloading: http://repository.sonatype.org:8081/content/groups/public/org/apache/maven/maven-archiver/2.0.4/maven-archiver-2.0.4.jar
     [java] [WARNING] Unable to get resource 'org.apache.maven:maven-archiver:jar:2.0.4' from
repository central (http://Nexus): Error transferring file
     [java] Downloading: http://repository.sonatype.org:8081/content/groups/public/org/apache/maven/maven-archiver/2.0.4/maven-archiver-2.0.4.jar
     [java] [WARNING] Unable to get resource 'org.apache.maven:maven-archiver:jar:2.0.4' from
repository central (http://Nexus): Error transferring file
     [java] Downloading: http://repository.sonatype.org:8081/content/groups/public/org/codehaus/plexus/plexus-archiver/1.0-alpha-6/plexus-archiver-1.0-alpha-6.jar
     [java] [WARNING] Unable to get resource 'org.codehaus.plexus:plexus-archiver:jar:1.0-alpha-6'
from repository central (http://Nexus): Error transferring file
     [java] Downloading: http://repository.sonatype.org:8081/content/groups/public/org/codehaus/plexus/plexus-archiver/1.0-alpha-6/plexus-archiver-1.0-alpha-6.jar
     [java] [WARNING] Unable to get resource 'org.codehaus.plexus:plexus-archiver:jar:1.0-alpha-6'
from repository central (http://Nexus): Error transferring file
     [java] [INFO] ------------------------------------------------------------------------
     [java] [ERROR] BUILD ERROR
     [java] [INFO] ------------------------------------------------------------------------
     [java] [INFO] Failed to resolve artifact.
     [java] 
     [java] Missing:
     [java] ----------
     [java] 1) org.apache.maven:maven-archiver:jar:2.0.4
     [java] 
     [java]   Try downloading the file manually from the project website.
     [java] 
     [java]   Then, install it using the command: 
     [java]       mvn install:install-file -DgroupId=org.apache.maven -DartifactId=maven-archiver
-Dversion=2.0.4 -Dpackaging=jar -Dfile=/path/to/file
     [java] 
     [java]   Alternatively, if you host your own repository you can deploy the file there:

     [java]       mvn deploy:deploy-file -DgroupId=org.apache.maven -DartifactId=maven-archiver
-Dversion=2.0.4 -Dpackaging=jar -Dfile=/path/to/file -Durl=[url] -DrepositoryId=[id]
     [java] 
     [java]   Path to dependency: 
     [java]   	1) org.apache.maven.plugins:maven-assembly-plugin:maven-plugin:2.1
     [java]   	2) org.apache.maven:maven-archiver:jar:2.0.4
     [java] 
     [java] 2) org.codehaus.plexus:plexus-archiver:jar:1.0-alpha-6
     [java] 
     [java]   Try downloading the file manually from the project website.
     [java] 
     [java]   Then, install it using the command: 
     [java]       mvn install:install-file -DgroupId=org.codehaus.plexus -DartifactId=plexus-archiver
-Dversion=1.0-alpha-6 -Dpackaging=jar -Dfile=/path/to/file
     [java] 
     [java]   Alternatively, if you host your own repository you can deploy the file there:

     [java]       mvn deploy:deploy-file -DgroupId=org.codehaus.plexus -DartifactId=plexus-archiver
-Dversion=1.0-alpha-6 -Dpackaging=jar -Dfile=/path/to/file -Durl=[url] -DrepositoryId=[id]
     [java] 
     [java]   Path to dependency: 
     [java]   	1) org.apache.maven.plugins:maven-assembly-plugin:maven-plugin:2.1
     [java]   	2) org.codehaus.plexus:plexus-archiver:jar:1.0-alpha-6
     [java] 
     [java] ----------
     [java] 2 required artifacts are missing.
     [java] 
     [java] for artifact: 
     [java]   org.apache.maven.plugins:maven-assembly-plugin:maven-plugin:2.1
     [java] 
     [java] from the specified remote repositories:
     [java]   Nexus (http://repository.sonatype.org:8081/content/groups/public),
     [java]   snapshots (http://snapshots.maven.codehaus.org/maven2)
     [java] 
     [java] 
     [java] 
     [java] [INFO] ------------------------------------------------------------------------
     [java] [INFO] Trace
     [java] org.apache.maven.lifecycle.LifecycleExecutionException: Missing:
     [java] ----------
     [java] 1) org.apache.maven:maven-archiver:jar:2.0.4
     [java] 
     [java]   Try downloading the file manually from the project website.
     [java] 
     [java]   Then, install it using the command: 
     [java]       mvn install:install-file -DgroupId=org.apache.maven -DartifactId=maven-archiver
-Dversion=2.0.4 -Dpackaging=jar -Dfile=/path/to/file
     [java] 
     [java]   Alternatively, if you host your own repository you can deploy the file there:

     [java]       mvn deploy:deploy-file -DgroupId=org.apache.maven -DartifactId=maven-archiver
-Dversion=2.0.4 -Dpackaging=jar -Dfile=/path/to/file -Durl=[url] -DrepositoryId=[id]
     [java] 
     [java]   Path to dependency: 
     [java]   	1) org.apache.maven.plugins:maven-assembly-plugin:maven-plugin:2.1
     [java]   	2) org.apache.maven:maven-archiver:jar:2.0.4
     [java] 
     [java] 2) org.codehaus.plexus:plexus-archiver:jar:1.0-alpha-6
     [java] 
     [java]   Try downloading the file manually from the project website.
     [java] 
     [java]   Then, install it using the command: 
     [java]       mvn install:install-file -DgroupId=org.codehaus.plexus -DartifactId=plexus-archiver
-Dversion=1.0-alpha-6 -Dpackaging=jar -Dfile=/path/to/file
     [java] 
     [java]   Alternatively, if you host your own repository you can deploy the file there:

     [java]       mvn deploy:deploy-file -DgroupId=org.codehaus.plexus -DartifactId=plexus-archiver
-Dversion=1.0-alpha-6 -Dpackaging=jar -Dfile=/path/to/file -Durl=[url] -DrepositoryId=[id]
     [java] 
     [java]   Path to dependency: 
     [java]   	1) org.apache.maven.plugins:maven-assembly-plugin:maven-plugin:2.1
     [java]   	2) org.codehaus.plexus:plexus-archiver:jar:1.0-alpha-6
     [java] 
     [java] ----------
     [java] 2 required artifacts are missing.
     [java] 
     [java] for artifact: 
     [java]   org.apache.maven.plugins:maven-assembly-plugin:maven-plugin:2.1
     [java] 
     [java] from the specified remote repositories:
     [java]   Nexus (http://repository.sonatype.org:8081/content/groups/public),
     [java]   snapshots (http://snapshots.maven.codehaus.org/maven2)
     [java] 
     [java] 
     [java] 	at org.apache.maven.lifecycle.DefaultLifecycleExecutor.executeGoals(Unknown Source)
     [java] 	at org.apache.maven.lifecycle.DefaultLifecycleExecutor.executeGoalWithLifecycle(Unknown
Source)
     [java] 	at org.apache.maven.lifecycle.DefaultLifecycleExecutor.executeGoal(Unknown Source)
     [java] 	at org.apache.maven.lifecycle.DefaultLifecycleExecutor.executeGoalAndHandleFailures(Unknown
Source)
     [java] 	at org.apache.maven.lifecycle.DefaultLifecycleExecutor.executeTaskSegments(Unknown
Source)
     [java] 	at org.apache.maven.lifecycle.DefaultLifecycleExecutor.execute(Unknown Source)
     [java] 	at org.apache.maven.DefaultMaven.doExecute(Unknown Source)
     [java] 	at org.apache.maven.DefaultMaven.execute(Unknown Source)
     [java] 	at org.apache.maven.cli.MavenCli.main(Unknown Source)
     [java] 	at org.apache.maven.cli.MavenCli.main(Unknown Source)
     [java] Caused by: org.apache.maven.artifact.resolver.MultipleArtifactsNotFoundException:
Missing:
     [java] ----------
     [java] 1) org.apache.maven:maven-archiver:jar:2.0.4
     [java] 
     [java]   Try downloading the file manually from the project website.
     [java] 
     [java]   Then, install it using the command: 
     [java]       mvn install:install-file -DgroupId=org.apache.maven -DartifactId=maven-archiver
-Dversion=2.0.4 -Dpackaging=jar -Dfile=/path/to/file
     [java] 
     [java]   Alternatively, if you host your own repository you can deploy the file there:

     [java]       mvn deploy:deploy-file -DgroupId=org.apache.maven -DartifactId=maven-archiver
-Dversion=2.0.4 -Dpackaging=jar -Dfile=/path/to/file -Durl=[url] -DrepositoryId=[id]
     [java] 
     [java]   Path to dependency: 
     [java]   	1) org.apache.maven.plugins:maven-assembly-plugin:maven-plugin:2.1
     [java]   	2) org.apache.maven:maven-archiver:jar:2.0.4
     [java] 
     [java] 2) org.codehaus.plexus:plexus-archiver:jar:1.0-alpha-6
     [java] 
     [java]   Try downloading the file manually from the project website.
     [java] 
     [java]   Then, install it using the command: 
     [java]       mvn install:install-file -DgroupId=org.codehaus.plexus -DartifactId=plexus-archiver
-Dversion=1.0-alpha-6 -Dpackaging=jar -Dfile=/path/to/file
     [java] 
     [java]   Alternatively, if you host your own repository you can deploy the file there:

     [java]       mvn deploy:deploy-file -DgroupId=org.codehaus.plexus -DartifactId=plexus-archiver
-Dversion=1.0-alpha-6 -Dpackaging=jar -Dfile=/path/to/file -Durl=[url] -DrepositoryId=[id]
     [java] 
     [java]   Path to dependency: 
     [java]   	1) org.apache.maven.plugins:maven-assembly-plugin:maven-plugin:2.1
     [java]   	2) org.codehaus.plexus:plexus-archiver:jar:1.0-alpha-6
     [java] 
     [java] ----------
     [java] 2 required artifacts are missing.
     [java] 
     [java] for artifact: 
     [java]   org.apache.maven.plugins:maven-assembly-plugin:maven-plugin:2.1
     [java] 
     [java] from the specified remote repositories:
     [java]   Nexus (http://repository.sonatype.org:8081/content/groups/public),
     [java]   snapshots (http://snapshots.maven.codehaus.org/maven2)
     [java] 
     [java] 
     [java] 	at org.apache.maven.artifact.resolver.DefaultArtifactResolver.resolveTransitively(Unknown
Source)
     [java] 	at org.apache.maven.artifact.resolver.DefaultArtifactResolver.resolveTransitively(Unknown
Source)
     [java] 	at org.apache.maven.plugin.DefaultPluginManager.ensurePluginContainerIsComplete(Unknown
Source)
     [java] 	at org.apache.maven.plugin.DefaultPluginManager.getConfiguredMojo(Unknown Source)
     [java] 	at org.apache.maven.plugin.DefaultPluginManager.executeMojo(Unknown Source)
     [java] 	... 10 more
     [java] [INFO] ------------------------------------------------------------------------
     [java] [INFO] Total time: 2 minutes 11 seconds
     [java] [INFO] Finished at: Fri Feb 27 13:08:45 PST 2009
     [java] [INFO] Final Memory: 27M/49M
     [java] [INFO] ------------------------------------------------------------------------

BUILD FAILED
C:\home\hudson\workspace\Maven-2.0.x-with-bootstrap\jdk\1.4\label\windows\maven-2.0.x\build.xml:168:
Java returned: 1

Total time: 2 minutes 53 seconds


Mime
View raw message