maven-notifications mailing list archives

Site index · List index
Message view « Date » · « Thread »
Top « Date » · « Thread »
From Hudson <Hud...@sonatype.org>
Subject Build failed in Hudson: maven-parent-pom-trunk » default #14
Date Sun, 15 Feb 2009 10:25:41 GMT
See http://grid.sonatype.org/ci/job/maven-parent-pom-trunk/./default/14/changes

------------------------------------------
[...truncated 103 lines...]
Downloading: http://repository.sonatype.org:8081/content/groups/public/org/apache/maven/maven-repository-metadata/2.0.5/maven-repository-metadata-2.0.5.pom
Downloading: http://repository.sonatype.org:8081/content/groups/public/org/apache/maven/maven-artifact/2.0.5/maven-artifact-2.0.5.pom
Downloading: http://repository.sonatype.org:8081/content/groups/public/org/apache/maven/maven-core/2.0.5/maven-core-2.0.5.pom
Downloading: http://repository.sonatype.org:8081/content/groups/public/org/apache/maven/wagon/wagon-file/1.0-beta-2/wagon-file-1.0-beta-2.pom
Downloading: http://repository.sonatype.org:8081/content/groups/public/org/apache/maven/wagon/wagon-providers/1.0-beta-2/wagon-providers-1.0-beta-2.pom
Downloading: http://repository.sonatype.org:8081/content/groups/public/org/apache/maven/maven-plugin-parameter-documenter/2.0.5/maven-plugin-parameter-documenter-2.0.5.pom
Downloading: http://repository.sonatype.org:8081/content/groups/public/org/apache/maven/wagon/wagon-http-lightweight/1.0-beta-2/wagon-http-lightweight-1.0-beta-2.pom
Downloading: http://repository.sonatype.org:8081/content/groups/public/org/apache/maven/wagon/wagon-http-shared/1.0-beta-2/wagon-http-shared-1.0-beta-2.pom
Downloading: http://repository.sonatype.org:8081/content/groups/public/jtidy/jtidy/4aug2000r7-dev/jtidy-4aug2000r7-dev.pom
Downloading: http://repository.sonatype.org:8081/content/groups/public/xml-apis/xml-apis/1.0.b2/xml-apis-1.0.b2.pom
Downloading: http://repository.sonatype.org:8081/content/groups/public/org/apache/maven/reporting/maven-reporting-api/2.0.5/maven-reporting-api-2.0.5.pom
Downloading: http://repository.sonatype.org:8081/content/groups/public/org/apache/maven/reporting/maven-reporting/2.0.5/maven-reporting-2.0.5.pom
Downloading: http://repository.sonatype.org:8081/content/groups/public/org/apache/maven/doxia/doxia-sink-api/1.0-alpha-7/doxia-sink-api-1.0-alpha-7.pom
Downloading: http://repository.sonatype.org:8081/content/groups/public/org/apache/maven/doxia/doxia/1.0-alpha-7/doxia-1.0-alpha-7.pom
Downloading: http://repository.sonatype.org:8081/content/groups/public/org/apache/maven/maven-error-diagnostics/2.0.5/maven-error-diagnostics-2.0.5.pom
Downloading: http://repository.sonatype.org:8081/content/groups/public/org/apache/maven/maven-plugin-registry/2.0.5/maven-plugin-registry-2.0.5.pom
Downloading: http://repository.sonatype.org:8081/content/groups/public/commons-cli/commons-cli/1.0/commons-cli-1.0.pom
Downloading: http://repository.sonatype.org:8081/content/groups/public/org/apache/maven/maven-plugin-api/2.0.5/maven-plugin-api-2.0.5.pom
Downloading: http://repository.sonatype.org:8081/content/groups/public/org/apache/maven/wagon/wagon-ssh-external/1.0-beta-2/wagon-ssh-external-1.0-beta-2.pom
Downloading: http://repository.sonatype.org:8081/content/groups/public/org/apache/maven/wagon/wagon-ssh-common/1.0-beta-2/wagon-ssh-common-1.0-beta-2.pom
Downloading: http://repository.sonatype.org:8081/content/groups/public/org/codehaus/plexus/plexus-interactivity-api/1.0-alpha-4/plexus-interactivity-api-1.0-alpha-4.pom
Downloading: http://repository.sonatype.org:8081/content/groups/public/org/codehaus/plexus/plexus-container-default/1.0-alpha-7/plexus-container-default-1.0-alpha-7.pom
Downloading: http://repository.sonatype.org:8081/content/groups/public/plexus/plexus-containers/1.0.2/plexus-containers-1.0.2.pom
Downloading: http://repository.sonatype.org:8081/content/groups/public/plexus/plexus-root/1.0.3/plexus-root-1.0.3.pom
Downloading: http://repository.sonatype.org:8081/content/groups/public/plexus/plexus-utils/1.0.2/plexus-utils-1.0.2.pom
Downloading: http://repository.sonatype.org:8081/content/groups/public/org/apache/maven/maven-plugin-descriptor/2.0.5/maven-plugin-descriptor-2.0.5.pom
Downloading: http://repository.sonatype.org:8081/content/groups/public/org/apache/maven/maven-monitor/2.0.5/maven-monitor-2.0.5.pom
Downloading: http://repository.sonatype.org:8081/content/groups/public/org/apache/maven/wagon/wagon-ssh/1.0-beta-2/wagon-ssh-1.0-beta-2.pom
Downloading: http://repository.sonatype.org:8081/content/groups/public/com/jcraft/jsch/0.1.27/jsch-0.1.27.pom
Downloading: http://repository.sonatype.org:8081/content/groups/public/classworlds/classworlds/1.1/classworlds-1.1.pom
Downloading: http://repository.sonatype.org:8081/content/groups/public/velocity/velocity-dep/1.4/velocity-dep-1.4.pom
Downloading: http://repository.sonatype.org:8081/content/groups/public/org/apache/maven/shared/maven-common-artifact-filters/1.0/maven-common-artifact-filters-1.0.pom
Downloading: http://repository.sonatype.org:8081/content/groups/public/org/apache/maven/maven-artifact/2.0.8/maven-artifact-2.0.8.pom
Downloading: http://repository.sonatype.org:8081/content/groups/public/org/apache/maven/maven/2.0.8/maven-2.0.8.pom
Downloading: http://repository.sonatype.org:8081/content/groups/public/org/apache/maven/maven-parent/6/maven-parent-6.pom
Downloading: http://repository.sonatype.org:8081/content/groups/public/org/apache/maven/shared/maven-plugin-testing-harness/1.1/maven-plugin-testing-harness-1.1.pom
Downloading: http://repository.sonatype.org:8081/content/groups/public/org/apache/maven/shared/maven-shared-components/7/maven-shared-components-7.pom
Downloading: http://repository.sonatype.org:8081/content/groups/public/org/apache/maven/maven-project/2.0/maven-project-2.0.pom
Downloading: http://repository.sonatype.org:8081/content/groups/public/org/apache/maven/maven/2.0/maven-2.0.pom
Downloading: http://repository.sonatype.org:8081/content/groups/public/org/apache/maven/maven-core/2.0/maven-core-2.0.pom
Downloading: http://repository.sonatype.org:8081/content/groups/public/org/codehaus/plexus/plexus-utils/1.4.2/plexus-utils-1.4.2.pom
Downloading: http://repository.sonatype.org:8081/content/groups/public/org/codehaus/plexus/plexus-archiver/1.0-alpha-7/plexus-archiver-1.0-alpha-7.pom
1K downloaded
Downloading: http://repository.sonatype.org:8081/content/groups/public/org/codehaus/plexus/plexus-components/1.1.6/plexus-components-1.1.6.pom
1K downloaded
Downloading: http://repository.sonatype.org:8081/content/groups/public/org/codehaus/plexus/plexus/1.0.8/plexus-1.0.8.pom
7K downloaded
Downloading: http://repository.sonatype.org:8081/content/groups/public/org/codehaus/plexus/plexus-utils/1.2/plexus-utils-1.2.pom
Downloading: http://repository.sonatype.org:8081/content/groups/public/org/codehaus/plexus/plexus/1.0.5/plexus-1.0.5.pom
Downloading: http://repository.sonatype.org:8081/content/groups/public/org/codehaus/plexus/plexus-container-default/1.0-alpha-8/plexus-container-default-1.0-alpha-8.pom
Downloading: http://repository.sonatype.org:8081/content/groups/public/org/apache/maven/shared/maven-downloader/1.1/maven-downloader-1.1.pom
Downloading: http://repository.sonatype.org:8081/content/groups/public/org/apache/maven/shared/maven-shared-components/4/maven-shared-components-4.pom
Downloading: http://repository.sonatype.org:8081/content/groups/public/org/apache/maven/maven-artifact-manager/2.0/maven-artifact-manager-2.0.pom
Downloading: http://repository.sonatype.org:8081/content/groups/public/org/apache/maven/maven-artifact/2.0/maven-artifact-2.0.pom
Downloading: http://repository.sonatype.org:8081/content/groups/public/org/codehaus/plexus/plexus-velocity/1.1.3/plexus-velocity-1.1.3.pom
Downloading: http://repository.sonatype.org:8081/content/groups/public/org/codehaus/plexus/plexus-components/1.1.5/plexus-components-1.1.5.pom
Downloading: http://repository.sonatype.org:8081/content/groups/public/commons-collections/commons-collections/2.0/commons-collections-2.0.pom
Downloading: http://repository.sonatype.org:8081/content/groups/public/velocity/velocity/1.4/velocity-1.4.pom
Downloading: http://repository.sonatype.org:8081/content/groups/public/org/codehaus/plexus/plexus-resources/1.0-alpha-4/plexus-resources-1.0-alpha-4.pom
Downloading: http://repository.sonatype.org:8081/content/groups/public/org/codehaus/plexus/plexus-components/1.1.7/plexus-components-1.1.7.pom
Downloading: http://repository.sonatype.org:8081/content/groups/public/org/codehaus/plexus/plexus-utils/1.4.1/plexus-utils-1.4.1.jar
184K downloaded
Downloading: http://repository.sonatype.org:8081/content/groups/public/velocity/velocity-dep/1.4/velocity-dep-1.4.jar
505K downloaded
Downloading: http://repository.sonatype.org:8081/content/groups/public/org/apache/maven/shared/maven-common-artifact-filters/1.0/maven-common-artifact-filters-1.0.jar
26K downloaded
Downloading: http://repository.sonatype.org:8081/content/groups/public/org/apache/maven/shared/maven-plugin-testing-harness/1.1/maven-plugin-testing-harness-1.1.jar
31K downloaded
Downloading: http://repository.sonatype.org:8081/content/groups/public/org/codehaus/plexus/plexus-archiver/1.0-alpha-7/plexus-archiver-1.0-alpha-7.jar
138K downloaded
Downloading: http://repository.sonatype.org:8081/content/groups/public/org/apache/maven/shared/maven-downloader/1.1/maven-downloader-1.1.jar
6K downloaded
Downloading: http://repository.sonatype.org:8081/content/groups/public/org/codehaus/plexus/plexus-velocity/1.1.3/plexus-velocity-1.1.3.jar
7K downloaded
Downloading: http://repository.sonatype.org:8081/content/groups/public/commons-collections/commons-collections/2.0/commons-collections-2.0.jar
88K downloaded
Downloading: http://repository.sonatype.org:8081/content/groups/public/velocity/velocity/1.4/velocity-1.4.jar
352K downloaded
Downloading: http://repository.sonatype.org:8081/content/groups/public/org/codehaus/plexus/plexus-resources/1.0-alpha-4/plexus-resources-1.0-alpha-4.jar
16K downloaded
[INFO] Setting property: classpath.resource.loader.class => 'org.codehaus.plexus.velocity.ContextClassLoaderResourceLoader'.
[INFO] Setting property: velocimacro.messages.on => 'false'.
[INFO] Setting property: resource.loader => 'classpath'.
[INFO] Setting property: resource.manager.logwhenfound => 'false'.
[INFO] [remote-resources:process {execution: default}]
Downloading: http://repository.sonatype.org:8081/content/groups/public/org/apache/apache-jar-resource-bundle/1.4/apache-jar-resource-bundle-1.4.jar
12K downloaded
Downloading: http://repository.sonatype.org:8081/content/groups/public/org/apache/maven/maven-repository-metadata/2.0.2/maven-repository-metadata-2.0.2.pom
Downloading: http://repository.sonatype.org:8081/content/groups/public/org/apache/maven/maven-model/2.0.2/maven-model-2.0.2.pom
Downloading: http://repository.sonatype.org:8081/content/groups/public/org/apache/maven/maven-plugin-api/2.0/maven-plugin-api-2.0.pom
Downloading: http://repository.sonatype.org:8081/content/groups/public/org/apache/maven/maven-profile/2.0/maven-profile-2.0.pom
Downloading: http://repository.sonatype.org:8081/content/groups/public/org/apache/maven/maven-model/2.0/maven-model-2.0.pom
Downloading: http://repository.sonatype.org:8081/content/groups/public/org/apache/maven/maven-settings/2.0/maven-settings-2.0.pom
Downloading: http://repository.sonatype.org:8081/content/groups/public/org/apache/maven/reporting/maven-reporting-api/2.0.4/maven-reporting-api-2.0.4.pom
Downloading: http://repository.sonatype.org:8081/content/groups/public/org/apache/maven/reporting/maven-reporting/2.0.4/maven-reporting-2.0.4.pom
Downloading: http://repository.sonatype.org:8081/content/groups/public/org/apache/maven/maven/2.0.4/maven-2.0.4.pom
Downloading: http://repository.sonatype.org:8081/content/groups/public/org/apache/maven/doxia/doxia-module-xhtml/1.0-alpha-11/doxia-module-xhtml-1.0-alpha-11.pom
1K downloaded
Downloading: http://repository.sonatype.org:8081/content/groups/public/org/apache/maven/doxia/doxia-modules/1.0-alpha-11/doxia-modules-1.0-alpha-11.pom
2K downloaded
Downloading: http://repository.sonatype.org:8081/content/groups/public/org/apache/maven/doxia/doxia/1.0-alpha-11/doxia-1.0-alpha-11.pom
9K downloaded
Downloading: http://repository.sonatype.org:8081/content/groups/public/org/codehaus/plexus/plexus-utils/1.4.5/plexus-utils-1.4.5.pom
Downloading: http://repository.sonatype.org:8081/content/groups/public/org/apache/maven/doxia/doxia-core/1.0-alpha-11/doxia-core-1.0-alpha-11.pom
2K downloaded
Downloading: http://repository.sonatype.org:8081/content/groups/public/org/apache/maven/doxia/doxia-sink-api/1.0-alpha-11/doxia-sink-api-1.0-alpha-11.pom
1K downloaded
Downloading: http://repository.sonatype.org:8081/content/groups/public/org/codehaus/plexus/plexus-container-default/1.0-alpha-30/plexus-container-default-1.0-alpha-30.pom
Downloading: http://repository.sonatype.org:8081/content/groups/public/org/codehaus/plexus/plexus-containers/1.0-alpha-30/plexus-containers-1.0-alpha-30.pom
Downloading: http://repository.sonatype.org:8081/content/groups/public/org/apache/maven/doxia/doxia-decoration-model/1.0-alpha-11/doxia-decoration-model-1.0-alpha-11.pom
2K downloaded
Downloading: http://repository.sonatype.org:8081/content/groups/public/org/apache/maven/doxia/doxia-sitetools/1.0-alpha-11/doxia-sitetools-1.0-alpha-11.pom
8K downloaded
Downloading: http://repository.sonatype.org:8081/content/groups/public/org/apache/maven/doxia/doxia-site-renderer/1.0-alpha-11/doxia-site-renderer-1.0-alpha-11.pom
4K downloaded
Downloading: http://repository.sonatype.org:8081/content/groups/public/org/codehaus/plexus/plexus-i18n/1.0-beta-7/plexus-i18n-1.0-beta-7.pom
Downloading: http://repository.sonatype.org:8081/content/groups/public/org/codehaus/plexus/plexus-components/1.1.12/plexus-components-1.1.12.pom
Downloading: http://repository.sonatype.org:8081/content/groups/public/org/codehaus/plexus/plexus/1.0.10/plexus-1.0.10.pom
Downloading: http://repository.sonatype.org:8081/content/groups/public/org/codehaus/plexus/plexus-velocity/1.1.7/plexus-velocity-1.1.7.pom
Downloading: http://repository.sonatype.org:8081/content/groups/public/org/apache/velocity/velocity/1.5/velocity-1.5.pom
7K downloaded
Downloading: http://repository.sonatype.org:8081/content/groups/public/commons-collections/commons-collections/3.1/commons-collections-3.1.pom
Downloading: http://repository.sonatype.org:8081/content/groups/public/commons-lang/commons-lang/2.1/commons-lang-2.1.pom
Downloading: http://repository.sonatype.org:8081/content/groups/public/oro/oro/2.0.8/oro-2.0.8.pom
Downloading: http://repository.sonatype.org:8081/content/groups/public/commons-collections/commons-collections/3.2/commons-collections-3.2.pom
Downloading: http://repository.sonatype.org:8081/content/groups/public/org/apache/maven/doxia/doxia-module-apt/1.0-alpha-11/doxia-module-apt-1.0-alpha-11.pom
2K downloaded
Downloading: http://repository.sonatype.org:8081/content/groups/public/org/apache/maven/doxia/doxia-module-fml/1.0-alpha-11/doxia-module-fml-1.0-alpha-11.pom
2K downloaded
Downloading: http://repository.sonatype.org:8081/content/groups/public/org/apache/maven/doxia/doxia-module-xdoc/1.0-alpha-11/doxia-module-xdoc-1.0-alpha-11.pom
2K downloaded
Downloading: http://repository.sonatype.org:8081/content/groups/public/org/apache/maven/shared/maven-doxia-tools/1.0.1/maven-doxia-tools-1.0.1.pom
5K downloaded
Downloading: http://repository.sonatype.org:8081/content/groups/public/org/apache/maven/shared/maven-shared-components/9/maven-shared-components-9.pom
Downloading: http://repository.sonatype.org:8081/content/groups/public/commons-io/commons-io/1.4/commons-io-1.4.pom
12K downloaded
Downloading: http://repository.sonatype.org:8081/content/groups/public/org/apache/commons/commons-parent/7/commons-parent-7.pom
17K downloaded
Downloading: http://repository.sonatype.org:8081/content/groups/public/org/codehaus/plexus/plexus-utils/1.5.1/plexus-utils-1.5.1.pom
Downloading: http://repository.sonatype.org:8081/content/groups/public/org/mortbay/jetty/jetty/6.1.5/jetty-6.1.5.pom
Downloading: http://repository.sonatype.org:8081/content/groups/public/org/mortbay/jetty/project/6.1.5/project-6.1.5.pom
12K downloaded
Downloading: http://repository.sonatype.org:8081/content/groups/public/org/mortbay/jetty/jetty-util/6.1.5/jetty-util-6.1.5.pom
Downloading: http://repository.sonatype.org:8081/content/groups/public/org/mortbay/jetty/servlet-api-2.5/6.1.5/servlet-api-2.5-6.1.5.pom
Downloading: http://repository.sonatype.org:8081/content/groups/public/org/codehaus/plexus/plexus-utils/1.5.1/plexus-utils-1.5.1.jar
205K downloaded
Downloading: http://repository.sonatype.org:8081/content/groups/public/org/apache/maven/doxia/doxia-module-xhtml/1.0-alpha-11/doxia-module-xhtml-1.0-alpha-11.jar
20K downloaded
Downloading: http://repository.sonatype.org:8081/content/groups/public/org/apache/maven/doxia/doxia-core/1.0-alpha-11/doxia-core-1.0-alpha-11.jar
53K downloaded
Downloading: http://repository.sonatype.org:8081/content/groups/public/org/apache/maven/doxia/doxia-decoration-model/1.0-alpha-11/doxia-decoration-model-1.0-alpha-11.jar
48K downloaded
Downloading: http://repository.sonatype.org:8081/content/groups/public/org/apache/maven/doxia/doxia-site-renderer/1.0-alpha-11/doxia-site-renderer-1.0-alpha-11.jar
44K downloaded
Downloading: http://repository.sonatype.org:8081/content/groups/public/org/codehaus/plexus/plexus-i18n/1.0-beta-7/plexus-i18n-1.0-beta-7.jar
10K downloaded
Downloading: http://repository.sonatype.org:8081/content/groups/public/org/codehaus/plexus/plexus-velocity/1.1.7/plexus-velocity-1.1.7.jar
7K downloaded
Downloading: http://repository.sonatype.org:8081/content/groups/public/org/apache/velocity/velocity/1.5/velocity-1.5.jar
382K downloaded
Downloading: http://repository.sonatype.org:8081/content/groups/public/commons-collections/commons-collections/3.2/commons-collections-3.2.jar
557K downloaded
Downloading: http://repository.sonatype.org:8081/content/groups/public/commons-lang/commons-lang/2.1/commons-lang-2.1.jar
202K downloaded
Downloading: http://repository.sonatype.org:8081/content/groups/public/oro/oro/2.0.8/oro-2.0.8.jar
63K downloaded
Downloading: http://repository.sonatype.org:8081/content/groups/public/org/apache/maven/doxia/doxia-module-apt/1.0-alpha-11/doxia-module-apt-1.0-alpha-11.jar
45K downloaded
Downloading: http://repository.sonatype.org:8081/content/groups/public/org/apache/maven/doxia/doxia-module-fml/1.0-alpha-11/doxia-module-fml-1.0-alpha-11.jar
17K downloaded
Downloading: http://repository.sonatype.org:8081/content/groups/public/org/apache/maven/doxia/doxia-module-xdoc/1.0-alpha-11/doxia-module-xdoc-1.0-alpha-11.jar
26K downloaded
Downloading: http://repository.sonatype.org:8081/content/groups/public/org/apache/maven/shared/maven-doxia-tools/1.0.1/maven-doxia-tools-1.0.1.jar
37K downloaded
Downloading: http://repository.sonatype.org:8081/content/groups/public/commons-io/commons-io/1.4/commons-io-1.4.jar
106K downloaded
Downloading: http://repository.sonatype.org:8081/content/groups/public/org/mortbay/jetty/jetty/6.1.5/jetty-6.1.5.jar
474K downloaded
Downloading: http://repository.sonatype.org:8081/content/groups/public/org/mortbay/jetty/jetty-util/6.1.5/jetty-util-6.1.5.jar
134K downloaded
Downloading: http://repository.sonatype.org:8081/content/groups/public/org/mortbay/jetty/servlet-api-2.5/6.1.5/servlet-api-2.5-6.1.5.jar
129K downloaded
[INFO] [site:attach-descriptor]
[INFO] Unable to load parent project from a relative path: Could not find the model file 'http://grid.sonatype.org/ci/job/maven-parent-pom-trunk/./default/ws/asf/pom.xml'.
 for project unknown
[INFO] Parent project loaded from repository.
Downloading: http://repository.sonatype.org:8081/content/groups/public/org/codehaus/plexus/plexus-digest/1.0/plexus-digest-1.0.pom
Downloading: http://repository.sonatype.org:8081/content/groups/public/org/codehaus/plexus/plexus-utils/1.1/plexus-utils-1.1.jar
164K downloaded
Downloading: http://repository.sonatype.org:8081/content/groups/public/org/codehaus/plexus/plexus-digest/1.0/plexus-digest-1.0.jar
11K downloaded
[INFO] [install:install]
[INFO] Installing http://grid.sonatype.org/ci/job/maven-parent-pom-trunk/./default/ws/maven/pom.xml
 to /opt/repos/local-repository/org/apache/maven/maven-parent/11-SNAPSHOT/maven-parent-11-SNAPSHOT.pom
Downloading: http://repository.sonatype.org:8081/content/groups/public/org/apache/maven/maven-core/2.0.6/maven-core-2.0.6.pom
Downloading: http://repository.sonatype.org:8081/content/groups/public/org/apache/maven/maven-plugin-parameter-documenter/2.0.6/maven-plugin-parameter-documenter-2.0.6.pom
1K downloaded
Downloading: http://repository.sonatype.org:8081/content/groups/public/org/apache/maven/reporting/maven-reporting-api/2.0.6/maven-reporting-api-2.0.6.pom
Downloading: http://repository.sonatype.org:8081/content/groups/public/org/apache/maven/reporting/maven-reporting/2.0.6/maven-reporting-2.0.6.pom
Downloading: http://repository.sonatype.org:8081/content/groups/public/org/apache/maven/maven-error-diagnostics/2.0.6/maven-error-diagnostics-2.0.6.pom
Downloading: http://repository.sonatype.org:8081/content/groups/public/org/apache/maven/maven-plugin-descriptor/2.0.6/maven-plugin-descriptor-2.0.6.pom
Downloading: http://repository.sonatype.org:8081/content/groups/public/org/apache/maven/maven-monitor/2.0.6/maven-monitor-2.0.6.pom
[INFO] [deploy:deploy]
[INFO] Retrieving previous build number from apache.snapshots.https
Uploading: http://repository.sonatype.org:8081/content/repositories/maven.snapshots/org/apache/maven/maven-parent/11-SNAPSHOT/maven-parent-11-20090215.102540-10.pom
30K uploaded
[INFO] ------------------------------------------------------------------------
[ERROR] BUILD ERROR
[INFO] ------------------------------------------------------------------------
[INFO] Error deploying artifact: Failed to transfer file: http://repository.sonatype.org:8081/content/repositories/maven.snapshots/org/apache/maven/maven-parent/11-SNAPSHOT/maven-parent-11-20090215.102540-10.pom.
Return code is: 401

[INFO] ------------------------------------------------------------------------
[INFO] Trace
org.apache.maven.lifecycle.LifecycleExecutionException: Error deploying artifact: Failed to
transfer file: http://repository.sonatype.org:8081/content/repositories/maven.snapshots/org/apache/maven/maven-parent/11-SNAPSHOT/maven-parent-11-20090215.102540-10.pom.
Return code is: 401
	at org.apache.maven.lifecycle.DefaultLifecycleExecutor.executeGoals(DefaultLifecycleExecutor.java:583)
	at org.apache.maven.lifecycle.DefaultLifecycleExecutor.executeGoalWithLifecycle(DefaultLifecycleExecutor.java:499)
	at org.apache.maven.lifecycle.DefaultLifecycleExecutor.executeGoal(DefaultLifecycleExecutor.java:478)
	at org.apache.maven.lifecycle.DefaultLifecycleExecutor.executeGoalAndHandleFailures(DefaultLifecycleExecutor.java:330)
	at org.apache.maven.lifecycle.DefaultLifecycleExecutor.executeTaskSegments(DefaultLifecycleExecutor.java:291)
	at org.apache.maven.lifecycle.DefaultLifecycleExecutor.execute(DefaultLifecycleExecutor.java:142)
	at org.apache.maven.DefaultMaven.doExecute(DefaultMaven.java:336)
	at org.apache.maven.DefaultMaven.execute(DefaultMaven.java:129)
	at org.apache.maven.cli.MavenCli.main(MavenCli.java:287)
	at sun.reflect.NativeMethodAccessorImpl.invoke0(Native Method)
	at sun.reflect.NativeMethodAccessorImpl.invoke(NativeMethodAccessorImpl.java:39)
	at sun.reflect.DelegatingMethodAccessorImpl.invoke(DelegatingMethodAccessorImpl.java:25)
	at java.lang.reflect.Method.invoke(Method.java:597)
	at org.codehaus.classworlds.Launcher.launchEnhanced(Launcher.java:315)
	at org.codehaus.classworlds.Launcher.launch(Launcher.java:255)
	at org.codehaus.classworlds.Launcher.mainWithExitCode(Launcher.java:430)
	at org.codehaus.classworlds.Launcher.main(Launcher.java:375)
Caused by: org.apache.maven.plugin.MojoExecutionException: Error deploying artifact: Failed
to transfer file: http://repository.sonatype.org:8081/content/repositories/maven.snapshots/org/apache/maven/maven-parent/11-SNAPSHOT/maven-parent-11-20090215.102540-10.pom.
Return code is: 401
	at org.apache.maven.plugin.deploy.DeployMojo.execute(DeployMojo.java:195)
	at org.apache.maven.plugin.DefaultPluginManager.executeMojo(DefaultPluginManager.java:451)
	at org.apache.maven.lifecycle.DefaultLifecycleExecutor.executeGoals(DefaultLifecycleExecutor.java:558)
	... 16 more
Caused by: org.apache.maven.artifact.deployer.ArtifactDeploymentException: Error deploying
artifact: Failed to transfer file: http://repository.sonatype.org:8081/content/repositories/maven.snapshots/org/apache/maven/maven-parent/11-SNAPSHOT/maven-parent-11-20090215.102540-10.pom.
Return code is: 401
	at org.apache.maven.artifact.deployer.DefaultArtifactDeployer.deploy(DefaultArtifactDeployer.java:94)
	at org.apache.maven.plugin.deploy.DeployMojo.execute(DeployMojo.java:165)
	... 18 more
Caused by: org.apache.maven.wagon.TransferFailedException: Failed to transfer file: http://repository.sonatype.org:8081/content/repositories/maven.snapshots/org/apache/maven/maven-parent/11-SNAPSHOT/maven-parent-11-20090215.102540-10.pom.
Return code is: 401
	at org.apache.maven.wagon.providers.http.LightweightHttpWagon.put(LightweightHttpWagon.java:172)
	at org.apache.maven.artifact.manager.DefaultWagonManager.putRemoteFile(DefaultWagonManager.java:244)
	at org.apache.maven.artifact.manager.DefaultWagonManager.putArtifact(DefaultWagonManager.java:160)
	at org.apache.maven.artifact.deployer.DefaultArtifactDeployer.deploy(DefaultArtifactDeployer.java:80)
	... 19 more
[INFO] ------------------------------------------------------------------------
[INFO] Total time: 13 seconds
[INFO] Finished at: Sun Feb 15 04:25:40 CST 2009
[INFO] Final Memory: 16M/74M
[INFO] ------------------------------------------------------------------------


Mime
View raw message