maven-notifications mailing list archives

Site index · List index
Message view « Date » · « Thread »
Top « Date » · « Thread »
From Hudson <Hud...@sonatype.org>
Subject Build failed in Hudson: maven-shared » 1.5,ubuntu #55
Date Sat, 14 Feb 2009 22:34:44 GMT
See http://grid.sonatype.org/ci/job/maven-shared/./jdk=1.5,label=ubuntu/55/changes

Changes:

[Jason van Zyl] o adding tests for the new incremental mode
Submitted by: Igor Fedorenko

------------------------------------------
[...truncated 1321 lines...]

Tests run: 23, Failures: 0, Errors: 0, Skipped: 0

[INFO] [jar:jar]
[INFO] Building jar: /home/hudson/workspace/maven-shared/jdk/1.5/label/ubuntu/trunk/maven-shared-jar/target/maven-shared-jar-1.1-SNAPSHOT.jar
[INFO] [install:install]
[INFO] Installing /home/hudson/workspace/maven-shared/jdk/1.5/label/ubuntu/trunk/maven-shared-jar/target/maven-shared-jar-1.1-SNAPSHOT.jar
to /opt/repos/maven-shared/org/apache/maven/shared/maven-shared-jar/1.1-SNAPSHOT/maven-shared-jar-1.1-SNAPSHOT.jar
[INFO] [deploy:deploy]
[INFO] Retrieving previous build number from apache.snapshots
Uploading: http://repository.sonatype.org:8081/content/repositories/maven.snapshots/org/apache/maven/shared/maven-shared-jar/1.1-SNAPSHOT/maven-shared-jar-1.1-20090214.223152-846.jar
36K uploaded
[INFO] Retrieving previous metadata from apache.snapshots
[INFO] Uploading repository metadata for: 'snapshot org.apache.maven.shared:maven-shared-jar:1.1-SNAPSHOT'
[INFO] Retrieving previous metadata from apache.snapshots
[INFO] Uploading repository metadata for: 'artifact org.apache.maven.shared:maven-shared-jar'
[INFO] Uploading project information for maven-shared-jar 1.1-20090214.223152-846
[INFO] ------------------------------------------------------------------------
[INFO] Building Maven Shared Monitor API
[INFO]    task-segment: [clean, deploy]
[INFO] ------------------------------------------------------------------------
[INFO] [clean:clean]
[INFO] Deleting file set: /home/hudson/workspace/maven-shared/jdk/1.5/label/ubuntu/trunk/maven-shared-monitor/target
(included: [**], excluded: [])
[INFO] [remote-resources:process {execution: default}]
[INFO] [resources:resources]
[INFO] Using 'UTF-8' encoding to copy filtered resources.
[INFO] skip non existing resourceDirectory /home/hudson/workspace/maven-shared/jdk/1.5/label/ubuntu/trunk/maven-shared-monitor/src/main/resources
[INFO] Copying 3 resources
[INFO] [compiler:compile]
[INFO] Compiling 5 source files to /home/hudson/workspace/maven-shared/jdk/1.5/label/ubuntu/trunk/maven-shared-monitor/target/classes
[INFO] [resources:testResources]
[INFO] Using 'UTF-8' encoding to copy filtered resources.
[INFO] skip non existing resourceDirectory /home/hudson/workspace/maven-shared/jdk/1.5/label/ubuntu/trunk/maven-shared-monitor/src/test/resources
[INFO] Copying 3 resources
[INFO] [compiler:testCompile]
[INFO] No sources to compile
[INFO] [surefire:test]
[INFO] Surefire report directory: /home/hudson/workspace/maven-shared/jdk/1.5/label/ubuntu/trunk/maven-shared-monitor/target/surefire-reports

-------------------------------------------------------
 T E S T S
-------------------------------------------------------
There are no tests to run.

Results :

Tests run: 0, Failures: 0, Errors: 0, Skipped: 0

[INFO] [jar:jar]
[INFO] Building jar: /home/hudson/workspace/maven-shared/jdk/1.5/label/ubuntu/trunk/maven-shared-monitor/target/maven-shared-monitor-1.0-SNAPSHOT.jar
[INFO] [install:install]
[INFO] Installing /home/hudson/workspace/maven-shared/jdk/1.5/label/ubuntu/trunk/maven-shared-monitor/target/maven-shared-monitor-1.0-SNAPSHOT.jar
to /opt/repos/maven-shared/org/apache/maven/shared/maven-shared-monitor/1.0-SNAPSHOT/maven-shared-monitor-1.0-SNAPSHOT.jar
[INFO] [deploy:deploy]
[INFO] Retrieving previous build number from apache.snapshots
Uploading: http://repository.sonatype.org:8081/content/repositories/maven.snapshots/org/apache/maven/shared/maven-shared-monitor/1.0-SNAPSHOT/maven-shared-monitor-1.0-20090214.223152-845.jar
12K uploaded
[INFO] Retrieving previous metadata from apache.snapshots
[INFO] Uploading repository metadata for: 'artifact org.apache.maven.shared:maven-shared-monitor'
[INFO] Uploading project information for maven-shared-monitor 1.0-20090214.223152-845
[INFO] Retrieving previous metadata from apache.snapshots
[INFO] Uploading repository metadata for: 'snapshot org.apache.maven.shared:maven-shared-monitor:1.0-SNAPSHOT'
[INFO] ------------------------------------------------------------------------
[INFO] Building Maven Verifier Component
[INFO]    task-segment: [clean, deploy]
[INFO] ------------------------------------------------------------------------
[INFO] [clean:clean]
[INFO] Deleting file set: /home/hudson/workspace/maven-shared/jdk/1.5/label/ubuntu/trunk/maven-verifier/target
(included: [**], excluded: [])
[INFO] [remote-resources:process {execution: default}]
[INFO] [resources:resources]
[INFO] Using 'UTF-8' encoding to copy filtered resources.
[INFO] skip non existing resourceDirectory /home/hudson/workspace/maven-shared/jdk/1.5/label/ubuntu/trunk/maven-verifier/src/main/resources
[INFO] Copying 3 resources
[INFO] [compiler:compile]
[INFO] Compiling 22 source files to /home/hudson/workspace/maven-shared/jdk/1.5/label/ubuntu/trunk/maven-verifier/target/classes
[INFO] [resources:testResources]
[INFO] Using 'UTF-8' encoding to copy filtered resources.
[INFO] skip non existing resourceDirectory /home/hudson/workspace/maven-shared/jdk/1.5/label/ubuntu/trunk/maven-verifier/src/test/resources
[INFO] Copying 3 resources
[INFO] [compiler:testCompile]
[INFO] No sources to compile
[INFO] [surefire:test]
[INFO] Surefire report directory: /home/hudson/workspace/maven-shared/jdk/1.5/label/ubuntu/trunk/maven-verifier/target/surefire-reports

-------------------------------------------------------
 T E S T S
-------------------------------------------------------
There are no tests to run.

Results :

Tests run: 0, Failures: 0, Errors: 0, Skipped: 0

[INFO] [jar:jar]
[INFO] Building jar: /home/hudson/workspace/maven-shared/jdk/1.5/label/ubuntu/trunk/maven-verifier/target/maven-verifier-1.2-SNAPSHOT.jar
[INFO] [install:install]
[INFO] Installing /home/hudson/workspace/maven-shared/jdk/1.5/label/ubuntu/trunk/maven-verifier/target/maven-verifier-1.2-SNAPSHOT.jar
to /opt/repos/maven-shared/org/apache/maven/shared/maven-verifier/1.2-SNAPSHOT/maven-verifier-1.2-SNAPSHOT.jar
[INFO] [deploy:deploy]
[INFO] Retrieving previous build number from apache.snapshots
Uploading: http://repository.sonatype.org:8081/content/repositories/maven.snapshots/org/apache/maven/shared/maven-verifier/1.2-SNAPSHOT/maven-verifier-1.2-20090214.223152-789.jar
81K uploaded
[INFO] Uploading project information for maven-verifier 1.2-20090214.223152-789
[INFO] Retrieving previous metadata from apache.snapshots
[INFO] Uploading repository metadata for: 'artifact org.apache.maven.shared:maven-verifier'
[INFO] Retrieving previous metadata from apache.snapshots
[INFO] Uploading repository metadata for: 'snapshot org.apache.maven.shared:maven-verifier:1.2-SNAPSHOT'
[INFO] ------------------------------------------------------------------------
[INFO] Building Maven Shared Web UI tests
[INFO]    task-segment: [clean, deploy]
[INFO] ------------------------------------------------------------------------
[INFO] [clean:clean]
[INFO] Deleting file set: /home/hudson/workspace/maven-shared/jdk/1.5/label/ubuntu/trunk/maven-web-ui-tests/target
(included: [**], excluded: [])
[INFO] [remote-resources:process {execution: default}]
[INFO] [resources:resources]
[INFO] Using 'UTF-8' encoding to copy filtered resources.
[INFO] skip non existing resourceDirectory /home/hudson/workspace/maven-shared/jdk/1.5/label/ubuntu/trunk/maven-web-ui-tests/src/main/resources
[INFO] Copying 3 resources
[INFO] [compiler:compile]
[INFO] Compiling 2 source files to /home/hudson/workspace/maven-shared/jdk/1.5/label/ubuntu/trunk/maven-web-ui-tests/target/classes
[INFO] [resources:testResources]
[INFO] Using 'UTF-8' encoding to copy filtered resources.
[INFO] skip non existing resourceDirectory /home/hudson/workspace/maven-shared/jdk/1.5/label/ubuntu/trunk/maven-web-ui-tests/src/test/resources
[INFO] Copying 3 resources
[INFO] [compiler:testCompile]
[INFO] No sources to compile
[INFO] [surefire:test]
[INFO] Surefire report directory: /home/hudson/workspace/maven-shared/jdk/1.5/label/ubuntu/trunk/maven-web-ui-tests/target/surefire-reports

-------------------------------------------------------
 T E S T S
-------------------------------------------------------
There are no tests to run.

Results :

Tests run: 0, Failures: 0, Errors: 0, Skipped: 0

[INFO] [jar:jar]
[INFO] Building jar: /home/hudson/workspace/maven-shared/jdk/1.5/label/ubuntu/trunk/maven-web-ui-tests/target/maven-web-ui-tests-1.0-SNAPSHOT.jar
[INFO] [install:install]
[INFO] Installing /home/hudson/workspace/maven-shared/jdk/1.5/label/ubuntu/trunk/maven-web-ui-tests/target/maven-web-ui-tests-1.0-SNAPSHOT.jar
to /opt/repos/maven-shared/org/apache/maven/shared/maven-web-ui-tests/1.0-SNAPSHOT/maven-web-ui-tests-1.0-SNAPSHOT.jar
[INFO] [deploy:deploy]
[INFO] Retrieving previous build number from apache.snapshots
Uploading: http://repository.sonatype.org:8081/content/repositories/maven.snapshots/org/apache/maven/shared/maven-web-ui-tests/1.0-SNAPSHOT/maven-web-ui-tests-1.0-20090214.223152-867.jar
15K uploaded
[INFO] Uploading project information for maven-web-ui-tests 1.0-20090214.223152-867
[INFO] Retrieving previous metadata from apache.snapshots
[INFO] Uploading repository metadata for: 'snapshot org.apache.maven.shared:maven-web-ui-tests:1.0-SNAPSHOT'
[INFO] Retrieving previous metadata from apache.snapshots
[INFO] Uploading repository metadata for: 'artifact org.apache.maven.shared:maven-web-ui-tests'
[INFO] 
[INFO] 
[INFO] ------------------------------------------------------------------------
[INFO] Reactor Summary:
[INFO] ------------------------------------------------------------------------
[INFO] Maven Shared Components ............................... SUCCESS [5.484s]
[INFO] Maven Shared I/O API .................................. SUCCESS [6.198s]
[INFO] Maven File Management API ............................. SUCCESS [5.841s]
[INFO] Maven Ant ............................................. SUCCESS [3.087s]
[INFO] Maven Applications Shared Configuration ............... SUCCESS [2.280s]
[INFO] Maven Shared Application Configuration Model .......... SUCCESS [2.682s]
[INFO] Maven Shared Application Configuration Web Components . SUCCESS [6.386s]
[INFO] Maven Archiver ........................................ SUCCESS [8.253s]
[INFO] Maven Common Artifact Filters ......................... SUCCESS [5.452s]
[INFO] Maven Dependency Analyzer ............................. SUCCESS [21.859s]
[INFO] Maven Dependency Tree ................................. SUCCESS [5.547s]
[INFO] Maven Downloader ...................................... SUCCESS [2.765s]
[INFO] Maven Doxia Integration Tools ......................... SUCCESS [6.390s]
[INFO] Maven Filtering ....................................... FAILED [1.534s]
[INFO] Maven Invoker ......................................... SUCCESS [17.511s]
[INFO] Maven Model Converter ................................. SUCCESS [5.564s]
[INFO] Maven OSGi integration ................................ SUCCESS [4.974s]
[INFO] Maven Reporting Implementation ........................ SUCCESS [5.222s]
[INFO] Maven Repository Builder .............................. SUCCESS [5.827s]
[INFO] Maven Runtime ......................................... SUCCESS [26.974s]
[INFO] Maven Script Support Root ............................. SUCCESS [1.576s]
[INFO] Maven Ant Mojo Support ................................ SUCCESS [4.606s]
[INFO] Maven Beanshell Mojo Support .......................... SUCCESS [3.265s]
[INFO] Maven JAR Utilities ................................... SUCCESS [6.659s]
[INFO] Maven Shared Monitor API .............................. SUCCESS [2.835s]
[INFO] Maven Verifier Component .............................. SUCCESS [3.622s]
[INFO] Maven Shared Web UI tests ............................. SUCCESS [3.043s]
[INFO] ------------------------------------------------------------------------
[INFO] Error for project: Maven Filtering (during deploy)
[INFO] ------------------------------------------------------------------------
[INFO] Compilation failure

/home/hudson/workspace/maven-shared/jdk/1.5/label/ubuntu/trunk/maven-filtering/src/test/java/org/apache/maven/shared/filtering/IncrementalResourceFilteringTest.java:[18,50]
package org.sonatype.plexus.build.incremental.test does not exist

/home/hudson/workspace/maven-shared/jdk/1.5/label/ubuntu/trunk/maven-filtering/src/test/java/org/apache/maven/shared/filtering/IncrementalResourceFilteringTest.java:[52,8]
cannot find symbol
symbol  : class TestIncrementalBuildContext
location: class org.apache.maven.shared.filtering.IncrementalResourceFilteringTest

/home/hudson/workspace/maven-shared/jdk/1.5/label/ubuntu/trunk/maven-filtering/src/test/java/org/apache/maven/shared/filtering/IncrementalResourceFilteringTest.java:[52,46]
cannot find symbol
symbol  : class TestIncrementalBuildContext
location: class org.apache.maven.shared.filtering.IncrementalResourceFilteringTest

/home/hudson/workspace/maven-shared/jdk/1.5/label/ubuntu/trunk/maven-filtering/src/test/java/org/apache/maven/shared/filtering/IncrementalResourceFilteringTest.java:[65,18]
cannot find symbol
symbol  : class TestIncrementalBuildContext
location: class org.apache.maven.shared.filtering.IncrementalResourceFilteringTest

/home/hudson/workspace/maven-shared/jdk/1.5/label/ubuntu/trunk/maven-filtering/src/test/java/org/apache/maven/shared/filtering/IncrementalResourceFilteringTest.java:[85,8]
cannot find symbol
symbol  : class TestIncrementalBuildContext
location: class org.apache.maven.shared.filtering.IncrementalResourceFilteringTest

/home/hudson/workspace/maven-shared/jdk/1.5/label/ubuntu/trunk/maven-filtering/src/test/java/org/apache/maven/shared/filtering/IncrementalResourceFilteringTest.java:[85,46]
cannot find symbol
symbol  : class TestIncrementalBuildContext
location: class org.apache.maven.shared.filtering.IncrementalResourceFilteringTest

/home/hudson/workspace/maven-shared/jdk/1.5/label/ubuntu/trunk/maven-filtering/src/test/java/org/apache/maven/shared/filtering/IncrementalResourceFilteringTest.java:[106,8]
cannot find symbol
symbol  : class TestIncrementalBuildContext
location: class org.apache.maven.shared.filtering.IncrementalResourceFilteringTest

/home/hudson/workspace/maven-shared/jdk/1.5/label/ubuntu/trunk/maven-filtering/src/test/java/org/apache/maven/shared/filtering/IncrementalResourceFilteringTest.java:[106,46]
cannot find symbol
symbol  : class TestIncrementalBuildContext
location: class org.apache.maven.shared.filtering.IncrementalResourceFilteringTest


[INFO] ------------------------------------------------------------------------
[INFO] Trace
org.apache.maven.BuildFailureException: Compilation failure
	at org.apache.maven.lifecycle.DefaultLifecycleExecutor.executeGoals(DefaultLifecycleExecutor.java:697)
	at org.apache.maven.lifecycle.DefaultLifecycleExecutor.executeGoalWithLifecycle(DefaultLifecycleExecutor.java:538)
	at org.apache.maven.lifecycle.DefaultLifecycleExecutor.executeGoal(DefaultLifecycleExecutor.java:517)
	at org.apache.maven.lifecycle.DefaultLifecycleExecutor.executeGoalAndHandleFailures(DefaultLifecycleExecutor.java:369)
	at org.apache.maven.lifecycle.DefaultLifecycleExecutor.executeTaskSegments(DefaultLifecycleExecutor.java:330)
	at org.apache.maven.lifecycle.DefaultLifecycleExecutor.execute(DefaultLifecycleExecutor.java:181)
	at org.apache.maven.DefaultMaven.doExecute(DefaultMaven.java:336)
	at org.apache.maven.DefaultMaven.execute(DefaultMaven.java:129)
	at org.apache.maven.cli.MavenCli.main(MavenCli.java:302)
	at sun.reflect.NativeMethodAccessorImpl.invoke0(Native Method)
	at sun.reflect.NativeMethodAccessorImpl.invoke(NativeMethodAccessorImpl.java:39)
	at sun.reflect.DelegatingMethodAccessorImpl.invoke(DelegatingMethodAccessorImpl.java:25)
	at java.lang.reflect.Method.invoke(Method.java:585)
	at org.codehaus.classworlds.Launcher.launchEnhanced(Launcher.java:315)
	at org.codehaus.classworlds.Launcher.launch(Launcher.java:255)
	at org.codehaus.classworlds.Launcher.mainWithExitCode(Launcher.java:430)
	at org.codehaus.classworlds.Launcher.main(Launcher.java:375)
Caused by: org.apache.maven.plugin.CompilationFailureException: Compilation failure
	at org.apache.maven.plugin.AbstractCompilerMojo.execute(AbstractCompilerMojo.java:516)
	at org.apache.maven.plugin.TestCompilerMojo.execute(TestCompilerMojo.java:102)
	at org.apache.maven.plugin.DefaultPluginManager.executeMojo(DefaultPluginManager.java:458)
	at org.apache.maven.lifecycle.DefaultLifecycleExecutor.executeGoals(DefaultLifecycleExecutor.java:676)
	... 16 more
[INFO] ------------------------------------------------------------------------
[INFO] BUILD ERRORS
[INFO] ------------------------------------------------------------------------
[INFO] Total time: 2 minutes 58 seconds
[INFO] Finished at: Sat Feb 14 16:34:44 GMT-06:00 2009
[INFO] Final Memory: 51M/96M
[INFO] ------------------------------------------------------------------------


Mime
View raw message