maven-notifications mailing list archives

Site index · List index
Message view « Date » · « Thread »
Top « Date » · « Thread »
From Hudson <Hud...@sonatype.org>
Subject Build failed in Hudson: Maven-2.1.x-bootstrap » 1.4,windows #114
Date Fri, 27 Feb 2009 21:08:48 GMT
See http://grid.sonatype.org/ci/job/Maven-2.1.x-bootstrap/./jdk=1.4,label=windows/114/changes

------------------------------------------
[...truncated 2352 lines...]
     [java] Downloading: http://repository.sonatype.org:8081/content/groups/public/org/apache/maven/maven-project/2.0.4/maven-project-2.0.4.pom
     [java] 
     [java] Downloading: http://repository.sonatype.org:8081/content/groups/public/org/apache/maven/maven-settings/2.0.4/maven-settings-2.0.4.pom
     [java] 
     [java] Downloading: http://repository.sonatype.org:8081/content/groups/public/org/apache/maven/maven-model/2.0.4/maven-model-2.0.4.pom
     [java] 
     [java] Downloading: http://repository.sonatype.org:8081/content/groups/public/org/apache/maven/maven-profile/2.0.4/maven-profile-2.0.4.pom
     [java] 
     [java] Downloading: http://repository.sonatype.org:8081/content/groups/public/org/apache/maven/maven-artifact-manager/2.0.4/maven-artifact-manager-2.0.4.pom
     [java] 1K downloaded  (maven-artifact-manager-2.0.4.pom)
     [java] Downloading: http://repository.sonatype.org:8081/content/groups/public/org/apache/maven/maven-repository-metadata/2.0.4/maven-repository-metadata-2.0.4.pom
     [java] 
     [java] Downloading: http://repository.sonatype.org:8081/content/groups/public/org/apache/maven/maven-artifact/2.0.4/maven-artifact-2.0.4.pom
     [java] 
     [java] Downloading: http://repository.sonatype.org:8081/content/groups/public/org/apache/maven/maven-core/2.0.4/maven-core-2.0.4.pom
     [java] 
     [java] Downloading: http://repository.sonatype.org:8081/content/groups/public/org/apache/maven/wagon/wagon-file/1.0-alpha-7/wagon-file-1.0-alpha-7.pom
     [java] 
     [java] Downloading: http://repository.sonatype.org:8081/content/groups/public/org/apache/maven/wagon/wagon-providers/1.0-alpha-6/wagon-providers-1.0-alpha-6.pom
     [java] 
     [java] Downloading: http://repository.sonatype.org:8081/content/groups/public/org/apache/maven/maven-plugin-parameter-documenter/2.0.4/maven-plugin-parameter-documenter-2.0.4.pom
     [java] 
     [java] Downloading: http://repository.sonatype.org:8081/content/groups/public/org/apache/maven/wagon/wagon-http-lightweight/1.0-alpha-6/wagon-http-lightweight-1.0-alpha-6.pom
     [java] 
     [java] Downloading: http://repository.sonatype.org:8081/content/groups/public/org/apache/maven/reporting/maven-reporting-api/2.0.4/maven-reporting-api-2.0.4.pom
     [java] 
     [java] Downloading: http://repository.sonatype.org:8081/content/groups/public/org/apache/maven/reporting/maven-reporting/2.0.4/maven-reporting-2.0.4.pom
     [java] 
     [java] Downloading: http://repository.sonatype.org:8081/content/groups/public/org/apache/maven/maven-error-diagnostics/2.0.4/maven-error-diagnostics-2.0.4.pom
     [java] 
     [java] Downloading: http://repository.sonatype.org:8081/content/groups/public/org/apache/maven/maven-plugin-registry/2.0.4/maven-plugin-registry-2.0.4.pom
     [java] 
     [java] Downloading: http://repository.sonatype.org:8081/content/groups/public/org/apache/maven/wagon/wagon-ssh-external/1.0-alpha-6/wagon-ssh-external-1.0-alpha-6.pom
     [java] 
     [java] Downloading: http://repository.sonatype.org:8081/content/groups/public/org/apache/maven/maven-plugin-descriptor/2.0.4/maven-plugin-descriptor-2.0.4.pom
     [java] 
     [java] Downloading: http://repository.sonatype.org:8081/content/groups/public/org/apache/maven/maven-monitor/2.0.4/maven-monitor-2.0.4.pom
     [java] 
     [java] Downloading: http://repository.sonatype.org:8081/content/groups/public/org/apache/maven/wagon/wagon-ssh/1.0-alpha-7/wagon-ssh-1.0-alpha-7.pom
     [java] 
     [java] Downloading: http://repository.sonatype.org:8081/content/groups/public/com/jcraft/jsch/0.1.24/jsch-0.1.24.pom
     [java] 
     [java] Downloading: http://repository.sonatype.org:8081/content/groups/public/org/apache/maven/maven-archiver/2.0.4/maven-archiver-2.0.4.pom
     [java] 
     [java] Downloading: http://repository.sonatype.org:8081/content/groups/public/org/codehaus/plexus/plexus-archiver/1.0-alpha-4/plexus-archiver-1.0-alpha-4.pom
     [java] 
     [java] Downloading: http://repository.sonatype.org:8081/content/groups/public/org/codehaus/plexus/plexus-archiver/1.0-alpha-6/plexus-archiver-1.0-alpha-6.pom
     [java] 
     [java] Downloading: http://repository.sonatype.org:8081/content/groups/public/org/apache/maven/maven-archiver/2.0.4/maven-archiver-2.0.4.jar
     [java] Downloading: http://repository.sonatype.org:8081/content/groups/public/org/codehaus/plexus/plexus-archiver/1.0-alpha-6/plexus-archiver-1.0-alpha-6.jar
     [java] 9K downloaded  (maven-archiver-2.0.4.jar)
     [java] 131K downloaded  (plexus-archiver-1.0-alpha-6.jar)
     [java] Downloading: http://repository.sonatype.org:8081/content/groups/public/org/apache/maven/maven-plugin-api/2.0.4/maven-plugin-api-2.0.4.jar
     [java] 8K downloaded  (maven-plugin-api-2.0.4.jar)
     [java] Downloading: http://repository.sonatype.org:8081/content/groups/public/org/apache/maven/maven-project/2.0.4/maven-project-2.0.4.jar
     [java] 106K downloaded  (maven-project-2.0.4.jar)
     [java] Downloading: http://repository.sonatype.org:8081/content/groups/public/org/apache/maven/maven-core/2.0.4/maven-core-2.0.4.jar
     [java] 133K downloaded  (maven-core-2.0.4.jar)
     [java] Downloading: http://repository.sonatype.org:8081/content/groups/public/org/apache/maven/maven-artifact/2.0.4/maven-artifact-2.0.4.jar
     [java] 78K downloaded  (maven-artifact-2.0.4.jar)
     [java] [INFO] [assembly:single {execution: bin-assembly}]
     [java] [INFO] Building tar : C:\home\hudson\workspace\Maven-2.1.x-bootstrap\jdk\1.4\label\windows\maven-2.1.x\apache-maven\target\apache-maven-2.1.0-SNAPSHOT-bin.tar.gz
     [java] [INFO] Building tar : C:\home\hudson\workspace\Maven-2.1.x-bootstrap\jdk\1.4\label\windows\maven-2.1.x\apache-maven\target\apache-maven-2.1.0-SNAPSHOT-bin.tar.bz2
     [java] [INFO] Building zip: C:\home\hudson\workspace\Maven-2.1.x-bootstrap\jdk\1.4\label\windows\maven-2.1.x\apache-maven\target\apache-maven-2.1.0-SNAPSHOT-bin.zip
     [java] [INFO] [install:install]
     [java] [INFO] Installing C:\home\hudson\workspace\Maven-2.1.x-bootstrap\jdk\1.4\label\windows\maven-2.1.x\apache-maven\target\apache-maven-2.1.0-SNAPSHOT.jar
to C:\opt\repos\bootstrap-maven-2.1.x\org\apache\maven\apache-maven\2.1.0-SNAPSHOT\apache-maven-2.1.0-SNAPSHOT.jar
     [java] [INFO] Installing C:\home\hudson\workspace\Maven-2.1.x-bootstrap\jdk\1.4\label\windows\maven-2.1.x\apache-maven\target\apache-maven-2.1.0-SNAPSHOT-bin.tar.gz
to C:\opt\repos\bootstrap-maven-2.1.x\org\apache\maven\apache-maven\2.1.0-SNAPSHOT\apache-maven-2.1.0-SNAPSHOT-bin.tar.gz
     [java] [INFO] Installing C:\home\hudson\workspace\Maven-2.1.x-bootstrap\jdk\1.4\label\windows\maven-2.1.x\apache-maven\target\apache-maven-2.1.0-SNAPSHOT-bin.tar.bz2
to C:\opt\repos\bootstrap-maven-2.1.x\org\apache\maven\apache-maven\2.1.0-SNAPSHOT\apache-maven-2.1.0-SNAPSHOT-bin.tar.bz2
     [java] [INFO] Installing C:\home\hudson\workspace\Maven-2.1.x-bootstrap\jdk\1.4\label\windows\maven-2.1.x\apache-maven\target\apache-maven-2.1.0-SNAPSHOT-bin.zip
to C:\opt\repos\bootstrap-maven-2.1.x\org\apache\maven\apache-maven\2.1.0-SNAPSHOT\apache-maven-2.1.0-SNAPSHOT-bin.zip
     [java] [INFO] 
     [java] [INFO] 
     [java] [INFO] ------------------------------------------------------------------------
     [java] [INFO] Reactor Summary:
     [java] [INFO] ------------------------------------------------------------------------
     [java] [INFO] Maven ................................................. SUCCESS [9.453s]
     [java] [INFO] Maven Artifact ........................................ SUCCESS [13.297s]
     [java] [INFO] Maven Repository Metadata Model ....................... SUCCESS [3.703s]
     [java] [INFO] Maven Artifact Manager ................................ SUCCESS [12.078s]
     [java] [INFO] Maven Model ........................................... SUCCESS [6.219s]
     [java] [INFO] Maven Local Settings Model ............................ SUCCESS [4.031s]
     [java] [INFO] Maven Artifact Test Helper Library .................... SUCCESS [1.250s]
     [java] [INFO] Maven Plugin Parameter Documenter API ................. SUCCESS [1.984s]
     [java] [INFO] Maven Reporting ....................................... SUCCESS [0.266s]
     [java] [INFO] Maven Reporting API ................................... SUCCESS [1.500s]
     [java] [INFO] Maven Profile Model ................................... SUCCESS [2.172s]
     [java] [INFO] Maven Error Diagnostics ............................... SUCCESS [1.281s]
     [java] [INFO] Maven Plugin Registry Model ........................... SUCCESS [2.844s]
     [java] [INFO] Maven Project Builder ................................. SUCCESS [17.016s]
     [java] [INFO] Maven Plugin API ...................................... SUCCESS [0.875s]
     [java] [INFO] Maven Plugin Descriptor Model ......................... SUCCESS [1.765s]
     [java] [INFO] Maven Monitor ......................................... SUCCESS [0.922s]
     [java] [INFO] Maven Core ............................................ SUCCESS [9.391s]
     [java] [INFO] Maven Script Support Root ............................. SUCCESS [0.062s]
     [java] [INFO] Maven Ant Mojo Support ................................ SUCCESS [3.781s]
     [java] [INFO] Maven Beanshell Mojo Support .......................... SUCCESS [1.079s]
     [java] [INFO] Maven Toolchains ...................................... SUCCESS [4.515s]
     [java] [INFO] Maven Distribution .................................... SUCCESS [17.485s]
     [java] [INFO] ------------------------------------------------------------------------
     [java] [INFO] ------------------------------------------------------------------------
     [java] [INFO] BUILD SUCCESSFUL
     [java] [INFO] ------------------------------------------------------------------------
     [java] [INFO] Total time: 2 minutes 
     [java] [INFO] Finished at: Fri Feb 27 13:08:33 PST 2009
     [java] [INFO] Final Memory: 42M/77M
     [java] [INFO] ------------------------------------------------------------------------

maven-assembly:
     [echo] 
     [echo]     The new Maven distribution was created as part of the MAVEN-COMPILE step,
above.
     [echo]     This goal just validates the presence of that distribution.
     [echo]     

extract-assembly:
     [echo] Extracting assembly to C:\tmp ...
   [delete] Deleting directory C:\tmp\apache-maven-2.1.0-SNAPSHOT
    [mkdir] Created dir: C:\tmp\apache-maven-2.1.0-SNAPSHOT
    [unzip] Expanding: C:\home\hudson\workspace\Maven-2.1.x-bootstrap\jdk\1.4\label\windows\maven-2.1.x\apache-maven\target\apache-maven-2.1.0-SNAPSHOT-bin.zip
into C:\tmp

all:

its-setup:

its-win32:
     [echo] Retrieving integration tests
     [exec] + Error stacktraces are turned on.
     [exec] [INFO] Scanning for projects...
     [exec] [INFO] ------------------------------------------------------------------------
     [exec] [INFO] Building Maven Integration-Test Importer
     [exec] [INFO]    task-segment: [process-resources]
     [exec] [INFO] ------------------------------------------------------------------------
     [exec] Downloading: http://repository.sonatype.org:8081/content/groups/public/org/apache/maven/plugins/maven-scm-plugin/1.1/maven-scm-plugin-1.1.pom
     [exec] [WARNING] Unable to get resource 'org.apache.maven.plugins:maven-scm-plugin:pom:1.1'
from repository central (http://Nexus): Error transferring file: Connection refused: connect
     [exec] Downloading: http://repository.sonatype.org:8081/content/groups/nexus-staging/org/apache/maven/plugins/maven-scm-plugin/1.1/maven-scm-plugin-1.1.pom
     [exec] [WARNING] Unable to get resource 'org.apache.maven.plugins:maven-scm-plugin:pom:1.1'
from repository nexus-staging (http://repository.sonatype.org:8081/content/groups/nexus-staging):
Error transferring file: Connection refused: connect
     [exec] Downloading: http://repository.sonatype.org:8081/content/groups/nexus-plugins-with-staging/org/apache/maven/plugins/maven-scm-plugin/1.1/maven-scm-plugin-1.1.pom
     [exec] [WARNING] Unable to get resource 'org.apache.maven.plugins:maven-scm-plugin:pom:1.1'
from repository nexus-plugins-staging (http://repository.sonatype.org:8081/content/groups/nexus-plugins-with-staging):
Error transferring file: Connection refused: connect
     [exec] Downloading: http://repository.sonatype.org:8081/content/groups/public/org/apache/maven/plugins/maven-scm-plugin/1.1/maven-scm-plugin-1.1.pom
     [exec] [WARNING] Unable to get resource 'org.apache.maven.plugins:maven-scm-plugin:pom:1.1'
from repository central (http://Nexus): Error transferring file: Connection refused: connect
     [exec] Downloading: http://repository.sonatype.org:8081/content/groups/nexus-staging/org/apache/maven/plugins/maven-scm-plugin/1.1/maven-scm-plugin-1.1.pom
     [exec] [WARNING] Unable to get resource 'org.apache.maven.plugins:maven-scm-plugin:pom:1.1'
from repository nexus-staging (http://repository.sonatype.org:8081/content/groups/nexus-staging):
Error transferring file: Connection refused: connect
     [exec] Downloading: http://repository.sonatype.org:8081/content/groups/nexus-plugins-with-staging/org/apache/maven/plugins/maven-scm-plugin/1.1/maven-scm-plugin-1.1.pom
     [exec] [WARNING] Unable to get resource 'org.apache.maven.plugins:maven-scm-plugin:pom:1.1'
from repository nexus-plugins-staging (http://repository.sonatype.org:8081/content/groups/nexus-plugins-with-staging):
Error transferring file: Connection refused: connect
     [exec] [INFO] ------------------------------------------------------------------------
     [exec] [ERROR] BUILD ERROR
     [exec] [INFO] ------------------------------------------------------------------------
     [exec] [INFO] Failed to resolve artifact.
     [exec] 
     [exec] GroupId: org.apache.maven.plugins
     [exec] ArtifactId: maven-scm-plugin
     [exec] Version: 1.1
     [exec] 
     [exec] Reason: Unable to download the artifact from any repository
     [exec] 
     [exec]   org.apache.maven.plugins:maven-scm-plugin:pom:1.1
     [exec] 
     [exec] from the specified remote repositories:
     [exec]   nexus-plugins-staging (http://repository.sonatype.org:8081/content/groups/nexus-plugins-with-staging),
     [exec]   Nexus (http://repository.sonatype.org:8081/content/groups/public),
     [exec]   nexus-staging (http://repository.sonatype.org:8081/content/groups/nexus-staging)
     [exec] 
     [exec] 
     [exec] 
     [exec] [INFO] ------------------------------------------------------------------------
     [exec] [INFO] Trace
     [exec] org.apache.maven.lifecycle.LifecycleExecutionException: Unable to build project
for plugin 'org.apache.maven.plugins:maven-scm-plugin': POM 'org.apache.maven.plugins:maven-scm-plugin'
not found in repository: Unable to download the artifact from any repository
     [exec] 
     [exec]   org.apache.maven.plugins:maven-scm-plugin:pom:1.1
     [exec] 
     [exec] from the specified remote repositories:
     [exec]   nexus-plugins-staging (http://repository.sonatype.org:8081/content/groups/nexus-plugins-with-staging),
     [exec]   Nexus (http://repository.sonatype.org:8081/content/groups/public),
     [exec]   nexus-staging (http://repository.sonatype.org:8081/content/groups/nexus-staging)
     [exec] 
     [exec]  for project org.apache.maven.plugins:maven-scm-plugin
     [exec] 	at org.apache.maven.lifecycle.DefaultLifecycleExecutor.verifyPlugin(DefaultLifecycleExecutor.java:1531)
     [exec] 	at org.apache.maven.lifecycle.DefaultLifecycleExecutor.bindPluginToLifecycle(DefaultLifecycleExecutor.java:1478)
     [exec] 	at org.apache.maven.lifecycle.DefaultLifecycleExecutor.constructLifecycleMappings(DefaultLifecycleExecutor.java:1244)
     [exec] 	at org.apache.maven.lifecycle.DefaultLifecycleExecutor.executeGoal(DefaultLifecycleExecutor.java:517)
     [exec] 	at org.apache.maven.lifecycle.DefaultLifecycleExecutor.executeGoalAndHandleFailures(DefaultLifecycleExecutor.java:370)
     [exec] 	at org.apache.maven.lifecycle.DefaultLifecycleExecutor.executeTaskSegments(DefaultLifecycleExecutor.java:331)
     [exec] 	at org.apache.maven.lifecycle.DefaultLifecycleExecutor.execute(DefaultLifecycleExecutor.java:181)
     [exec] 	at org.apache.maven.DefaultMaven.doExecute(DefaultMaven.java:346)
     [exec] 	at org.apache.maven.DefaultMaven.execute(DefaultMaven.java:133)
     [exec] 	at org.apache.maven.cli.MavenCli.main(MavenCli.java:356)
     [exec] 	at sun.reflect.NativeMethodAccessorImpl.invoke0(Native Method)
     [exec] 	at sun.reflect.NativeMethodAccessorImpl.invoke(NativeMethodAccessorImpl.java:39)
     [exec] 	at sun.reflect.DelegatingMethodAccessorImpl.invoke(DelegatingMethodAccessorImpl.java:25)
     [exec] 	at java.lang.reflect.Method.invoke(Method.java:324)
     [exec] 	at org.codehaus.classworlds.Launcher.launchEnhanced(Launcher.java:315)
     [exec] 	at org.codehaus.classworlds.Launcher.launch(Launcher.java:255)
     [exec] 	at org.codehaus.classworlds.Launcher.mainWithExitCode(Launcher.java:430)
     [exec] 	at org.codehaus.classworlds.Launcher.main(Launcher.java:375)
     [exec] Caused by: org.apache.maven.plugin.InvalidPluginException: Unable to build project
for plugin 'org.apache.maven.plugins:maven-scm-plugin': POM 'org.apache.maven.plugins:maven-scm-plugin'
not found in repository: Unable to download the artifact from any repository
     [exec] 
     [exec]   org.apache.maven.plugins:maven-scm-plugin:pom:1.1
     [exec] 
     [exec] from the specified remote repositories:
     [exec]   nexus-plugins-staging (http://repository.sonatype.org:8081/content/groups/nexus-plugins-with-staging),
     [exec]   Nexus (http://repository.sonatype.org:8081/content/groups/public),
     [exec]   nexus-staging (http://repository.sonatype.org:8081/content/groups/nexus-staging)
     [exec] 
     [exec]  for project org.apache.maven.plugins:maven-scm-plugin
     [exec] 	at org.apache.maven.plugin.DefaultPluginManager.checkRequiredMavenVersion(DefaultPluginManager.java:282)
     [exec] 	at org.apache.maven.plugin.DefaultPluginManager.verifyVersionedPlugin(DefaultPluginManager.java:196)
     [exec] 	at org.apache.maven.plugin.DefaultPluginManager.verifyPlugin(DefaultPluginManager.java:175)
     [exec] 	at org.apache.maven.lifecycle.DefaultLifecycleExecutor.verifyPlugin(DefaultLifecycleExecutor.java:1514)
     [exec] 	... 17 more
     [exec] Caused by: org.apache.maven.project.ProjectBuildingException: POM 'org.apache.maven.plugins:maven-scm-plugin'
not found in repository: Unable to download the artifact from any repository
     [exec] 
     [exec]   org.apache.maven.plugins:maven-scm-plugin:pom:1.1
     [exec] 
     [exec] from the specified remote repositories:
     [exec]   nexus-plugins-staging (http://repository.sonatype.org:8081/content/groups/nexus-plugins-with-staging),
     [exec]   Nexus (http://repository.sonatype.org:8081/content/groups/public),
     [exec]   nexus-staging (http://repository.sonatype.org:8081/content/groups/nexus-staging)
     [exec] 
     [exec]  for project org.apache.maven.plugins:maven-scm-plugin
     [exec] 	at org.apache.maven.project.DefaultMavenProjectBuilder.findModelFromRepository(DefaultMavenProjectBuilder.java:605)
     [exec] 	at org.apache.maven.project.DefaultMavenProjectBuilder.buildFromRepository(DefaultMavenProjectBuilder.java:251)
     [exec] 	at org.apache.maven.plugin.DefaultPluginManager.checkRequiredMavenVersion(DefaultPluginManager.java:266)
     [exec] 	... 20 more
     [exec] Caused by: org.apache.maven.artifact.resolver.ArtifactNotFoundException: Unable
to download the artifact from any repository
     [exec] 
     [exec]   org.apache.maven.plugins:maven-scm-plugin:pom:1.1
     [exec] 
     [exec] from the specified remote repositories:
     [exec]   nexus-plugins-staging (http://repository.sonatype.org:8081/content/groups/nexus-plugins-with-staging),
     [exec]   Nexus (http://repository.sonatype.org:8081/content/groups/public),
     [exec]   nexus-staging (http://repository.sonatype.org:8081/content/groups/nexus-staging)
     [exec] 
     [exec] 
     [exec] 	at org.apache.maven.artifact.resolver.DefaultArtifactResolver.resolve(DefaultArtifactResolver.java:228)
     [exec] 	at org.apache.maven.artifact.resolver.DefaultArtifactResolver.resolve(DefaultArtifactResolver.java:90)
     [exec] 	at org.apache.maven.project.DefaultMavenProjectBuilder.findModelFromRepository(DefaultMavenProjectBuilder.java:558)
     [exec] 	... 22 more
     [exec] Caused by: org.apache.maven.wagon.ResourceDoesNotExistException: Unable to download
the artifact from any repository
     [exec] 	at org.apache.maven.artifact.manager.DefaultWagonManager.getArtifact(DefaultWagonManager.java:349)
     [exec] 	at org.apache.maven.artifact.resolver.DefaultArtifactResolver.resolve(DefaultArtifactResolver.java:216)
     [exec] 	... 24 more
     [exec] [INFO] ------------------------------------------------------------------------
     [exec] [INFO] Total time: 6 seconds
     [exec] [INFO] Finished at: Fri Feb 27 13:08:41 PST 2009
     [exec] [INFO] Final Memory: 1M/4M
     [exec] [INFO] ------------------------------------------------------------------------

BUILD FAILED
C:\home\hudson\workspace\Maven-2.1.x-bootstrap\jdk\1.4\label\windows\maven-2.1.x\build.xml:238:
exec returned: 1

Total time: 3 minutes 16 seconds


Mime
View raw message