maven-notifications mailing list archives

Site index · List index
Message view « Date » · « Thread »
Top « Date » · « Thread »
From Apache Hudson Server <hud...@hudson.zones.apache.org>
Subject Build failed in Hudson: Maven-3.0.x-with-bootstrap #338
Date Sun, 22 Feb 2009 21:22:50 GMT
See http://hudson.zones.apache.org/hudson/job/Maven-3.0.x-with-bootstrap/338/changes

Changes:

[bentmann] o Partly reverted r746431 to restore backward-compat with plugins like Surefire
that access this field directly for manual container lookups

[bentmann] o Fixed dependency resolution (the dependency artifacts are cached so we can't
employ the scope filter here)

------------------------------------------
[...truncated 1492 lines...]
     [java] [INFO] [surefire:test]
     [java] [INFO] Surefire report directory: /zonestorage/hudson/home/hudson/hudson/jobs/Maven-3.0.x-with-bootstrap/workspace/trunk/maven-embedder/target/embedder-test-project-caching/target/surefire-reports
     [java] 
     [java] -------------------------------------------------------
     [java]  T E S T S
     [java] -------------------------------------------------------
     [java] Running org.apache.maven.AppTest
     [java] Tests run: 1, Failures: 0, Errors: 0, Skipped: 0, Time elapsed: 0.027 sec
     [java] 
     [java] Results :
     [java] Tests run: 1, Failures: 0, Errors: 0, Skipped: 0
     [java] 
     [java] [INFO] [jar:jar]
     [java] [INFO] Building jar: /zonestorage/hudson/home/hudson/hudson/jobs/Maven-3.0.x-with-bootstrap/workspace/trunk/maven-embedder/target/embedder-test-project-caching/target/embedder-test-project-1.0-SNAPSHOT.jar
     [java] [INFO] Scanning for projects...
     [java] [INFO] ------------------------------------------------------------------------
     [java] [INFO] Building Maven Quick Start Archetype
     [java] [INFO] 
     [java] [INFO] Id: org.apache.maven:embedder-test-project:jar:1.0-SNAPSHOT
     [java] [INFO] task-segment: [package]
     [java] [INFO] ------------------------------------------------------------------------
     [java] [INFO] [resources:resources]
     [java] [INFO] Using default encoding to copy filtered resources.
     [java] [INFO] [compiler:compile]
     [java] [INFO] Nothing to compile - all classes are up to date
     [java] [INFO] [resources:testResources]
     [java] [INFO] Using default encoding to copy filtered resources.
     [java] [INFO] [compiler:testCompile]
     [java] [INFO] Nothing to compile - all classes are up to date
     [java] [INFO] [surefire:test]
     [java] [INFO] Surefire report directory: /zonestorage/hudson/home/hudson/hudson/jobs/Maven-3.0.x-with-bootstrap/workspace/trunk/maven-embedder/target/embedder-test-project-caching/target/surefire-reports
     [java] 
     [java] -------------------------------------------------------
     [java]  T E S T S
     [java] -------------------------------------------------------
     [java] Running org.apache.maven.AppTest
     [java] Tests run: 1, Failures: 0, Errors: 0, Skipped: 0, Time elapsed: 0.067 sec
     [java] 
     [java] Results :
     [java] 
     [java] Tests run: 1, Failures: 0, Errors: 0, Skipped: 0
     [java] 
     [java] [INFO] [jar:jar]
     [java] Tests run: 17, Failures: 0, Errors: 0, Skipped: 0, Time elapsed: 12.745 sec
     [java] Running org.apache.maven.cli.CLIRequestUtilsTest
     [java] key=value
     [java] []
     [java] Tests run: 2, Failures: 0, Errors: 0, Skipped: 0, Time elapsed: 0.175 sec
     [java] 
     [java] Results :
     [java] 
     [java] Tests run: 58, Failures: 0, Errors: 0, Skipped: 0
     [java] 
     [java] [INFO] [jar:jar]
     [java] [INFO] Building jar: /zonestorage/hudson/home/hudson/hudson/jobs/Maven-3.0.x-with-bootstrap/workspace/trunk/maven-embedder/target/maven-embedder-3.0-SNAPSHOT.jar
     [java] [INFO] [install:install]
     [java] [INFO] Installing /zonestorage/hudson/home/hudson/hudson/jobs/Maven-3.0.x-with-bootstrap/workspace/trunk/maven-embedder/target/maven-embedder-3.0-SNAPSHOT.jar
to /export/home/hudson/.m2/repository/org/apache/maven/maven-embedder/3.0-SNAPSHOT/maven-embedder-3.0-SNAPSHOT.jar
     [java] [INFO] ------------------------------------------------------------------------
     [java] [INFO] Building Maven Distribution
     [java] [INFO] 
     [java] [INFO] Id: org.apache.maven:apache-maven:jar:3.0-SNAPSHOT
     [java] [INFO] task-segment: [clean, install]
     [java] [INFO] ------------------------------------------------------------------------
     [java] [INFO] [clean:clean]
     [java] [INFO] Deleting file set: /zonestorage/hudson/home/hudson/hudson/jobs/Maven-3.0.x-with-bootstrap/workspace/trunk/apache-maven/target
(included: [**], excluded: [])
     [java] [INFO] snapshot org.apache.maven:maven-embedder:3.0-SNAPSHOT: checking for updates
from apache.snapshots
     [java] [INFO] 
     [java] [INFO] 
     [java] [INFO] ------------------------------------------------------------------------
     [java] [INFO] Reactor Summary:
     [java] [INFO] ------------------------------------------------------------------------
     [java] [INFO] Apache Maven .......................................... SUCCESS [7.939s]
     [java] [INFO] Maven Lifecycle Model ................................. SUCCESS [10.555s]
     [java] [INFO] Maven Reporting API ................................... SUCCESS [4.387s]
     [java] [INFO] Maven Model ........................................... SUCCESS [8.522s]
     [java] [INFO] Maven Compat .......................................... SUCCESS [20.514s]
     [java] [INFO] Maven Plugin API ...................................... SUCCESS [7.811s]
     [java] [INFO] Maven Project Builder ................................. SUCCESS [7.660s]
     [java] [INFO] Maven Mercury ......................................... SUCCESS [9.226s]
     [java] [INFO] Maven Project ......................................... SUCCESS [40.021s]
     [java] [INFO] Maven Core ............................................ SUCCESS [45.804s]
     [java] [INFO] Maven Toolchains ...................................... SUCCESS [8.054s]
     [java] [INFO] Maven Embedder ........................................ SUCCESS [1:02.665s]
     [java] [INFO] Maven Distribution .................................... FAILED [8.448s]
     [java] [INFO] ------------------------------------------------------------------------
     [java] [ERROR] 
     [java] Missing:
     [java] ----------
     [java] 1) org.apache.maven.mercury:mercury-repo-remote-m2:jar:1.0.0-alpha-4-SNAPSHOT
     [java] 
     [java]   Try downloading the file manually from the project website.
     [java] 
     [java]   Then, install it using the command: 
     [java]       mvn install:install-file -DgroupId=org.apache.maven.mercury -DartifactId=mercury-repo-remote-m2
-Dversion=1.0.0-alpha-4-SNAPSHOT -Dpackaging=jar -Dfile=/path/to/file
     [java] 
     [java]   Alternatively, if you host your own repository you can deploy the file there:

     [java]       mvn deploy:deploy-file -DgroupId=org.apache.maven.mercury -DartifactId=mercury-repo-remote-m2
-Dversion=1.0.0-alpha-4-SNAPSHOT -Dpackaging=jar -Dfile=/path/to/file -Durl=[url] -DrepositoryId=[id]
     [java] 
     [java]   Path to dependency: 
     [java]   	1) org.apache.maven:apache-maven:jar:3.0-SNAPSHOT
     [java]   	2) org.sonatype.mercury:mercury-mp3-cli:jar:1.0-alpha-1
     [java]   	3) org.apache.maven.mercury:mercury-repo-remote-m2:jar:1.0.0-alpha-4-SNAPSHOT
     [java] 
     [java] 2) org.apache.maven.mercury:mercury-repo-local-m2:jar:1.0.0-alpha-4-SNAPSHOT
     [java] 
     [java]   Try downloading the file manually from the project website.
     [java] 
     [java]   Then, install it using the command: 
     [java]       mvn install:install-file -DgroupId=org.apache.maven.mercury -DartifactId=mercury-repo-local-m2
-Dversion=1.0.0-alpha-4-SNAPSHOT -Dpackaging=jar -Dfile=/path/to/file
     [java] 
     [java]   Alternatively, if you host your own repository you can deploy the file there:

     [java]       mvn deploy:deploy-file -DgroupId=org.apache.maven.mercury -DartifactId=mercury-repo-local-m2
-Dversion=1.0.0-alpha-4-SNAPSHOT -Dpackaging=jar -Dfile=/path/to/file -Durl=[url] -DrepositoryId=[id]
     [java] 
     [java]   Path to dependency: 
     [java]   	1) org.apache.maven:apache-maven:jar:3.0-SNAPSHOT
     [java]   	2) org.sonatype.mercury:mercury-mp3-cli:jar:1.0-alpha-1
     [java]   	3) org.apache.maven.mercury:mercury-repo-local-m2:jar:1.0.0-alpha-4-SNAPSHOT
     [java] 
     [java] ----------
     [java] 2 required artifacts are missing.
     [java] 
     [java] for artifact: 
     [java]   org.apache.maven:apache-maven:jar:3.0-SNAPSHOT
     [java] 
     [java] from the specified remote repositories:
     [java]   central (http://repo1.maven.org/maven2),
     [java]   apache.snapshots (http://repository.apache.org/snapshots)
     [java] 
     [java] 
     [java] While building project with id: org.apache.maven:apache-maven:jar:3.0-SNAPSHOT
     [java] Project File: /zonestorage/hudson/home/hudson/hudson/jobs/Maven-3.0.x-with-bootstrap/workspace/trunk/apache-maven/pom.xml
     [java] 
     [java] Error stacktrace:
     [java] org.apache.maven.lifecycle.LifecycleExecutionException: Missing:
     [java] ----------
     [java] 1) org.apache.maven.mercury:mercury-repo-remote-m2:jar:1.0.0-alpha-4-SNAPSHOT
     [java] 
     [java]   Try downloading the file manually from the project website.
     [java] 
     [java]   Then, install it using the command: 
     [java]       mvn install:install-file -DgroupId=org.apache.maven.mercury -DartifactId=mercury-repo-remote-m2
-Dversion=1.0.0-alpha-4-SNAPSHOT -Dpackaging=jar -Dfile=/path/to/file
     [java] 
     [java]   Alternatively, if you host your own repository you can deploy the file there:

     [java]       mvn deploy:deploy-file -DgroupId=org.apache.maven.mercury -DartifactId=mercury-repo-remote-m2
-Dversion=1.0.0-alpha-4-SNAPSHOT -Dpackaging=jar -Dfile=/path/to/file -Durl=[url] -DrepositoryId=[id]
     [java] 
     [java]   Path to dependency: 
     [java]   	1) org.apache.maven:apache-maven:jar:3.0-SNAPSHOT
     [java]   	2) org.sonatype.mercury:mercury-mp3-cli:jar:1.0-alpha-1
     [java]   	3) org.apache.maven.mercury:mercury-repo-remote-m2:jar:1.0.0-alpha-4-SNAPSHOT
     [java] 
     [java] 2) org.apache.maven.mercury:mercury-repo-local-m2:jar:1.0.0-alpha-4-SNAPSHOT
     [java] 
     [java]   Try downloading the file manually from the project website.
     [java] 
     [java]   Then, install it using the command: 
     [java]       mvn install:install-file -DgroupId=org.apache.maven.mercury -DartifactId=mercury-repo-local-m2
-Dversion=1.0.0-alpha-4-SNAPSHOT -Dpackaging=jar -Dfile=/path/to/file
     [java] 
     [java]   Alternatively, if you host your own repository you can deploy the file there:

     [java]       mvn deploy:deploy-file -DgroupId=org.apache.maven.mercury -DartifactId=mercury-repo-local-m2
-Dversion=1.0.0-alpha-4-SNAPSHOT -Dpackaging=jar -Dfile=/path/to/file -Durl=[url] -DrepositoryId=[id]
     [java] 
     [java]   Path to dependency: 
     [java]   	1) org.apache.maven:apache-maven:jar:3.0-SNAPSHOT
     [java]   	2) org.sonatype.mercury:mercury-mp3-cli:jar:1.0-alpha-1
     [java]   	3) org.apache.maven.mercury:mercury-repo-local-m2:jar:1.0.0-alpha-4-SNAPSHOT
     [java] 
     [java] ----------
     [java] 2 required artifacts are missing.
     [java] 
     [java] for artifact: 
     [java]   org.apache.maven:apache-maven:jar:3.0-SNAPSHOT
     [java] 
     [java] from the specified remote repositories:
     [java]   central (http://repo1.maven.org/maven2),
     [java]   apache.snapshots (http://repository.apache.org/snapshots)
     [java] 
     [java] 	at org.apache.maven.lifecycle.DefaultLifecycleExecutor.executeGoalAndHandleFailures(DefaultLifecycleExecutor.java:520)
     [java] 	at org.apache.maven.lifecycle.DefaultLifecycleExecutor.executeTaskSegmentForProject(DefaultLifecycleExecutor.java:258)
     [java] 	at org.apache.maven.lifecycle.DefaultLifecycleExecutor.executeTaskSegments(DefaultLifecycleExecutor.java:200)
     [java] 	at org.apache.maven.lifecycle.DefaultLifecycleExecutor.execute(DefaultLifecycleExecutor.java:163)
     [java] 	at org.apache.maven.DefaultMaven.execute(DefaultMaven.java:207)
     [java] 	at org.apache.maven.embedder.MavenEmbedder.execute(MavenEmbedder.java:851)
     [java] 	at org.apache.maven.cli.MavenCli.doMain(MavenCli.java:167)
     [java] 	at org.apache.maven.cli.MavenCli.main(MavenCli.java:62)
     [java] 	at org.apache.maven.cli.MavenCli.main(MavenCli.java:51)
     [java] Caused by: org.apache.maven.artifact.resolver.MultipleArtifactsNotFoundException:
Missing:
     [java] ----------
     [java] 1) org.apache.maven.mercury:mercury-repo-remote-m2:jar:1.0.0-alpha-4-SNAPSHOT
     [java] 
     [java]   Try downloading the file manually from the project website.
     [java] 
     [java]   Then, install it using the command: 
     [java]       mvn install:install-file -DgroupId=org.apache.maven.mercury -DartifactId=mercury-repo-remote-m2
-Dversion=1.0.0-alpha-4-SNAPSHOT -Dpackaging=jar -Dfile=/path/to/file
     [java] 
     [java]   Alternatively, if you host your own repository you can deploy the file there:

     [java]       mvn deploy:deploy-file -DgroupId=org.apache.maven.mercury -DartifactId=mercury-repo-remote-m2
-Dversion=1.0.0-alpha-4-SNAPSHOT -Dpackaging=jar -Dfile=/path/to/file -Durl=[url] -DrepositoryId=[id]
     [java] 
     [java]   Path to dependency: 
     [java]   	1) org.apache.maven:apache-maven:jar:3.0-SNAPSHOT
     [java]   	2) org.sonatype.mercury:mercury-mp3-cli:jar:1.0-alpha-1
     [java]   	3) org.apache.maven.mercury:mercury-repo-remote-m2:jar:1.0.0-alpha-4-SNAPSHOT
     [java] 
     [java] 2) org.apache.maven.mercury:mercury-repo-local-m2:jar:1.0.0-alpha-4-SNAPSHOT
     [java] 
     [java]   Try downloading the file manually from the project website.
     [java] 
     [java]   Then, install it using the command: 
     [java]       mvn install:install-file -DgroupId=org.apache.maven.mercury -DartifactId=mercury-repo-local-m2
-Dversion=1.0.0-alpha-4-SNAPSHOT -Dpackaging=jar -Dfile=/path/to/file
     [java] 
     [java]   Alternatively, if you host your own repository you can deploy the file there:

     [java]       mvn deploy:deploy-file -DgroupId=org.apache.maven.mercury -DartifactId=mercury-repo-local-m2
-Dversion=1.0.0-alpha-4-SNAPSHOT -Dpackaging=jar -Dfile=/path/to/file -Durl=[url] -DrepositoryId=[id]
     [java] 
     [java]   Path to dependency: 
     [java]   	1) org.apache.maven:apache-maven:jar:3.0-SNAPSHOT
     [java]   	2) org.sonatype.mercury:mercury-mp3-cli:jar:1.0-alpha-1
     [java]   	3) org.apache.maven.mercury:mercury-repo-local-m2:jar:1.0.0-alpha-4-SNAPSHOT
     [java] 
     [java] ----------
     [java] 2 required artifacts are missing.
     [java] 
     [java] for artifact: 
     [java]   org.apache.maven:apache-maven:jar:3.0-SNAPSHOT
     [java] 
     [java] from the specified remote repositories:
     [java]   central (http://repo1.maven.org/maven2),
     [java]   apache.snapshots (http://repository.apache.org/snapshots)
     [java] 
     [java] 	at org.apache.maven.artifact.resolver.DefaultArtifactResolver.resolveTransitively(DefaultArtifactResolver.java:363)
     [java] 	at org.apache.maven.artifact.resolver.DefaultArtifactResolver.resolveTransitively(DefaultArtifactResolver.java:290)
     [java] 	at org.apache.maven.artifact.resolver.DefaultArtifactResolver.resolveTransitively(DefaultArtifactResolver.java:267)
     [java] 	at org.apache.maven.artifact.resolver.DefaultArtifactResolver.resolveTransitively(DefaultArtifactResolver.java:252)
     [java] 	at org.apache.maven.artifact.resolver.DefaultArtifactResolver.resolveTransitively(DefaultArtifactResolver.java:274)
     [java] 	at org.apache.maven.LegacyRepositorySystem.resolveTransitively(LegacyRepositorySystem.java:145)
     [java] 	at org.apache.maven.plugin.DefaultPluginManager.resolveTransitiveDependencies(DefaultPluginManager.java:1501)
     [java] 	at org.apache.maven.plugin.DefaultPluginManager.executeMojo(DefaultPluginManager.java:543)
     [java] 	at org.apache.maven.lifecycle.DefaultLifecycleExecutor.executeGoalAndHandleFailures(DefaultLifecycleExecutor.java:491)
     [java] 	... 8 more
     [java] 
     [java] [INFO] ------------------------------------------------------------------------
     [java] [INFO] BUILD FAILED
     [java] [INFO] ------------------------------------------------------------------------
     [java] [INFO] Total time: 4 minutes 24 seconds
     [java] [INFO] Finished at: Sun Feb 22 21:22:46 UTC 2009
     [java] [INFO] Final Memory: 43M/195M
     [java] [INFO] ------------------------------------------------------------------------

BUILD FAILED
/zonestorage/hudson/home/hudson/hudson/jobs/Maven-3.0.x-with-bootstrap/workspace/trunk/build.xml:203:
Java returned: 1

Total time: 5 minutes 41 seconds


Mime
View raw message