maven-notifications mailing list archives

Site index · List index
Message view « Date » · « Thread »
Top « Date » · « Thread »
From Hudson <Hud...@sonatype.org>
Subject Build failed in Hudson: Maven-2.0.x-with-bootstrap » 1.4,ubuntu #95
Date Fri, 27 Feb 2009 21:09:02 GMT
See http://grid.sonatype.org/ci/job/Maven-2.0.x-with-bootstrap/./jdk=1.4,label=ubuntu/95/changes

------------------------------------------
[...truncated 1847 lines...]
     [exec] Downloading: http://repository.sonatype.org:8081/content/groups/public/org/codehaus/plexus/plexus-utils/1.4.1/plexus-utils-1.4.1.pom
     [exec] Downloading: http://repository.sonatype.org:8081/content/groups/public/org/apache/maven/maven-profile/2.0.7/maven-profile-2.0.7.pom
     [exec] Downloading: http://repository.sonatype.org:8081/content/groups/public/org/apache/maven/maven-artifact-manager/2.0.7/maven-artifact-manager-2.0.7.pom
     [exec] Downloading: http://repository.sonatype.org:8081/content/groups/public/org/apache/maven/maven-repository-metadata/2.0.7/maven-repository-metadata-2.0.7.pom
     [exec] Downloading: http://repository.sonatype.org:8081/content/groups/public/org/apache/maven/maven-artifact/2.0.7/maven-artifact-2.0.7.pom
     [exec] Downloading: http://repository.sonatype.org:8081/content/groups/public/org/apache/maven/maven-plugin-registry/2.0.7/maven-plugin-registry-2.0.7.pom
     [exec] Downloading: http://repository.sonatype.org:8081/content/groups/public/org/apache/maven/maven-archiver/2.3/maven-archiver-2.3.pom
     [exec] Downloading: http://repository.sonatype.org:8081/content/groups/public/org/apache/maven/shared/maven-shared-components/8/maven-shared-components-8.pom
     [exec] 2K downloaded
     [exec] Downloading: http://repository.sonatype.org:8081/content/groups/public/org/codehaus/plexus/plexus-archiver/1.0-alpha-9/plexus-archiver-1.0-alpha-9.pom
     [exec] Downloading: http://repository.sonatype.org:8081/content/groups/public/org/codehaus/plexus/plexus-components/1.1.9/plexus-components-1.1.9.pom
     [exec] Downloading: http://repository.sonatype.org:8081/content/groups/public/org/codehaus/plexus/plexus/1.0.10/plexus-1.0.10.pom
     [exec] Downloading: http://repository.sonatype.org:8081/content/groups/public/org/codehaus/plexus/plexus-container-default/1.0-alpha-15/plexus-container-default-1.0-alpha-15.pom
     [exec] 1K downloaded
     [exec] Downloading: http://repository.sonatype.org:8081/content/groups/public/org/codehaus/plexus/plexus-containers/1.0-alpha-15/plexus-containers-1.0-alpha-15.pom
     [exec] Downloading: http://repository.sonatype.org:8081/content/groups/public/org/codehaus/plexus/plexus/1.0.9/plexus-1.0.9.pom
     [exec] Downloading: http://repository.sonatype.org:8081/content/groups/public/org/codehaus/plexus/plexus-component-api/1.0-alpha-15/plexus-component-api-1.0-alpha-15.pom
     [exec] 948b downloaded
     [exec] Downloading: http://repository.sonatype.org:8081/content/groups/public/org/codehaus/plexus/plexus-classworlds/1.2-alpha-6/plexus-classworlds-1.2-alpha-6.pom
     [exec] Downloading: http://repository.sonatype.org:8081/content/groups/public/org/codehaus/plexus/plexus-io/1.0-alpha-1/plexus-io-1.0-alpha-1.pom
     [exec] Downloading: http://repository.sonatype.org:8081/content/groups/public/org/codehaus/plexus/plexus-container-default/1.0-alpha-9/plexus-container-default-1.0-alpha-9.pom
     [exec] Downloading: http://repository.sonatype.org:8081/content/groups/public/org/codehaus/plexus/plexus-component-api/1.0-alpha-16/plexus-component-api-1.0-alpha-16.pom
     [exec] Downloading: http://repository.sonatype.org:8081/content/groups/public/org/codehaus/plexus/plexus-containers/1.0-alpha-16/plexus-containers-1.0-alpha-16.pom
     [exec] Downloading: http://repository.sonatype.org:8081/content/groups/public/org/codehaus/plexus/plexus-utils/1.4.9/plexus-utils-1.4.9.pom
     [exec] Downloading: http://repository.sonatype.org:8081/content/groups/public/commons-lang/commons-lang/2.1/commons-lang-2.1.pom
     [exec] Downloading: http://repository.sonatype.org:8081/content/groups/public/org/codehaus/plexus/plexus-utils/1.4.9/plexus-utils-1.4.9.jar
     [exec] 199K downloaded
     [exec] Downloading: http://repository.sonatype.org:8081/content/groups/public/org/apache/maven/maven-archiver/2.3/maven-archiver-2.3.jar
     [exec] 17K downloaded
     [exec] Downloading: http://repository.sonatype.org:8081/content/groups/public/org/codehaus/plexus/plexus-archiver/1.0-alpha-9/plexus-archiver-1.0-alpha-9.jar
     [exec] 153K downloaded
     [exec] Downloading: http://repository.sonatype.org:8081/content/groups/public/org/codehaus/plexus/plexus-io/1.0-alpha-1/plexus-io-1.0-alpha-1.jar
     [exec] 11K downloaded
     [exec] Downloading: http://repository.sonatype.org:8081/content/groups/public/commons-lang/commons-lang/2.1/commons-lang-2.1.jar
     [exec] 202K downloaded
     [exec] [INFO] [jar:jar]
     [exec] [INFO] Building jar: /home/hudson/workspace/Maven-2.0.x-with-bootstrap/jdk/1.4/label/ubuntu/maven-2.0.x/maven-integration-tests/target/classes/target/maven-integration-tests-2.0.x.jar
     [exec] Downloading: http://repository.sonatype.org:8081/content/groups/public/org/apache/maven/maven-settings/2.0/maven-settings-2.0.pom
     [exec] Downloading: http://repository.sonatype.org:8081/content/groups/public/org/apache/maven/scm/maven-scm-manager-plexus/1.1/maven-scm-manager-plexus-1.1.pom
     [exec] 2K downloaded
     [exec] Downloading: http://repository.sonatype.org:8081/content/groups/public/org/apache/maven/scm/maven-scm-managers/1.1/maven-scm-managers-1.1.pom
     [exec] 1K downloaded
     [exec] Downloading: http://repository.sonatype.org:8081/content/groups/public/org/apache/maven/scm/maven-scm/1.1/maven-scm-1.1.pom
     [exec] 19K downloaded
     [exec] Downloading: http://repository.sonatype.org:8081/content/groups/public/org/apache/maven/scm/maven-scm-api/1.1/maven-scm-api-1.1.pom
     [exec] 1K downloaded
     [exec] Downloading: http://repository.sonatype.org:8081/content/groups/public/org/codehaus/plexus/plexus-utils/1.5.6/plexus-utils-1.5.6.pom
     [exec] 5K downloaded
     [exec] Downloading: http://repository.sonatype.org:8081/content/groups/public/org/codehaus/plexus/plexus/1.0.12/plexus-1.0.12.pom
     [exec] 9K downloaded
     [exec] Downloading: http://repository.sonatype.org:8081/content/groups/public/org/apache/maven/scm/maven-scm-providers-standard/1.1/maven-scm-providers-standard-1.1.pom
     [exec] 3K downloaded
     [exec] Downloading: http://repository.sonatype.org:8081/content/groups/public/org/apache/maven/scm/maven-scm-providers/1.1/maven-scm-providers-1.1.pom
     [exec] 3K downloaded
     [exec] Downloading: http://repository.sonatype.org:8081/content/groups/public/org/apache/maven/scm/maven-scm-provider-accurev/1.1/maven-scm-provider-accurev-1.1.pom
     [exec] 4K downloaded
     [exec] Downloading: http://repository.sonatype.org:8081/content/groups/public/org/apache/maven/scm/maven-scm-provider-bazaar/1.1/maven-scm-provider-bazaar-1.1.pom
     [exec] 1K downloaded
     [exec] Downloading: http://repository.sonatype.org:8081/content/groups/public/regexp/regexp/1.3/regexp-1.3.pom
     [exec] Downloading: http://repository.sonatype.org:8081/content/groups/public/org/apache/maven/scm/maven-scm-provider-clearcase/1.1/maven-scm-provider-clearcase-1.1.pom
     [exec] 2K downloaded
     [exec] Downloading: http://repository.sonatype.org:8081/content/groups/public/org/apache/maven/scm/maven-scm-provider-cvsexe/1.1/maven-scm-provider-cvsexe-1.1.pom
     [exec] 2K downloaded
     [exec] Downloading: http://repository.sonatype.org:8081/content/groups/public/org/apache/maven/scm/maven-scm-providers-cvs/1.1/maven-scm-providers-cvs-1.1.pom
     [exec] 1K downloaded
     [exec] Downloading: http://repository.sonatype.org:8081/content/groups/public/org/apache/maven/scm/maven-scm-provider-cvs-commons/1.1/maven-scm-provider-cvs-commons-1.1.pom
     [exec] 2K downloaded
     [exec] Downloading: http://repository.sonatype.org:8081/content/groups/public/org/apache/maven/scm/maven-scm-provider-cvsjava/1.1/maven-scm-provider-cvsjava-1.1.pom
     [exec] 2K downloaded
     [exec] Downloading: http://repository.sonatype.org:8081/content/groups/public/org/netbeans/lib/cvsclient/20060125/cvsclient-20060125.pom
     [exec] Downloading: http://repository.sonatype.org:8081/content/groups/public/ch/ethz/ganymed/ganymed-ssh2/build210/ganymed-ssh2-build210.pom
     [exec] Downloading: http://repository.sonatype.org:8081/content/groups/public/org/apache/maven/scm/maven-scm-provider-gitexe/1.1/maven-scm-provider-gitexe-1.1.pom
     [exec] 2K downloaded
     [exec] Downloading: http://repository.sonatype.org:8081/content/groups/public/org/apache/maven/scm/maven-scm-providers-git/1.1/maven-scm-providers-git-1.1.pom
     [exec] 1K downloaded
     [exec] Downloading: http://repository.sonatype.org:8081/content/groups/public/org/apache/maven/scm/maven-scm-provider-git-commons/1.1/maven-scm-provider-git-commons-1.1.pom
     [exec] 2K downloaded
     [exec] Downloading: http://repository.sonatype.org:8081/content/groups/public/org/apache/maven/scm/maven-scm-provider-hg/1.1/maven-scm-provider-hg-1.1.pom
     [exec] 2K downloaded
     [exec] Downloading: http://repository.sonatype.org:8081/content/groups/public/org/apache/maven/scm/maven-scm-provider-perforce/1.1/maven-scm-provider-perforce-1.1.pom
     [exec] 2K downloaded
     [exec] Downloading: http://repository.sonatype.org:8081/content/groups/public/org/apache/maven/scm/maven-scm-provider-starteam/1.1/maven-scm-provider-starteam-1.1.pom
     [exec] 2K downloaded
     [exec] Downloading: http://repository.sonatype.org:8081/content/groups/public/org/apache/maven/scm/maven-scm-provider-svnexe/1.1/maven-scm-provider-svnexe-1.1.pom
     [exec] 2K downloaded
     [exec] Downloading: http://repository.sonatype.org:8081/content/groups/public/org/apache/maven/scm/maven-scm-providers-svn/1.1/maven-scm-providers-svn-1.1.pom
     [exec] 1K downloaded
     [exec] Downloading: http://repository.sonatype.org:8081/content/groups/public/org/apache/maven/scm/maven-scm-provider-svn-commons/1.1/maven-scm-provider-svn-commons-1.1.pom
     [exec] 1K downloaded
     [exec] Downloading: http://repository.sonatype.org:8081/content/groups/public/org/apache/maven/scm/maven-scm-provider-synergy/1.1/maven-scm-provider-synergy-1.1.pom
     [exec] 1K downloaded
     [exec] Downloading: http://repository.sonatype.org:8081/content/groups/public/org/apache/maven/scm/maven-scm-provider-vss/1.1/maven-scm-provider-vss-1.1.pom
     [exec] 2K downloaded
     [exec] Downloading: http://repository.sonatype.org:8081/content/groups/public/org/apache/maven/scm/maven-scm-provider-local/1.1/maven-scm-provider-local-1.1.pom
     [exec] 2K downloaded
     [exec] Downloading: http://repository.sonatype.org:8081/content/groups/public/org/codehaus/plexus/plexus-utils/1.5.6/plexus-utils-1.5.6.jar
     [exec] 244K downloaded
     [exec] Downloading: http://repository.sonatype.org:8081/content/groups/public/org/apache/maven/scm/maven-scm-manager-plexus/1.1/maven-scm-manager-plexus-1.1.jar
     [exec] 9K downloaded
     [exec] Downloading: http://repository.sonatype.org:8081/content/groups/public/org/apache/maven/scm/maven-scm-api/1.1/maven-scm-api-1.1.jar
     [exec] 80K downloaded
     [exec] Downloading: http://repository.sonatype.org:8081/content/groups/public/org/apache/maven/scm/maven-scm-provider-accurev/1.1/maven-scm-provider-accurev-1.1.jar
     [exec] 25K downloaded
     [exec] Downloading: http://repository.sonatype.org:8081/content/groups/public/org/apache/maven/scm/maven-scm-provider-bazaar/1.1/maven-scm-provider-bazaar-1.1.jar
     [exec] 45K downloaded
     [exec] Downloading: http://repository.sonatype.org:8081/content/groups/public/regexp/regexp/1.3/regexp-1.3.jar
     [exec] 24K downloaded
     [exec] Downloading: http://repository.sonatype.org:8081/content/groups/public/org/apache/maven/scm/maven-scm-provider-clearcase/1.1/maven-scm-provider-clearcase-1.1.jar
     [exec] 58K downloaded
     [exec] Downloading: http://repository.sonatype.org:8081/content/groups/public/org/apache/maven/scm/maven-scm-provider-cvsexe/1.1/maven-scm-provider-cvsexe-1.1.jar
     [exec] 25K downloaded
     [exec] Downloading: http://repository.sonatype.org:8081/content/groups/public/org/apache/maven/scm/maven-scm-provider-cvs-commons/1.1/maven-scm-provider-cvs-commons-1.1.jar
     [exec] 68K downloaded
     [exec] Downloading: http://repository.sonatype.org:8081/content/groups/public/org/apache/maven/scm/maven-scm-provider-cvsjava/1.1/maven-scm-provider-cvsjava-1.1.jar
     [exec] 39K downloaded
     [exec] Downloading: http://repository.sonatype.org:8081/content/groups/public/org/netbeans/lib/cvsclient/20060125/cvsclient-20060125.jar
     [exec] 604K downloaded
     [exec] Downloading: http://repository.sonatype.org:8081/content/groups/public/ch/ethz/ganymed/ganymed-ssh2/build210/ganymed-ssh2-build210.jar
     [exec] 239K downloaded
     [exec] Downloading: http://repository.sonatype.org:8081/content/groups/public/org/apache/maven/scm/maven-scm-provider-gitexe/1.1/maven-scm-provider-gitexe-1.1.jar
     [exec] 44K downloaded
     [exec] Downloading: http://repository.sonatype.org:8081/content/groups/public/org/apache/maven/scm/maven-scm-provider-git-commons/1.1/maven-scm-provider-git-commons-1.1.jar
     [exec] 34K downloaded
     [exec] Downloading: http://repository.sonatype.org:8081/content/groups/public/org/apache/maven/scm/maven-scm-provider-hg/1.1/maven-scm-provider-hg-1.1.jar
     [exec] 50K downloaded
     [exec] Downloading: http://repository.sonatype.org:8081/content/groups/public/org/apache/maven/scm/maven-scm-provider-perforce/1.1/maven-scm-provider-perforce-1.1.jar
     [exec] 63K downloaded
     [exec] Downloading: http://repository.sonatype.org:8081/content/groups/public/org/apache/maven/scm/maven-scm-provider-starteam/1.1/maven-scm-provider-starteam-1.1.jar
     [exec] 67K downloaded
     [exec] Downloading: http://repository.sonatype.org:8081/content/groups/public/org/apache/maven/scm/maven-scm-provider-svnexe/1.1/maven-scm-provider-svnexe-1.1.jar
     [exec] 57K downloaded
     [exec] Downloading: http://repository.sonatype.org:8081/content/groups/public/org/apache/maven/scm/maven-scm-provider-svn-commons/1.1/maven-scm-provider-svn-commons-1.1.jar
     [exec] 36K downloaded
     [exec] Downloading: http://repository.sonatype.org:8081/content/groups/public/org/apache/maven/scm/maven-scm-provider-synergy/1.1/maven-scm-provider-synergy-1.1.jar
     [exec] 49K downloaded
     [exec] Downloading: http://repository.sonatype.org:8081/content/groups/public/org/apache/maven/scm/maven-scm-provider-vss/1.1/maven-scm-provider-vss-1.1.jar
     [exec] 53K downloaded
     [exec] Downloading: http://repository.sonatype.org:8081/content/groups/public/org/apache/maven/scm/maven-scm-provider-local/1.1/maven-scm-provider-local-1.1.jar
     [exec] 39K downloaded
     [exec] [INFO] [scm:update {execution: scm}]
     [exec] [INFO] Executing: /bin/sh -c cd /tmp/maven-integration-tests-2.0.x &&
svn --non-interactive update /tmp/maven-integration-tests-2.0.x
     [exec] [INFO] Working directory: /tmp/maven-integration-tests-2.0.x
     [exec] [INFO] Storing revision in 'scm.revision' project property.
     [exec] [INFO] Project at revision 748698
     [exec] [INFO] ------------------------------------------------------------------------
     [exec] [INFO] BUILD SUCCESSFUL
     [exec] [INFO] ------------------------------------------------------------------------
     [exec] [INFO] Total time: 1 minute 5 seconds
     [exec] [INFO] Finished at: Fri Feb 27 15:09:00 GMT-06:00 2009
     [exec] [INFO] Final Memory: 13M/25M
     [exec] [INFO] ------------------------------------------------------------------------
     [echo] Running integration tests
     [exec] + Error stacktraces are turned on.
     [exec] [INFO] Scanning for projects...
     [exec] [WARNING] Profile with id: 'run-its' has not been activated.
     [exec] Downloading: http://repository.sonatype.org:8081/content/groups/public/org/apache/maven/maven-parent/9/maven-parent-9.pom
     [exec] [WARNING] Unable to get resource 'org.apache.maven:maven-parent:pom:9' from repository
central (http://Nexus): Error transferring file
     [exec] Downloading: http://repository.sonatype.org:8081/content/groups/nexus-staging/org/apache/maven/maven-parent/9/maven-parent-9.pom
     [exec] [WARNING] Unable to get resource 'org.apache.maven:maven-parent:pom:9' from repository
nexus-staging (http://repository.sonatype.org:8081/content/groups/nexus-staging): Error transferring
file
     [exec] Downloading: http://repository.sonatype.org:8081/content/groups/nexus-plugins-with-staging/org/apache/maven/maven-parent/9/maven-parent-9.pom
     [exec] [WARNING] Unable to get resource 'org.apache.maven:maven-parent:pom:9' from repository
nexus-plugins-staging (http://repository.sonatype.org:8081/content/groups/nexus-plugins-with-staging):
Error transferring file
     [exec] Downloading: http://repository.sonatype.org:8081/content/groups/public/org/apache/maven/maven-parent/9/maven-parent-9.pom
     [exec] [WARNING] Unable to get resource 'org.apache.maven:maven-parent:pom:9' from repository
central (http://repo1.maven.org/maven2): Error transferring file
     [exec] [INFO] ------------------------------------------------------------------------
     [exec] [ERROR] FATAL ERROR
     [exec] [INFO] ------------------------------------------------------------------------
     [exec] [INFO] Failed to resolve artifact.
     [exec] 
     [exec] GroupId: org.apache.maven
     [exec] ArtifactId: maven-parent
     [exec] Version: 9
     [exec] 
     [exec] Reason: Unable to download the artifact from any repository
     [exec] 
     [exec]   org.apache.maven:maven-parent:pom:9
     [exec] 
     [exec] from the specified remote repositories:
     [exec]   nexus-plugins-staging (http://repository.sonatype.org:8081/content/groups/nexus-plugins-with-staging),
     [exec]   Nexus (http://repository.sonatype.org:8081/content/groups/public),
     [exec]   nexus-staging (http://repository.sonatype.org:8081/content/groups/nexus-staging)
     [exec] 
     [exec] 
     [exec] 
     [exec] [INFO] ------------------------------------------------------------------------
     [exec] [INFO] Trace
     [exec] org.apache.maven.reactor.MavenExecutionException: Cannot find parent: org.apache.maven:maven-parent
for project: org.apache.maven.its:core-integration-testing:pom:2.1-SNAPSHOT for project org.apache.maven.its:core-integration-testing:pom:2.1-SNAPSHOT
     [exec] 	at org.apache.maven.DefaultMaven.getProjects(DefaultMaven.java:378)
     [exec] 	at org.apache.maven.DefaultMaven.doExecute(DefaultMaven.java:292)
     [exec] 	at org.apache.maven.DefaultMaven.execute(DefaultMaven.java:129)
     [exec] 	at org.apache.maven.cli.MavenCli.main(MavenCli.java:290)
     [exec] 	at sun.reflect.NativeMethodAccessorImpl.invoke0(Native Method)
     [exec] 	at sun.reflect.NativeMethodAccessorImpl.invoke(NativeMethodAccessorImpl.java:39)
     [exec] 	at sun.reflect.DelegatingMethodAccessorImpl.invoke(DelegatingMethodAccessorImpl.java:25)
     [exec] 	at java.lang.reflect.Method.invoke(Method.java:324)
     [exec] 	at org.codehaus.classworlds.Launcher.launchEnhanced(Launcher.java:315)
     [exec] 	at org.codehaus.classworlds.Launcher.launch(Launcher.java:255)
     [exec] 	at org.codehaus.classworlds.Launcher.mainWithExitCode(Launcher.java:430)
     [exec] 	at org.codehaus.classworlds.Launcher.main(Launcher.java:375)
     [exec] Caused by: org.apache.maven.project.ProjectBuildingException: Cannot find parent:
org.apache.maven:maven-parent for project: org.apache.maven.its:core-integration-testing:pom:2.1-SNAPSHOT
for project org.apache.maven.its:core-integration-testing:pom:2.1-SNAPSHOT
     [exec] 	at org.apache.maven.project.DefaultMavenProjectBuilder.assembleLineage(DefaultMavenProjectBuilder.java:1396)
     [exec] 	at org.apache.maven.project.DefaultMavenProjectBuilder.buildInternal(DefaultMavenProjectBuilder.java:820)
     [exec] 	at org.apache.maven.project.DefaultMavenProjectBuilder.buildFromSourceFileInternal(DefaultMavenProjectBuilder.java:505)
     [exec] 	at org.apache.maven.project.DefaultMavenProjectBuilder.build(DefaultMavenProjectBuilder.java:197)
     [exec] 	at org.apache.maven.DefaultMaven.getProject(DefaultMaven.java:583)
     [exec] 	at org.apache.maven.DefaultMaven.collectProjects(DefaultMaven.java:461)
     [exec] 	at org.apache.maven.DefaultMaven.collectProjects(DefaultMaven.java:534)
     [exec] 	at org.apache.maven.DefaultMaven.getProjects(DefaultMaven.java:365)
     [exec] 	... 11 more
     [exec] Caused by: org.apache.maven.project.ProjectBuildingException: POM 'org.apache.maven:maven-parent'
not found in repository: Unable to download the artifact from any repository
     [exec] 
     [exec]   org.apache.maven:maven-parent:pom:9
     [exec] 
     [exec] from the specified remote repositories:
     [exec]   nexus-plugins-staging (http://repository.sonatype.org:8081/content/groups/nexus-plugins-with-staging),
     [exec]   Nexus (http://repository.sonatype.org:8081/content/groups/public),
     [exec]   nexus-staging (http://repository.sonatype.org:8081/content/groups/nexus-staging)
     [exec] 
     [exec]  for project org.apache.maven:maven-parent
     [exec] 	at org.apache.maven.project.DefaultMavenProjectBuilder.findModelFromRepository(DefaultMavenProjectBuilder.java:602)
     [exec] 	at org.apache.maven.project.DefaultMavenProjectBuilder.assembleLineage(DefaultMavenProjectBuilder.java:1392)
     [exec] 	... 18 more
     [exec] Caused by: org.apache.maven.artifact.resolver.ArtifactNotFoundException: Unable
to download the artifact from any repository
     [exec] 
     [exec]   org.apache.maven:maven-parent:pom:9
     [exec] 
     [exec] from the specified remote repositories:
     [exec]   nexus-plugins-staging (http://repository.sonatype.org:8081/content/groups/nexus-plugins-with-staging),
     [exec]   Nexus (http://repository.sonatype.org:8081/content/groups/public),
     [exec]   nexus-staging (http://repository.sonatype.org:8081/content/groups/nexus-staging)
     [exec] 
     [exec] 
     [exec] 	at org.apache.maven.artifact.resolver.DefaultArtifactResolver.resolve(DefaultArtifactResolver.java:212)
     [exec] 	at org.apache.maven.artifact.resolver.DefaultArtifactResolver.resolve(DefaultArtifactResolver.java:74)
     [exec] 	at org.apache.maven.project.DefaultMavenProjectBuilder.findModelFromRepository(DefaultMavenProjectBuilder.java:555)
     [exec] 	... 19 more
     [exec] Caused by: org.apache.maven.wagon.ResourceDoesNotExistException: Unable to download
the artifact from any repository
     [exec] 	at org.apache.maven.artifact.manager.DefaultWagonManager.getArtifact(DefaultWagonManager.java:332)
     [exec] 	at org.apache.maven.artifact.resolver.DefaultArtifactResolver.resolve(DefaultArtifactResolver.java:200)
     [exec] 	... 21 more
     [exec] [INFO] ------------------------------------------------------------------------
     [exec] [INFO] Total time: < 1 second
     [exec] [INFO] Finished at: Fri Feb 27 15:09:01 GMT-06:00 2009
     [exec] [INFO] Final Memory: 1M/2M
     [exec] [INFO] ------------------------------------------------------------------------

BUILD FAILED
/home/hudson/workspace/Maven-2.0.x-with-bootstrap/jdk/1.4/label/ubuntu/maven-2.0.x/build.xml:278:
exec returned: 1

Total time: 3 minutes 48 seconds


Mime
View raw message