maven-notifications mailing list archives

Site index · List index
Message view « Date » · « Thread »
Top « Date » · « Thread »
From Hudson <Hud...@sonatype.org>
Subject Build failed in Hudson: Maven-2.0.x-with-bootstrap » 1.4,windows #86
Date Tue, 17 Feb 2009 14:18:28 GMT
See http://grid.sonatype.org/ci/job/Maven-2.0.x-with-bootstrap/./jdk=1.4,label=windows/86/changes

Changes:

[Benjamin Bentmann] [MNG-4037] Include Java home in version information

o Merged from r744645

[Benjamin Bentmann] [MNG-3509] Make "mvn -v" output locale/encoding

o Restored after accidental removal in r688884

------------------------------------------
started
Building remotely on vista2
Updating http://svn.apache.org/repos/asf/maven/components/branches/maven-2.0.x
U         maven-core\src\main\java\org\apache\maven\cli\MavenCli.java
 U        .
At revision 745091
[maven-2.0.x] $ cmd.exe /C '"\opt\ant\apache-ant-1.7.1\bin\ant.bat -Dlabel=windows -Djdk=1.4
-Dmaven.repo.local=/opt/repos/bootstrap-maven-2.0.x set-temp-maven-home with-its &&
exit %%ERRORLEVEL%%"'
Buildfile: build.xml

initTaskDefs:

initLocalRepo:
     [echo] Using the local repository at: /opt/repos/bootstrap-maven-2.0.x

read-poms:
     [copy] Copying 1 file to C:\home\hudson\workspace\Maven-2.0.x-with-bootstrap\jdk\1.4\label\windows\maven-2.0.x
[artifact:pom] Error downloading parent pom org.apache.maven:maven-parent::11-SNAPSHOT: Missing:
[artifact:pom] ----------
[artifact:pom] 1) org.apache.maven:maven-parent:pom:11-SNAPSHOT
[artifact:pom]   Path to dependency: 
[artifact:pom]   	1) unspecified:unspecified:jar:0.0
[artifact:pom]   	2) org.apache.maven:maven-parent:pom:11-SNAPSHOT
[artifact:pom] 
[artifact:pom] ----------
[artifact:pom] 1 required artifact is missing.
[artifact:pom] 
[artifact:pom] for artifact: 
[artifact:pom]   unspecified:unspecified:jar:0.0
[artifact:pom] 
[artifact:pom] from the specified remote repositories:
[artifact:pom]   central (http://repo1.maven.org/maven2)
   [delete] Deleting: C:\home\hudson\workspace\Maven-2.0.x-with-bootstrap\jdk\1.4\label\windows\maven-2.0.x\dependencies.xml

set-temp-maven-home:
     [echo] Using temporary maven install directory: C:\tmp\apache-maven-2.0.11-SNAPSHOT

clean-bootstrap:
   [delete] Deleting directory C:\home\hudson\workspace\Maven-2.0.x-with-bootstrap\jdk\1.4\label\windows\maven-2.0.x\bootstrap

initTaskDefs:

isMavenHomeSet:
     [echo] Using Maven home at: C:\tmp\apache-maven-2.0.11-SNAPSHOT

initLocalRepo:
     [echo] Using the local repository at: /opt/repos/bootstrap-maven-2.0.x

init:

read-poms:

pull:

generate-sources:
    [mkdir] Created dir: C:\home\hudson\workspace\Maven-2.0.x-with-bootstrap\jdk\1.4\label\windows\maven-2.0.x\bootstrap\target
    [mkdir] Created dir: C:\home\hudson\workspace\Maven-2.0.x-with-bootstrap\jdk\1.4\label\windows\maven-2.0.x\bootstrap\target\generated-sources
  [modello] Generating sources for maven-model/src/main/mdo/maven.mdo
  [modello] Generating sources for maven-plugin-descriptor/src/main/mdo/lifecycle.mdo
  [modello] Generating sources for maven-plugin-registry/plugin-registry.mdo
  [modello] Generating sources for maven-plugin-parameter-documenter/src/main/mdo/paramdoc.mdo
  [modello] Generating sources for maven-profile/src/main/mdo/profiles.mdo
  [modello] Generating sources for maven-settings/src/main/mdo/settings.mdo
  [modello] Generating sources for maven-repository-metadata/src/main/mdo/metadata.mdo
  [modello] Generating sources for maven-toolchain/src/main/mdo/toolchains.xml

compile-boot:
    [mkdir] Created dir: C:\home\hudson\workspace\Maven-2.0.x-with-bootstrap\jdk\1.4\label\windows\maven-2.0.x\bootstrap\target\classes
    [javac] Compiling 342 source files to C:\home\hudson\workspace\Maven-2.0.x-with-bootstrap\jdk\1.4\label\windows\maven-2.0.x\bootstrap\target\classes
    [javac] Note: Some input files use or override a deprecated API.
    [javac] Note: Recompile with -deprecation for details.
    [mkdir] Created dir: C:\home\hudson\workspace\Maven-2.0.x-with-bootstrap\jdk\1.4\label\windows\maven-2.0.x\bootstrap\target\classes\META-INF\maven\org.apache.maven\maven-core

maven-compile:
     [java] + Error stacktraces are turned on.
     [java] [INFO] Scanning for projects...
     [java] [INFO] ------------------------------------------------------------------------
     [java] [ERROR] FATAL ERROR
     [java] [INFO] ------------------------------------------------------------------------
     [java] [INFO] Failed to resolve artifact.
     [java] 
     [java] GroupId: org.apache.maven
     [java] ArtifactId: maven-parent
     [java] Version: 11-SNAPSHOT
     [java] 
     [java] Reason: Unable to download the artifact from any repository
     [java] 
     [java]   org.apache.maven:maven-parent:pom:11-SNAPSHOT
     [java] 
     [java] from the specified remote repositories:
     [java]   central (http://repo1.maven.org/maven2)
     [java] 
     [java] 
     [java] 
     [java] [INFO] ------------------------------------------------------------------------
     [java] [INFO] Trace
     [java] org.apache.maven.reactor.MavenExecutionException: Cannot find parent: org.apache.maven:maven-parent
for project: null:maven:pom:2.0.11-SNAPSHOT for project null:maven:pom:2.0.11-SNAPSHOT
     [java] 	at org.apache.maven.DefaultMaven.getProjects(Unknown Source)
     [java] 	at org.apache.maven.DefaultMaven.doExecute(Unknown Source)
     [java] 	at org.apache.maven.DefaultMaven.execute(Unknown Source)
     [java] 	at org.apache.maven.cli.MavenCli.main(Unknown Source)
     [java] 	at org.apache.maven.cli.MavenCli.main(Unknown Source)
     [java] Caused by: org.apache.maven.project.ProjectBuildingException: Cannot find parent:
org.apache.maven:maven-parent for project: null:maven:pom:2.0.11-SNAPSHOT for project null:maven:pom:2.0.11-SNAPSHOT
     [java] 	at org.apache.maven.project.DefaultMavenProjectBuilder.assembleLineage(Unknown
Source)
     [java] 	at org.apache.maven.project.DefaultMavenProjectBuilder.buildInternal(Unknown
Source)
     [java] 	at org.apache.maven.project.DefaultMavenProjectBuilder.buildFromSourceFileInternal(Unknown
Source)
     [java] 	at org.apache.maven.project.DefaultMavenProjectBuilder.build(Unknown Source)
     [java] 	at org.apache.maven.DefaultMaven.getProject(Unknown Source)
     [java] 	at org.apache.maven.DefaultMaven.collectProjects(Unknown Source)
     [java] 	... 5 more
     [java] Caused by: org.apache.maven.project.ProjectBuildingException: POM 'org.apache.maven:maven-parent'
not found in repository: Unable to download the artifact from any repository
     [java] 
     [java]   org.apache.maven:maven-parent:pom:11-SNAPSHOT
     [java] 
     [java] from the specified remote repositories:
     [java]   central (http://repo1.maven.org/maven2)
     [java] 
     [java]  for project org.apache.maven:maven-parent
     [java] 	at org.apache.maven.project.DefaultMavenProjectBuilder.findModelFromRepository(Unknown
Source)
     [java] 	... 11 more
     [java] Caused by: org.apache.maven.artifact.resolver.ArtifactNotFoundException: Unable
to download the artifact from any repository
     [java] 
     [java]   org.apache.maven:maven-parent:pom:11-SNAPSHOT
     [java] 
     [java] from the specified remote repositories:
     [java]   central (http://repo1.maven.org/maven2)
     [java] 
     [java] 
     [java] 	at org.apache.maven.artifact.resolver.DefaultArtifactResolver.resolve(Unknown
Source)
     [java] 	at org.apache.maven.artifact.resolver.DefaultArtifactResolver.resolve(Unknown
Source)
     [java] 	... 12 more
     [java] Caused by: org.apache.maven.wagon.ResourceDoesNotExistException: Unable to download
the artifact from any repository
     [java] 	at org.apache.maven.artifact.manager.DefaultWagonManager.getArtifact(Unknown
Source)
     [java] 	... 14 more
     [java] [INFO] ------------------------------------------------------------------------
     [java] [INFO] Total time: < 1 second
     [java] [INFO] Finished at: Tue Feb 17 06:18:18 PST 2009
     [java] [INFO] Final Memory: 1M/2M
     [java] [INFO] ------------------------------------------------------------------------

BUILD FAILED
C:\home\hudson\workspace\Maven-2.0.x-with-bootstrap\jdk\1.4\label\windows\maven-2.0.x\build.xml:168:
Java returned: 1

Total time: 1 minute 1 second


Mime
View raw message