maven-notifications mailing list archives

Site index · List index
Message view « Date » · « Thread »
Top « Date » · « Thread »
From Hudson <Hud...@sonatype.org>
Subject Build failed in Hudson: maven-parent-pom-trunk » default #16
Date Wed, 18 Feb 2009 06:06:31 GMT
See http://grid.sonatype.org/ci/job/maven-parent-pom-trunk/./default/16/changes

Changes:

[Brian Fox] [maven-release-plugin] prepare for next development iteration

[Brian Fox] [maven-release-plugin] prepare release maven-parent-11

[Brian Fox] use new released version

------------------------------------------
started
Building remotely on z_orchestrator
Updating http://svn.apache.org/repos/asf/maven/pom/trunk/maven
U         pom.xml
At revision 745391
[maven] $ /opt/maven/apache-maven-2.0.9/bin/mvn clean deploy -B -U -e
+ Error stacktraces are turned on.
[INFO] Scanning for projects...
Downloading: http://repository.sonatype.org:8081/content/groups/public/org/apache/apache/5/apache-5.pom
Downloading: http://repository.sonatype.org:8081/content/groups/public/org/apache/apache/5/apache-5.pom
[INFO] ------------------------------------------------------------------------
[ERROR] FATAL ERROR
[INFO] ------------------------------------------------------------------------
[INFO] Error building POM (may not be this project's POM).


Project ID: org.apache.maven:maven-parent:pom:12-SNAPSHOT

Reason: Cannot find parent: org.apache:apache for project: org.apache.maven:maven-parent:pom:12-SNAPSHOT
for project org.apache.maven:maven-parent:pom:12-SNAPSHOT


[INFO] ------------------------------------------------------------------------
[INFO] Trace
org.apache.maven.reactor.MavenExecutionException: Cannot find parent: org.apache:apache for
project: org.apache.maven:maven-parent:pom:12-SNAPSHOT for project org.apache.maven:maven-parent:pom:12-SNAPSHOT
	at org.apache.maven.DefaultMaven.getProjects(DefaultMaven.java:378)
	at org.apache.maven.DefaultMaven.doExecute(DefaultMaven.java:292)
	at org.apache.maven.DefaultMaven.execute(DefaultMaven.java:129)
	at org.apache.maven.cli.MavenCli.main(MavenCli.java:287)
	at sun.reflect.NativeMethodAccessorImpl.invoke0(Native Method)
	at sun.reflect.NativeMethodAccessorImpl.invoke(NativeMethodAccessorImpl.java:39)
	at sun.reflect.DelegatingMethodAccessorImpl.invoke(DelegatingMethodAccessorImpl.java:25)
	at java.lang.reflect.Method.invoke(Method.java:597)
	at org.codehaus.classworlds.Launcher.launchEnhanced(Launcher.java:315)
	at org.codehaus.classworlds.Launcher.launch(Launcher.java:255)
	at org.codehaus.classworlds.Launcher.mainWithExitCode(Launcher.java:430)
	at org.codehaus.classworlds.Launcher.main(Launcher.java:375)
Caused by: org.apache.maven.project.ProjectBuildingException: Cannot find parent: org.apache:apache
for project: org.apache.maven:maven-parent:pom:12-SNAPSHOT for project org.apache.maven:maven-parent:pom:12-SNAPSHOT
	at org.apache.maven.project.DefaultMavenProjectBuilder.assembleLineage(DefaultMavenProjectBuilder.java:1370)
	at org.apache.maven.project.DefaultMavenProjectBuilder.buildInternal(DefaultMavenProjectBuilder.java:821)
	at org.apache.maven.project.DefaultMavenProjectBuilder.buildFromSourceFileInternal(DefaultMavenProjectBuilder.java:506)
	at org.apache.maven.project.DefaultMavenProjectBuilder.build(DefaultMavenProjectBuilder.java:198)
	at org.apache.maven.DefaultMaven.getProject(DefaultMaven.java:583)
	at org.apache.maven.DefaultMaven.collectProjects(DefaultMaven.java:461)
	at org.apache.maven.DefaultMaven.getProjects(DefaultMaven.java:365)
	... 11 more
Caused by: org.apache.maven.project.ProjectBuildingException: POM 'org.apache:apache' not
found in repository: Unable to download the artifact from any repository

  org.apache:apache:pom:5

from the specified remote repositories:
  Nexus (http://repository.sonatype.org:8081/content/groups/public)
 for project org.apache:apache
	at org.apache.maven.project.DefaultMavenProjectBuilder.findModelFromRepository(DefaultMavenProjectBuilder.java:603)
	at org.apache.maven.project.DefaultMavenProjectBuilder.assembleLineage(DefaultMavenProjectBuilder.java:1366)
	... 17 more
Caused by: org.apache.maven.artifact.resolver.ArtifactNotFoundException: Unable to download
the artifact from any repository

  org.apache:apache:pom:5

from the specified remote repositories:
  Nexus (http://repository.sonatype.org:8081/content/groups/public)

	at org.apache.maven.artifact.resolver.DefaultArtifactResolver.resolve(DefaultArtifactResolver.java:212)
	at org.apache.maven.artifact.resolver.DefaultArtifactResolver.resolve(DefaultArtifactResolver.java:74)
	at org.apache.maven.project.DefaultMavenProjectBuilder.findModelFromRepository(DefaultMavenProjectBuilder.java:556)
	... 18 more
Caused by: org.apache.maven.wagon.ResourceDoesNotExistException: Unable to download the artifact
from any repository
	at org.apache.maven.artifact.manager.DefaultWagonManager.getArtifact(DefaultWagonManager.java:331)
	at org.apache.maven.artifact.resolver.DefaultArtifactResolver.resolve(DefaultArtifactResolver.java:200)
	... 20 more
[INFO] ------------------------------------------------------------------------
[INFO] Total time: 1 second
[INFO] Finished at: Wed Feb 18 00:06:31 CST 2009
[INFO] Final Memory: 1M/10M
[INFO] ------------------------------------------------------------------------


Mime
View raw message