maven-notifications mailing list archives

Site index · List index
Message view « Date » · « Thread »
Top « Date » · « Thread »
From Hudson <Hud...@sonatype.org>
Subject Build failed in Hudson: maven-shared » 1.5,windows #56
Date Sat, 14 Feb 2009 22:48:22 GMT
See http://grid.sonatype.org/ci/job/maven-shared/./jdk=1.5,label=windows/56/changes

Changes:

[Jason van Zyl] o adding required test jar

------------------------------------------
[...truncated 1477 lines...]
[INFO] Retrieving previous build number from apache.snapshots
Uploading: file:/opt/repos/deploy-junk/org/apache/maven/shared/maven-shared-jar/1.1-SNAPSHOT/maven-shared-jar-1.1-20090214.224614-3.jar
36K uploaded
[INFO] Retrieving previous metadata from apache.snapshots
[INFO] Uploading repository metadata for: 'snapshot org.apache.maven.shared:maven-shared-jar:1.1-SNAPSHOT'
[INFO] Retrieving previous metadata from apache.snapshots
[INFO] Uploading repository metadata for: 'artifact org.apache.maven.shared:maven-shared-jar'
[INFO] Uploading project information for maven-shared-jar 1.1-20090214.224614-3
[INFO] ------------------------------------------------------------------------
[INFO] Building Maven Shared Monitor API
[INFO]    task-segment: [clean, deploy]
[INFO] ------------------------------------------------------------------------
[INFO] [clean:clean]
[INFO] Deleting file set: C:\home\hudson\workspace\maven-shared\jdk\1.5\label\windows\trunk\maven-shared-monitor\target
(included: [**], excluded: [])
[INFO] [remote-resources:process {execution: default}]
[INFO] [resources:resources]
[INFO] Using 'UTF-8' encoding to copy filtered resources.
[INFO] skip non existing resourceDirectory C:\home\hudson\workspace\maven-shared\jdk\1.5\label\windows\trunk\maven-shared-monitor\src\main\resources
[INFO] Copying 3 resources
[INFO] [compiler:compile]
[INFO] Compiling 5 source files to C:\home\hudson\workspace\maven-shared\jdk\1.5\label\windows\trunk\maven-shared-monitor\target\classes
[INFO] [resources:testResources]
[INFO] Using 'UTF-8' encoding to copy filtered resources.
[INFO] skip non existing resourceDirectory C:\home\hudson\workspace\maven-shared\jdk\1.5\label\windows\trunk\maven-shared-monitor\src\test\resources
[INFO] Copying 3 resources
[INFO] [compiler:testCompile]
[INFO] No sources to compile
[INFO] [surefire:test]
[INFO] Surefire report directory: C:\home\hudson\workspace\maven-shared\jdk\1.5\label\windows\trunk\maven-shared-monitor\target\surefire-reports

-------------------------------------------------------
 T E S T S
-------------------------------------------------------
There are no tests to run.

Results :

Tests run: 0, Failures: 0, Errors: 0, Skipped: 0

[INFO] [jar:jar]
[INFO] Building jar: C:\home\hudson\workspace\maven-shared\jdk\1.5\label\windows\trunk\maven-shared-monitor\target\maven-shared-monitor-1.0-SNAPSHOT.jar
[INFO] [install:install]
[INFO] Installing C:\home\hudson\workspace\maven-shared\jdk\1.5\label\windows\trunk\maven-shared-monitor\target\maven-shared-monitor-1.0-SNAPSHOT.jar
to \opt\repos\maven-shared\org\apache\maven\shared\maven-shared-monitor\1.0-SNAPSHOT\maven-shared-monitor-1.0-SNAPSHOT.jar
[INFO] [deploy:deploy]
[INFO] Retrieving previous build number from apache.snapshots
Uploading: file:/opt/repos/deploy-junk/org/apache/maven/shared/maven-shared-monitor/1.0-SNAPSHOT/maven-shared-monitor-1.0-20090214.224614-3.jar
12K uploaded
[INFO] Retrieving previous metadata from apache.snapshots
[INFO] Uploading repository metadata for: 'artifact org.apache.maven.shared:maven-shared-monitor'
[INFO] Uploading project information for maven-shared-monitor 1.0-20090214.224614-3
[INFO] Retrieving previous metadata from apache.snapshots
[INFO] Uploading repository metadata for: 'snapshot org.apache.maven.shared:maven-shared-monitor:1.0-SNAPSHOT'
[INFO] ------------------------------------------------------------------------
[INFO] Building Maven Verifier Component
[INFO]    task-segment: [clean, deploy]
[INFO] ------------------------------------------------------------------------
[INFO] [clean:clean]
[INFO] Deleting file set: C:\home\hudson\workspace\maven-shared\jdk\1.5\label\windows\trunk\maven-verifier\target
(included: [**], excluded: [])
[INFO] [remote-resources:process {execution: default}]
[INFO] [resources:resources]
[INFO] Using 'UTF-8' encoding to copy filtered resources.
[INFO] skip non existing resourceDirectory C:\home\hudson\workspace\maven-shared\jdk\1.5\label\windows\trunk\maven-verifier\src\main\resources
[INFO] Copying 3 resources
[INFO] [compiler:compile]
[INFO] Compiling 22 source files to C:\home\hudson\workspace\maven-shared\jdk\1.5\label\windows\trunk\maven-verifier\target\classes
[INFO] [resources:testResources]
[INFO] Using 'UTF-8' encoding to copy filtered resources.
[INFO] skip non existing resourceDirectory C:\home\hudson\workspace\maven-shared\jdk\1.5\label\windows\trunk\maven-verifier\src\test\resources
[INFO] Copying 3 resources
[INFO] [compiler:testCompile]
[INFO] No sources to compile
[INFO] [surefire:test]
[INFO] Surefire report directory: C:\home\hudson\workspace\maven-shared\jdk\1.5\label\windows\trunk\maven-verifier\target\surefire-reports

-------------------------------------------------------
 T E S T S
-------------------------------------------------------
There are no tests to run.

Results :

Tests run: 0, Failures: 0, Errors: 0, Skipped: 0

[INFO] [jar:jar]
[INFO] Building jar: C:\home\hudson\workspace\maven-shared\jdk\1.5\label\windows\trunk\maven-verifier\target\maven-verifier-1.2-SNAPSHOT.jar
[INFO] [install:install]
[INFO] Installing C:\home\hudson\workspace\maven-shared\jdk\1.5\label\windows\trunk\maven-verifier\target\maven-verifier-1.2-SNAPSHOT.jar
to \opt\repos\maven-shared\org\apache\maven\shared\maven-verifier\1.2-SNAPSHOT\maven-verifier-1.2-SNAPSHOT.jar
[INFO] [deploy:deploy]
[INFO] Retrieving previous build number from apache.snapshots
Uploading: file:/opt/repos/deploy-junk/org/apache/maven/shared/maven-verifier/1.2-SNAPSHOT/maven-verifier-1.2-20090214.224614-3.jar
81K uploaded
[INFO] Uploading project information for maven-verifier 1.2-20090214.224614-3
[INFO] Retrieving previous metadata from apache.snapshots
[INFO] Uploading repository metadata for: 'artifact org.apache.maven.shared:maven-verifier'
[INFO] Retrieving previous metadata from apache.snapshots
[INFO] Uploading repository metadata for: 'snapshot org.apache.maven.shared:maven-verifier:1.2-SNAPSHOT'
[INFO] ------------------------------------------------------------------------
[INFO] Building Maven Shared Web UI tests
[INFO]    task-segment: [clean, deploy]
[INFO] ------------------------------------------------------------------------
[INFO] [clean:clean]
[INFO] Deleting file set: C:\home\hudson\workspace\maven-shared\jdk\1.5\label\windows\trunk\maven-web-ui-tests\target
(included: [**], excluded: [])
[INFO] [remote-resources:process {execution: default}]
[INFO] [resources:resources]
[INFO] Using 'UTF-8' encoding to copy filtered resources.
[INFO] skip non existing resourceDirectory C:\home\hudson\workspace\maven-shared\jdk\1.5\label\windows\trunk\maven-web-ui-tests\src\main\resources
[INFO] Copying 3 resources
[INFO] [compiler:compile]
[INFO] Compiling 2 source files to C:\home\hudson\workspace\maven-shared\jdk\1.5\label\windows\trunk\maven-web-ui-tests\target\classes
[INFO] [resources:testResources]
[INFO] Using 'UTF-8' encoding to copy filtered resources.
[INFO] skip non existing resourceDirectory C:\home\hudson\workspace\maven-shared\jdk\1.5\label\windows\trunk\maven-web-ui-tests\src\test\resources
[INFO] Copying 3 resources
[INFO] [compiler:testCompile]
[INFO] No sources to compile
[INFO] [surefire:test]
[INFO] Surefire report directory: C:\home\hudson\workspace\maven-shared\jdk\1.5\label\windows\trunk\maven-web-ui-tests\target\surefire-reports

-------------------------------------------------------
 T E S T S
-------------------------------------------------------
There are no tests to run.

Results :

Tests run: 0, Failures: 0, Errors: 0, Skipped: 0

[INFO] [jar:jar]
[INFO] Building jar: C:\home\hudson\workspace\maven-shared\jdk\1.5\label\windows\trunk\maven-web-ui-tests\target\maven-web-ui-tests-1.0-SNAPSHOT.jar
[INFO] [install:install]
[INFO] Installing C:\home\hudson\workspace\maven-shared\jdk\1.5\label\windows\trunk\maven-web-ui-tests\target\maven-web-ui-tests-1.0-SNAPSHOT.jar
to \opt\repos\maven-shared\org\apache\maven\shared\maven-web-ui-tests\1.0-SNAPSHOT\maven-web-ui-tests-1.0-SNAPSHOT.jar
[INFO] [deploy:deploy]
[INFO] Retrieving previous build number from apache.snapshots
Uploading: file:/opt/repos/deploy-junk/org/apache/maven/shared/maven-web-ui-tests/1.0-SNAPSHOT/maven-web-ui-tests-1.0-20090214.224614-3.jar
15K uploaded
[INFO] Uploading project information for maven-web-ui-tests 1.0-20090214.224614-3
[INFO] Retrieving previous metadata from apache.snapshots
[INFO] Uploading repository metadata for: 'snapshot org.apache.maven.shared:maven-web-ui-tests:1.0-SNAPSHOT'
[INFO] Retrieving previous metadata from apache.snapshots
[INFO] Uploading repository metadata for: 'artifact org.apache.maven.shared:maven-web-ui-tests'
[INFO] 
[INFO] 
[INFO] ------------------------------------------------------------------------
[INFO] Reactor Summary:
[INFO] ------------------------------------------------------------------------
[INFO] Maven Shared Components ............................... SUCCESS [3.312s]
[INFO] Maven Shared I/O API .................................. SUCCESS [8.416s]
[INFO] Maven File Management API ............................. SUCCESS [6.906s]
[INFO] Maven Ant ............................................. SUCCESS [3.391s]
[INFO] Maven Applications Shared Configuration ............... SUCCESS [0.437s]
[INFO] Maven Shared Application Configuration Model .......... SUCCESS [1.391s]
[INFO] Maven Shared Application Configuration Web Components . SUCCESS [2.797s]
[INFO] Maven Archiver ........................................ SUCCESS [2.578s]
[INFO] Maven Common Artifact Filters ......................... SUCCESS [3.516s]
[INFO] Maven Dependency Analyzer ............................. FAILED [20.875s]
[INFO] Maven Dependency Tree ................................. SUCCESS [3.640s]
[INFO] Maven Downloader ...................................... SUCCESS [0.938s]
[INFO] Maven Doxia Integration Tools ......................... SUCCESS [3.875s]
[INFO] Maven Filtering ....................................... FAILED [3.781s]
[INFO] Maven Invoker ......................................... SUCCESS [14.437s]
[INFO] Maven Model Converter ................................. SUCCESS [5.672s]
[INFO] Maven OSGi integration ................................ SUCCESS [2.203s]
[INFO] Maven Reporting Implementation ........................ SUCCESS [4.031s]
[INFO] Maven Repository Builder .............................. SUCCESS [3.125s]
[INFO] Maven Runtime ......................................... SUCCESS [21.782s]
[INFO] Maven Script Support Root ............................. SUCCESS [0.093s]
[INFO] Maven Ant Mojo Support ................................ SUCCESS [2.532s]
[INFO] Maven Beanshell Mojo Support .......................... SUCCESS [1.062s]
[INFO] Maven JAR Utilities ................................... SUCCESS [5.484s]
[INFO] Maven Shared Monitor API .............................. SUCCESS [0.954s]
[INFO] Maven Verifier Component .............................. SUCCESS [1.546s]
[INFO] Maven Shared Web UI tests ............................. SUCCESS [1.047s]
[INFO] ------------------------------------------------------------------------
[INFO] Error for project: Maven Dependency Analyzer (during deploy)
[INFO] ------------------------------------------------------------------------
[INFO] There are test failures.

Please refer to C:\home\hudson\workspace\maven-shared\jdk\1.5\label\windows\trunk\maven-dependency-analyzer\target\surefire-reports
for the individual test results.
[INFO] ------------------------------------------------------------------------
[INFO] Trace
org.apache.maven.BuildFailureException: There are test failures.

Please refer to C:\home\hudson\workspace\maven-shared\jdk\1.5\label\windows\trunk\maven-dependency-analyzer\target\surefire-reports
for the individual test results.
	at org.apache.maven.lifecycle.DefaultLifecycleExecutor.executeGoals(DefaultLifecycleExecutor.java:697)
	at org.apache.maven.lifecycle.DefaultLifecycleExecutor.executeGoalWithLifecycle(DefaultLifecycleExecutor.java:538)
	at org.apache.maven.lifecycle.DefaultLifecycleExecutor.executeGoal(DefaultLifecycleExecutor.java:517)
	at org.apache.maven.lifecycle.DefaultLifecycleExecutor.executeGoalAndHandleFailures(DefaultLifecycleExecutor.java:369)
	at org.apache.maven.lifecycle.DefaultLifecycleExecutor.executeTaskSegments(DefaultLifecycleExecutor.java:330)
	at org.apache.maven.lifecycle.DefaultLifecycleExecutor.execute(DefaultLifecycleExecutor.java:181)
	at org.apache.maven.DefaultMaven.doExecute(DefaultMaven.java:336)
	at org.apache.maven.DefaultMaven.execute(DefaultMaven.java:129)
	at org.apache.maven.cli.MavenCli.main(MavenCli.java:302)
	at sun.reflect.NativeMethodAccessorImpl.invoke0(Native Method)
	at sun.reflect.NativeMethodAccessorImpl.invoke(NativeMethodAccessorImpl.java:39)
	at sun.reflect.DelegatingMethodAccessorImpl.invoke(DelegatingMethodAccessorImpl.java:25)
	at java.lang.reflect.Method.invoke(Method.java:585)
	at org.codehaus.classworlds.Launcher.launchEnhanced(Launcher.java:315)
	at org.codehaus.classworlds.Launcher.launch(Launcher.java:255)
	at org.codehaus.classworlds.Launcher.mainWithExitCode(Launcher.java:430)
	at org.codehaus.classworlds.Launcher.main(Launcher.java:375)
Caused by: org.apache.maven.plugin.MojoFailureException: There are test failures.

Please refer to C:\home\hudson\workspace\maven-shared\jdk\1.5\label\windows\trunk\maven-dependency-analyzer\target\surefire-reports
for the individual test results.
	at org.apache.maven.plugin.surefire.SurefirePlugin.execute(SurefirePlugin.java:575)
	at org.apache.maven.plugin.DefaultPluginManager.executeMojo(DefaultPluginManager.java:458)
	at org.apache.maven.lifecycle.DefaultLifecycleExecutor.executeGoals(DefaultLifecycleExecutor.java:676)
	... 16 more
[INFO] ------------------------------------------------------------------------
[INFO] Error for project: Maven Filtering (during deploy)
[INFO] ------------------------------------------------------------------------
[INFO] There are test failures.

Please refer to C:\home\hudson\workspace\maven-shared\jdk\1.5\label\windows\trunk\maven-filtering\target\surefire-reports
for the individual test results.
[INFO] ------------------------------------------------------------------------
[INFO] Trace
org.apache.maven.BuildFailureException: There are test failures.

Please refer to C:\home\hudson\workspace\maven-shared\jdk\1.5\label\windows\trunk\maven-filtering\target\surefire-reports
for the individual test results.
	at org.apache.maven.lifecycle.DefaultLifecycleExecutor.executeGoals(DefaultLifecycleExecutor.java:697)
	at org.apache.maven.lifecycle.DefaultLifecycleExecutor.executeGoalWithLifecycle(DefaultLifecycleExecutor.java:538)
	at org.apache.maven.lifecycle.DefaultLifecycleExecutor.executeGoal(DefaultLifecycleExecutor.java:517)
	at org.apache.maven.lifecycle.DefaultLifecycleExecutor.executeGoalAndHandleFailures(DefaultLifecycleExecutor.java:369)
	at org.apache.maven.lifecycle.DefaultLifecycleExecutor.executeTaskSegments(DefaultLifecycleExecutor.java:330)
	at org.apache.maven.lifecycle.DefaultLifecycleExecutor.execute(DefaultLifecycleExecutor.java:181)
	at org.apache.maven.DefaultMaven.doExecute(DefaultMaven.java:336)
	at org.apache.maven.DefaultMaven.execute(DefaultMaven.java:129)
	at org.apache.maven.cli.MavenCli.main(MavenCli.java:302)
	at sun.reflect.NativeMethodAccessorImpl.invoke0(Native Method)
	at sun.reflect.NativeMethodAccessorImpl.invoke(NativeMethodAccessorImpl.java:39)
	at sun.reflect.DelegatingMethodAccessorImpl.invoke(DelegatingMethodAccessorImpl.java:25)
	at java.lang.reflect.Method.invoke(Method.java:585)
	at org.codehaus.classworlds.Launcher.launchEnhanced(Launcher.java:315)
	at org.codehaus.classworlds.Launcher.launch(Launcher.java:255)
	at org.codehaus.classworlds.Launcher.mainWithExitCode(Launcher.java:430)
	at org.codehaus.classworlds.Launcher.main(Launcher.java:375)
Caused by: org.apache.maven.plugin.MojoFailureException: There are test failures.

Please refer to C:\home\hudson\workspace\maven-shared\jdk\1.5\label\windows\trunk\maven-filtering\target\surefire-reports
for the individual test results.
	at org.apache.maven.plugin.surefire.SurefirePlugin.execute(SurefirePlugin.java:575)
	at org.apache.maven.plugin.DefaultPluginManager.executeMojo(DefaultPluginManager.java:458)
	at org.apache.maven.lifecycle.DefaultLifecycleExecutor.executeGoals(DefaultLifecycleExecutor.java:676)
	... 16 more
[INFO] ------------------------------------------------------------------------
[INFO] BUILD ERRORS
[INFO] ------------------------------------------------------------------------
[INFO] Total time: 2 minutes 11 seconds
[INFO] Finished at: Sat Feb 14 14:48:21 PST 2009
[INFO] Final Memory: 42M/75M
[INFO] ------------------------------------------------------------------------


Mime
View raw message