maven-notifications mailing list archives

Site index · List index
Message view « Date » · « Thread »
Top « Date » · « Thread »
From Apache Hudson Server <hud...@hudson.zones.apache.org>
Subject Build failed in Hudson: Maven-3.0.x-with-bootstrap #336
Date Sat, 21 Feb 2009 16:21:43 GMT
See http://hudson.zones.apache.org/hudson/job/Maven-3.0.x-with-bootstrap/336/changes

Changes:

[jvanzyl] o remove wagon manager from the request populator

------------------------------------------
[...truncated 780 lines...]
     [java] this strategy = org.codehaus.plexus.classworlds.strategy.ForeignStrategy
     [java] Number of imports: 0
     [java] 
     [java] 
     [java] -----------------------------------------------------
     [java] -----------------------------------------------------
     [java] this realm =    plexus.core
     [java] this strategy = org.codehaus.plexus.classworlds.strategy.ForeignStrategy
     [java] Number of imports: 0
     [java] 
     [java] 
     [java] -----------------------------------------------------
     [java] -----------------------------------------------------
     [java] this realm =    plexus.core
     [java] this strategy = org.codehaus.plexus.classworlds.strategy.ForeignStrategy
     [java] Number of imports: 0
     [java] 
     [java] 
     [java] -----------------------------------------------------
     [java] -----------------------------------------------------
     [java] this realm =    plexus.core
     [java] this strategy = org.codehaus.plexus.classworlds.strategy.ForeignStrategy
     [java] Number of imports: 0
     [java] 
     [java] 
     [java] -----------------------------------------------------
     [java] Tests run: 1, Failures: 0, Errors: 1, Skipped: 0, Time elapsed: 0.039 sec <<<
FAILURE!
     [java] Running org.apache.maven.project.ProjectBuilderURITest
     [java] Original URL String:
     [java] jar:file:/c:/Program Files/maven2.1/bin/../lib/maven-project-2.1-SNAPSHOT.jar!/org/apache/maven/project/pom-4.0.0.xml
     [java] URI result:
     [java] jar:file:/c:/Program%20Files/maven2.1/bin/../lib/maven-project-2.1-SNAPSHOT.jar!/org/apache/maven/project/pom-4.0.0.xml
     [java] Tests run: 1, Failures: 0, Errors: 0, Skipped: 0, Time elapsed: 0.008 sec
     [java] Running org.apache.maven.project.artifact.TestModelDefaultsInjector
     [java] Tests run: 0, Failures: 0, Errors: 0, Skipped: 0, Time elapsed: 0.005 sec
     [java] Running org.apache.maven.profiles.activation.FileProfileActivatorTest
     [java] Tests run: 1, Failures: 0, Errors: 0, Skipped: 0, Time elapsed: 0.48 sec
     [java] Running org.apache.maven.project.inheritance.t11.ProjectInheritanceTest
     [java] Tests run: 1, Failures: 0, Errors: 0, Skipped: 0, Time elapsed: 0.353 sec
     [java] Running org.apache.maven.project.inheritance.t02.ProjectInheritanceTest
     [java] Local repository is at: /zonestorage/hudson/home/hudson/hudson/jobs/Maven-3.0.x-with-bootstrap/workspace/trunk/maven-project/src/test/resources/inheritance-repo/t02
     [java] Location of project-4's POM: /zonestorage/hudson/home/hudson/hudson/jobs/Maven-3.0.x-with-bootstrap/workspace/trunk/maven-project/src/test/resources/inheritance-repo/t02/p0/p1/p2/p3/p4/pom.xml
     [java] Tests run: 1, Failures: 0, Errors: 0, Skipped: 0, Time elapsed: 1.461 sec
     [java] Running org.apache.maven.project.inheritance.t06.ProjectInheritanceTest
     [java] Artifact: maven-test:t06-a:jar 1.0 Optional=false
     [java] Artifact: maven-test:t06-b:jar 1.0 Optional=false
     [java] Artifact: maven-test:t06-c:jar 1.0 Optional=false
     [java] Artifact: maven-test:t06-d:jar 1.0 Optional=false
     [java] Tests run: 1, Failures: 0, Errors: 0, Skipped: 0, Time elapsed: 0.22 sec
     [java] Running org.apache.maven.project.ProjectClasspathTest
     [java] -----------------------------------------------------
     [java] this realm =    plexus.core
     [java] this strategy = org.codehaus.plexus.classworlds.strategy.ForeignStrategy
     [java] Number of imports: 0
     [java] 
     [java] 
     [java] -----------------------------------------------------
     [java] -----------------------------------------------------
     [java] this realm =    plexus.core
     [java] this strategy = org.codehaus.plexus.classworlds.strategy.ForeignStrategy
     [java] Number of imports: 0
     [java] 
     [java] 
     [java] -----------------------------------------------------
     [java] -----------------------------------------------------
     [java] this realm =    plexus.core
     [java] this strategy = org.codehaus.plexus.classworlds.strategy.ForeignStrategy
     [java] Number of imports: 0
     [java] 
     [java] 
     [java] -----------------------------------------------------
     [java] -----------------------------------------------------
     [java] this realm =    plexus.core
     [java] this strategy = org.codehaus.plexus.classworlds.strategy.ForeignStrategy
     [java] Number of imports: 0
     [java] 
     [java] 
     [java] -----------------------------------------------------
     [java] -----------------------------------------------------
     [java] this realm =    plexus.core
     [java] this strategy = org.codehaus.plexus.classworlds.strategy.ForeignStrategy
     [java] Number of imports: 0
     [java] 
     [java] 
     [java] -----------------------------------------------------
     [java] -----------------------------------------------------
     [java] this realm =    plexus.core
     [java] this strategy = org.codehaus.plexus.classworlds.strategy.ForeignStrategy
     [java] Number of imports: 0
     [java] 
     [java] 
     [java] -----------------------------------------------------
     [java] -----------------------------------------------------
     [java] this realm =    plexus.core
     [java] this strategy = org.codehaus.plexus.classworlds.strategy.ForeignStrategy
     [java] Number of imports: 0
     [java] 
     [java] 
     [java] -----------------------------------------------------
     [java] -----------------------------------------------------
     [java] this realm =    plexus.core
     [java] this strategy = org.codehaus.plexus.classworlds.strategy.ForeignStrategy
     [java] Number of imports: 0
     [java] 
     [java] 
     [java] -----------------------------------------------------
     [java] Tests run: 1, Failures: 0, Errors: 1, Skipped: 0, Time elapsed: 0.082 sec <<<
FAILURE!
     [java] Running org.apache.maven.project.inheritance.t12scm.ProjectInheritanceTest
     [java] 
     [java] 
     [java] 
     [java] Parent SCM URL is: http://host/viewer?path=/p0
     [java] Child SCM URL is: http://host/viewer?path=/p0/p1
     [java] 
     [java] Parent SCM connection is: scm:svn:http://host/p0
     [java] Child SCM connection is: scm:svn:http://host/p0/p1
     [java] 
     [java] Parent SCM developer connection is: scm:svn:https://host/p0
     [java] Child SCM developer connection is: scm:svn:https://host/p0/p1
     [java] 
     [java] 
     [java] 
     [java] Child SCM URL is: http://host/viewer?path=/p0/p1
     [java] Child SCM connection is: scm:svn:http://host/p0/p1
     [java] Child SCM developer connection is: scm:svn:https://host/p0/p1
     [java] Tests run: 2, Failures: 0, Errors: 0, Skipped: 0, Time elapsed: 0.362 sec
     [java] Running org.apache.maven.project.inheritance.t00.ProjectInheritanceTest
     [java] Tests run: 1, Failures: 0, Errors: 0, Skipped: 0, Time elapsed: 0.432 sec
     [java] Running org.apache.maven.project.validation.DefaultModelValidatorTest
     [java] Tests run: 16, Failures: 0, Errors: 0, Skipped: 0, Time elapsed: 1.167 sec
     [java] Running org.apache.maven.project.inheritance.t01.ProjectInheritanceTest
     [java] Tests run: 1, Failures: 0, Errors: 0, Skipped: 0, Time elapsed: 0.802 sec
     [java] Running org.apache.maven.project.inheritance.t07.ProjectInheritanceTest
     [java] Project maven-t07:p1:pom:1.0 MavenProject: maven-t07:p1:1.0 @ /zonestorage/hudson/home/hudson/hudson/jobs/Maven-3.0.x-with-bootstrap/workspace/trunk/maven-project/src/test/resources/inheritance-repo/t07/p0/p1/pom.xml
     [java] Artifact: maven-test:t07-a:jar 1.0 Optional=false
     [java] Artifact: maven-test:t07-b:jar 1.0 Optional=false
     [java] Artifact: maven-test:t07-c:jar 1.0 Optional=false
     [java] Tests run: 1, Failures: 0, Errors: 0, Skipped: 0, Time elapsed: 0.92 sec
     [java] Running org.apache.maven.project.inheritance.t05.ProjectInheritanceTest
     [java] Artifact: maven-test:t05-a:jar 1.0 Scope: runtime
     [java] Artifact: maven-test:t05-b:jar 1.0 Scope: runtime
     [java] Artifact: maven-test:t05-c:jar 1.0 Scope: runtime
     [java] Artifact: maven-test:t05-d:jar 1.0 Scope: runtime
     [java] Tests run: 1, Failures: 0, Errors: 0, Skipped: 0, Time elapsed: 0.487 sec
     [java] Running org.apache.maven.project.injection.TestProfileInjector
     [java] Tests run: 0, Failures: 0, Errors: 0, Skipped: 0, Time elapsed: 0.003 sec
     [java] Running org.apache.maven.project.artifact.MavenMetadataSourceTest
     [java] Tests run: 3, Failures: 0, Errors: 0, Skipped: 0, Time elapsed: 0.26 sec
     [java] Running org.apache.maven.project.inheritance.t12.ProjectInheritanceTest
     [java] Tests run: 1, Failures: 0, Errors: 0, Skipped: 0, Time elapsed: 0.1 sec
     [java] Running org.apache.maven.project.TestArtifactResolver
     [java] Tests run: 0, Failures: 0, Errors: 0, Skipped: 0, Time elapsed: 0.004 sec
     [java] Running org.apache.maven.project.builder.PomConstructionTest
     [java] [src/main/filters/child-a.properties, src/main/filters/child-c.properties, src/main/filters/child-b.properties,
src/main/filters/child-d.properties, src/main/filters/parent-c.properties, src/main/filters/parent-b.properties,
src/main/filters/parent-d.properties]
     [java] Tests run: 54, Failures: 0, Errors: 0, Skipped: 0, Time elapsed: 6.715 sec
     [java] Running org.apache.maven.project.SuperPomProjectBuilderTest
     [java] Tests run: 1, Failures: 0, Errors: 0, Skipped: 0, Time elapsed: 0.079 sec
     [java] Running org.apache.maven.project.inheritance.t08.ProjectInheritanceTest
     [java] Project maven-t08:p1:pom:1.0 MavenProject: maven-t08:p1:1.0 @ /zonestorage/hudson/home/hudson/hudson/jobs/Maven-3.0.x-with-bootstrap/workspace/trunk/maven-project/src/test/resources/inheritance-repo/t08/p0/p1/pom.xml
     [java] Artifact: maven-test:t08-a:jar 1.0 Optional=false
     [java] Artifact: maven-test:t08-b:jar 1.0 Optional=false
     [java] Artifact: maven-test:t08-c:jar 1.0 Optional=false
     [java] Artifact: maven-test:t08-d:jar 1.0 Optional=true
     [java] Tests run: 1, Failures: 0, Errors: 0, Skipped: 0, Time elapsed: 0.236 sec
     [java] Running org.apache.maven.project.inheritance.t03.ProjectInheritanceTest
     [java] Tests run: 1, Failures: 0, Errors: 0, Skipped: 0, Time elapsed: 0.112 sec
     [java] Running org.apache.maven.profiles.activation.SystemPropertyProfileActivatorTest
     [java] Tests run: 4, Failures: 0, Errors: 0, Skipped: 0, Time elapsed: 0.005 sec
     [java] Running org.apache.maven.project.DefaultMavenProjectBuilderTest
     [java] Tests run: 2, Failures: 0, Errors: 0, Skipped: 0, Time elapsed: 0.171 sec
     [java] Running org.apache.maven.project.injection.DefaultModelDefaultsInjectorTest
     [java] Tests run: 11, Failures: 0, Errors: 0, Skipped: 0, Time elapsed: 0.024 sec
     [java] Running org.apache.maven.profiles.injection.DefaultProfileInjectorTest
     [java] Tests run: 7, Failures: 0, Errors: 0, Skipped: 0, Time elapsed: 0.009 sec
     [java] Running org.apache.maven.project.inheritance.t10.ProjectInheritanceTest
     [java] Project maven-t10:p1:pom:1.0 MavenProject: maven-t10:p1:1.0 @ /zonestorage/hudson/home/hudson/hudson/jobs/Maven-3.0.x-with-bootstrap/workspace/trunk/maven-project/src/test/resources/inheritance-repo/t10/p0/p1/pom.xml
     [java] Tests run: 1, Failures: 0, Errors: 0, Skipped: 0, Time elapsed: 0.324 sec
     [java] Running org.apache.maven.project.ModelUtilsTest
     [java] Tests run: 15, Failures: 0, Errors: 0, Skipped: 0, Time elapsed: 0.014 sec
     [java] Running org.apache.maven.project.TestProjectBuilder
     [java] Tests run: 0, Failures: 0, Errors: 0, Skipped: 0, Time elapsed: 0.001 sec
     [java] Running org.apache.maven.profiles.manager.DefaultProfileManagerTest
     [java] [WARNING] Cannot locate java version property: java.version. NOT enabling profile:
notActivated
     [java] Tests run: 6, Failures: 0, Errors: 0, Skipped: 0, Time elapsed: 0.103 sec
     [java] Running org.apache.maven.project.inheritance.t09.ProjectInheritanceTest
     [java] Tests run: 2, Failures: 0, Errors: 0, Skipped: 0, Time elapsed: 0.216 sec
     [java] 
     [java] Results :
     [java] 
     [java] Tests in error: 
     [java]   testProjectBuilder(org.apache.maven.project.canonical.CanonicalProjectBuilderTest)
     [java]   testProjectClasspath(org.apache.maven.project.ProjectClasspathTest)
     [java] 
     [java] Tests run: 148, Failures: 0, Errors: 2, Skipped: 0
     [java] 
     [java] [INFO] 
     [java] [INFO] 
     [java] [INFO] ------------------------------------------------------------------------
     [java] [INFO] Reactor Summary:
     [java] [INFO] ------------------------------------------------------------------------
     [java] [INFO] Apache Maven .......................................... SUCCESS [16.464s]
     [java] [INFO] Maven Lifecycle Model ................................. SUCCESS [15.394s]
     [java] [INFO] Maven Reporting API ................................... SUCCESS [2.734s]
     [java] [INFO] Maven Model ........................................... SUCCESS [9.188s]
     [java] [INFO] Maven Compat .......................................... SUCCESS [34.843s]
     [java] [INFO] Maven Plugin API ...................................... SUCCESS [8.953s]
     [java] [INFO] Maven Project Builder ................................. SUCCESS [9.282s]
     [java] [INFO] Maven Mercury ......................................... SUCCESS [9.910s]
     [java] [INFO] Maven Project ......................................... FAILED [47.968s]
     [java] [INFO] Maven Core ............................................ NOT BUILT
     [java] [INFO] Maven Toolchains ...................................... NOT BUILT
     [java] [INFO] Maven Embedder ........................................ NOT BUILT
     [java] [INFO] Maven Distribution .................................... NOT BUILT
     [java] [INFO] ------------------------------------------------------------------------
     [java] [ERROR] 
     [java] There are test failures.
     [java] 
     [java] Please refer to /zonestorage/hudson/home/hudson/hudson/jobs/Maven-3.0.x-with-bootstrap/workspace/trunk/maven-project/target/surefire-reports
for the individual test results.null
     [java] Error stacktrace:
     [java] org.apache.maven.ProjectBuildFailureException: Build for project: org.apache.maven:maven-project:jar:3.0-SNAPSHOT
failed during execution of mojo: org.apache.maven.plugins:maven-surefire-plugin:2.4.2:test
     [java] 	at org.apache.maven.lifecycle.DefaultLifecycleExecutor.executeTaskSegmentForProject(DefaultLifecycleExecutor.java:286)
     [java] 	at org.apache.maven.lifecycle.DefaultLifecycleExecutor.executeTaskSegments(DefaultLifecycleExecutor.java:200)
     [java] 	at org.apache.maven.lifecycle.DefaultLifecycleExecutor.execute(DefaultLifecycleExecutor.java:163)
     [java] 	at org.apache.maven.DefaultMaven.execute(DefaultMaven.java:207)
     [java] 	at org.apache.maven.embedder.MavenEmbedder.execute(MavenEmbedder.java:851)
     [java] 	at org.apache.maven.cli.MavenCli.doMain(MavenCli.java:167)
     [java] 	at org.apache.maven.cli.MavenCli.main(MavenCli.java:62)
     [java] 	at org.apache.maven.cli.MavenCli.main(MavenCli.java:51)
     [java] Caused by: org.apache.maven.plugin.MojoFailureException: There are test failures.
     [java] 
     [java] Please refer to /zonestorage/hudson/home/hudson/hudson/jobs/Maven-3.0.x-with-bootstrap/workspace/trunk/maven-project/target/surefire-reports
for the individual test results.
     [java] 	at org.apache.maven.plugin.surefire.SurefirePlugin.execute(SurefirePlugin.java:530)
     [java] 	at org.apache.maven.plugin.DefaultPluginManager.executeMojo(DefaultPluginManager.java:628)
     [java] 	at org.apache.maven.lifecycle.DefaultLifecycleExecutor.executeGoalAndHandleFailures(DefaultLifecycleExecutor.java:491)
     [java] 	at org.apache.maven.lifecycle.DefaultLifecycleExecutor.executeTaskSegmentForProject(DefaultLifecycleExecutor.java:258)
     [java] 	... 7 more
     [java] 
     [java] [INFO] ------------------------------------------------------------------------
     [java] [INFO] BUILD FAILED
     [java] [INFO] ------------------------------------------------------------------------
     [java] [INFO] Total time: 3 minutes 3 seconds
     [java] [INFO] Finished at: Sat Feb 21 16:21:40 UTC 2009
     [java] [INFO] Final Memory: 34M/192M
     [java] [INFO] ------------------------------------------------------------------------

BUILD FAILED
/zonestorage/hudson/home/hudson/hudson/jobs/Maven-3.0.x-with-bootstrap/workspace/trunk/build.xml:203:
Java returned: 1

Total time: 4 minutes 37 seconds


Mime
View raw message