maven-notifications mailing list archives

Site index · List index
Message view « Date » · « Thread »
Top « Date » · « Thread »
From Hudson <Hud...@sonatype.org>
Subject Build failed in Hudson: Maven-2.1.x-bootstrap » 1.4,ubuntu #120
Date Wed, 04 Mar 2009 14:47:40 GMT
See http://grid.sonatype.org/ci/job/Maven-2.1.x-bootstrap/./jdk=1.4,label=ubuntu/120/changes

Changes:

[Brett Porter] [MNG-3641] move profile activation check to span all projects at once in a
reactor

[Brett Porter] [MNG-3379] avoid deadlocking on remote errors, check test coverage for the
new code including exceptional cases

------------------------------------------
[...truncated 4838 lines...]
     [exec] mng3372DirectInvocationOfPlugins(itMNG3372).................OK (12.0 s)
     [exec] mng3372DirectInvocationOfPlugins(DependencyTreeInvocation)..OK (17.3 s)
     [exec] mng3355TranslatedPathInterpolation(itMNG3355)...............OK (2.8 s)
     [exec] mng3331ModulePathNormalization(itMNG3331a)..................OK (1.7 s)
     [exec] mng3331ModulePathNormalization(itMNG3331b)..................OK (2.1 s)
     [exec] mng3314OfflineSnapshots(itMNG3314)..........................OK (4.7 s)
     [exec] mng3288SystemScopeDir(itMNG3288)............................OK (2.6 s)
     [exec] mng3284UsingCachedPlugins(itMNG3284)........................OK (9.0 s)
     [exec] mng3271DefaultReportsSuppression(itMNG3271).................OK (2.2 s)
     [exec] mng3221InfiniteForking(itMNG3221a)..........................OK (17.3 s)
     [exec] mng3221InfiniteForking(itMNG3221b)..........................OK (13.2 s)
     [exec] mng3268MultipleDashPCommandLine(MultipleProfileParams)......OK (5.5 s)
     [exec] mng3259DepsDroppedInMultiModuleBuild(itMNG3259).............OK (21.5 s)
     [exec] mng3220ImportScope(itMNG3220a)..............................OK (12.2 s)
     [exec] mng3220ImportScope(itMNG3220b)..............................OK (1.2 s)
     [exec] mng3217InterPluginDependency(itMNG3217).....................OK (6.9 s)
     [exec] mng3139UseCachedMetadataOfBlacklistedRepo(itMNG3139)........OK (5.5 s)
     [exec] mng3106ProfileMultipleActivators(ProfilesWithMultipleActivators)..OK (4.7 s)
     [exec] mng3099SettingsProfilesWithNoPom(itMNG3099).................OK (10.4 s)
     [exec] mng3057VersionExprTransformations(itMNG3057)................OK (10.0 s)
     [exec] mng3052DepRepoAggregation(itMNG3052)........................OK (21.7 s)
     [exec] mng3023ReactorDependencyResolution(itMNG3023A)..............OK (2.6 s)
     [exec] mng3023ReactorDependencyResolution(itMNG3023B)..............OK (2.0 s)
     [exec] mng3023ReactorDependencyResolution(itMNG3023C)..............OK (4.2 s)
     [exec] mng3012CoreClassImport(itMNG3012)...........................OK (4.1 s)
     [exec] mng2972OverridePluginDependency(itLifecycleInvocation)......OK (2.6 s)
     [exec] mng2972OverridePluginDependency(itCommandLineInvocation)....OK (2.1 s)
     [exec] mng2926PluginPrefixOrder(itMNG2926).........................OK (2.4 s)
     [exec] mng2921ActiveAttachedArtifacts(itMNG2921)...................OK (1.8 s)
     [exec] mng2892HideCorePlexusUtils(itMNG2892).......................OK (3.4 s)
     [exec] mng2883LegacyRepoOffline(ParentUnresolvable)................OK (5.6 s)
     [exec] mng2883LegacyRepoOffline(DependencyUnresolvable)............OK (4.7 s)
     [exec] mng2883LegacyRepoOffline(PluginUnresolvable)................OK (3.5 s)
     [exec] mng2878DefaultReportXmlImport(itMNG2878)....................OK (1.5 s)
     [exec] mng2871PrePackageSubartifactResolution(itMNG2871)...........SKIPPED - version
2.1.0-SNAPSHOT not in range [3.0-alpha-1,)
     [exec] mng2865MirrorWildcard(itUserRepos)..........................OK (1.7 s)
     [exec] mng2865MirrorWildcard(itCentralRepo)........................OK (1.2 s)
     [exec] mng2861RelocationsAndRanges(itMNG2861)......................OK (3.5 s)
     [exec] mng2843PluginConfigPropertiesInjection(itMNG2843)...........OK (2.3 s)
     [exec] mng2831CustomArtifactHandlerAndCustomLifecycle(itMNG2831)...OK (2.7 s)
     [exec] mng2820PomComments(it)......................................OK (2.1 s)
     [exec] mng2790LastUpdatedMetadata(itMNG2790).......................OK (3.8 s)
     [exec] mng2749ExtensionAvailableToPlugin(itMNG2749)................OK (4.5 s)
     [exec] mng2744checksumVerification(itMNG2744)......................OK (2.7 s)
     [exec] mng2739RequiredRepositoryElements(itMNG2739_RepositoryId)...OK (1.5 s)
     [exec] mng2739RequiredRepositoryElements(itMNG2739_RepositoryUrl)..OK (1.2 s)
     [exec] mng2720SiblingClasspathArtifacts(IT)........................OK (2.2 s)
     [exec] mng2695OfflinePluginSnapshots(itMNG2695)....................OK (3.8 s)
     [exec] mng2690MojoLoadingErrors(NoClassDefFromMojoLoad)............OK (1.8 s)
     [exec] mng2690MojoLoadingErrors(NoClassDefFromMojoConfiguration)...OK (2.2 s)
     [exec] mng2690MojoLoadingErrors(MojoComponentLookupException)......OK (2.5 s)
     [exec] mng2690MojoLoadingErrors(MojoRequirementComponentLookupException)..OK (2.7 s)
     [exec] mng2668UsePluginDependenciesForSorting(itMNG2668)...........OK (2.1 s)
     [exec] mng2605BogusProfileActivation(itMNG2605)....................OK (1.6 s)
     [exec] mng2591MergeInheritedPluginConfig(itMNG2591)................OK (2.5 s)
     [exec] mng2562Timestamp(itMNG2562).................................OK (1.6 s)
     [exec] mng2539PluginDependenciesComeFromPluginRepos(itMNG2539).....OK (2.4 s)
     [exec] mng2387InactiveProxy(itFirstMatchWins)......................OK (1.7 s)
     [exec] mng2362DeployedPomEncoding(it)..............................OK (1.7 s)
     [exec] mng2339BadProjectInterpolation(itMNG2339a)..................OK (2.2 s)
     [exec] mng2339BadProjectInterpolation(itMNG2339b)..................OK (3.5 s)
     [exec] mng2318LocalParentResolution(itMNG2318).....................OK (1.0 s)
     [exec] mng2293CustomPluginParamImpl(itMNG2293).....................OK (1.2 s)
     [exec] mng2277AggregatorAndResolutionPlugins(itMNG2277)............OK (1.6 s)
     [exec] mng2254PomEncoding(itMNG2254)...............................OK (1.4 s)
     [exec] mng2234ActiveProfilesFromSettings(itMNG2234)................OK (1.3 s)
     [exec] mng2228ComponentInjection(itMNG2228)........................OK (4.9 s)
     [exec] mng2201PluginConfigInterpolation(itMNG2201).................OK (1.3 s)
     [exec] mng2196ParentResolution(itMNG2196)..........................OK (1.0 s)
     [exec] mng2174PluginDepsManagedByParentProfile(itMNG2174)..........OK (3.3 s)
     [exec] mng2136ActiveByDefaultProfile(itMNG2136)....................OK (1.2 s)
     [exec] mng2130ParentLookupFromReactorCache(itMNG2130)..............OK (0.9 s)
     [exec] mng2124PomInterpolationWithParentValues(itMNG2124)..........OK (1.4 s)
     [exec] mng2123VersionRangeDependency(itMNG2123)....................OK (4.1 s)
     [exec] mng2068ReactorRelativeParents(itInheritedIdFields)..........OK (0.9 s)
     [exec] mng2068ReactorRelativeParents(itExplicitIdFields)...........OK (1.0 s)
     [exec] mng2068ReactorRelativeParents(itComplex)....................OK (1.1 s)
     [exec] mng2054PluginExecutionInheritance(itMNG2054)................OK (1.3 s)
     [exec] mng2052InterpolateWithSettingsProfileProperties(itMNG2052)..OK (1.3 s)
     [exec] mng2045testJarDependenciesBrokenInReactor(itMNG2045)........OK (1.7 s)
     [exec] mng2006ChildPathAwareUrlInheritance(itMNG2006)..............OK (1.3 s)
     [exec] mng1999DefaultReportsInheritance(itInheritSuppression)......OK (1.3 s)
     [exec] mng1999DefaultReportsInheritance(itOverrideSuppression).....OK (6.3 s)
     [exec] mng1995InterpolateBooleanModelElements(itMNG1995)...........SKIPPED - version
2.1.0-SNAPSHOT not in range [3.0-alpha-1,)
     [exec] mng1992SystemPropOverridesPomProp(itMNG1992)................OK (1.4 s)
     [exec] mng1957JdkActivationWithVersionRange(itMNG1957).............OK (1.3 s)
     [exec] mng1908LegacySnapshotUpdate(itMNG1908)......................OK (1.4 s)
     [exec] mng1830ShowVersion(Version).................................OK (1.0 s)
     [exec] mng1703PluginMgmtDepInheritance(itMNG1703)..................OK (3.5 s)
     [exec] mng1493NonStandardModulePomNames(itMNG1493).................OK (0.8 s)
     [exec] mng1491ReactorArtifactIdCollision(itMNG1491)................OK (0.9 s)
     [exec] mng1415QuotedSystemProperties(itMNG1415)....................OK (1.3 s)
     [exec] mng1412DependenciesOrder(itMNG1412).........................OK (3.7 s)
     [exec] mng1349ChecksumFormats(itMNG1349)...........................OK (5.0 s)
     [exec] mng1323AntrunDependencies(itMNG1323)........................SKIPPED - version
2.1.0-SNAPSHOT not in range [3.0-alpha-1,)
     [exec] mng1233WarDepWithProvidedScope(itMNG1233)...................OK (2.5 s)
     [exec] mng1088ReactorDepResolution(itMNG1088)......................OK (2.2 s)
     [exec] mng1052PluginMngtConfig(itMNG1052)..........................OK (1.4 s)
     [exec] mng1021EqualAttachmentBuildNumber(itMNG1021)................OK (1.4 s)
     [exec] mng0985NonExecutedPluginMngtGoals(itMNG0985)................OK (0.8 s)
     [exec] mng0956ComponentInjectionViaProjectLevelPluginDep(itMNG0956)..OK (2.7 s)
     [exec] mng0947OptionalDependency(it)...............................OK (2.2 s)
     [exec] mng0870ReactorAwarePluginDiscovery(itMNG0870)...............OK (2.7 s)
     [exec] mng0866EvaluateDefaultValue(itMNG866).......................OK (1.4 s)
     [exec] mng0848SystemPropOverridesDefaultValue(itMNG848)............OK (1.3 s)
     [exec] mng0836PluginParentResolution(itMNG836).....................OK (1.9 s)
     [exec] mng0823MojoContextPassing(itMNG0823)........................OK (1.3 s)
     [exec] mng0820ConflictResolution(itMNG0820)........................OK (3.8 s)
     [exec] mng0818WarDepsNotTransitive(itMNG0818)......................OK (1.9 s)
     [exec] mng0814ExplicitProfileActivation(itMNG814)..................OK (1.4 s)
     [exec] mng0786ProfileAwareReactor(itMNG0786).......................OK (1.4 s)
     [exec] mng0781PluginConfigVsExecConfig(itMNG0781)..................OK (1.7 s)
     [exec] mng0773SettingsProfileReactorPollution(itMNG773)............OK (0.9 s)
     [exec] mng0768OfflineMode(itMNG768)................................OK (4.2 s)
     [exec] mng0761MissingSnapshotDistRepo(itMNG761)....................OK (1.5 s)
     [exec] mng0731LegacyRepoLayout(itMNG731)...........................OK (1.5 s)
     [exec] mng0680ParentBasedir(itMNG680)..............................OK (1.3 s)
     [exec] mng0674PluginParameterAlias(itMNG674).......................OK (1.5 s)
     [exec] mng0666IgnoreLegacyPom(itMNG666)............................OK (1.9 s)
     [exec] mng0557UserSettingsCliOption(itMNG557)......................OK (1.3 s)
     [exec] mng0553SettingsAuthzEncryption(itBasic).....................OK (1.8 s)
     [exec] mng0553SettingsAuthzEncryption(itRelocation)................OK (1.8 s)
     [exec] mng0522PluginMgmtConfig(itMNG522)...........................OK (1.8 s)
     [exec] mng0507ArtifactRelocation(itMNG507).........................OK (1.5 s)
     [exec] mng0505VersionRange(itMNG505)...............................OK (1.3 s)
     [exec] mng0496IgnoreUnknownPluginParameters(itMNG496)..............OK (1.3 s)
     [exec] mng0479OverrideCentralRepo(itMNG479)........................OK (2.4 s)
     [exec] mng0471CustomLifecycle(itMNG471)............................OK (1.4 s)
     [exec] mng0469ReportConfig(itReportConfigOverridesBuildDefaults)...OK (1.4 s)
     [exec] mng0469ReportConfig(itBuildConfigDominantDuringBuild).......OK (1.4 s)
     [exec] mng0469ReportConfig(itBuildConfigIrrelevantForReports)......OK (1.8 s)
     [exec] mng0449PluginVersionResolution(itLifecycleInvocation).......OK (1.6 s)
     [exec] mng0449PluginVersionResolution(itCliInvocation).............OK (1.8 s)
     [exec] mng0377PluginLookupFromPrefix(itMNG377).....................OK (2.9 s)
     [exec] mng0294MergeGlobalAndUserSettings(itMNG294).................OK (1.5 s)
     [exec] mng0282NonReactorExecWhenProjectIndependent(itMNG282).......OK (1.5 s)
     [exec] mng0249ResolveDepsFromReactor(itMNG0249)....................OK (1.7 s)
     [exec] mng0095ReactorFailureBehavior(itFailFast)...................OK (1.6 s)
     [exec] mng0095ReactorFailureBehavior(itFailNever)..................OK (1.6 s)
     [exec] mng0095ReactorFailureBehavior(itFailAtEnd)..................OK (1.7 s)
     [exec] 0144LifecycleExecutionOrder(it0144).........................OK (2.8 s)
     [exec] 0143TransitiveDependencyScopes(itCompileScope)..............OK (3.6 s)
     [exec] 0143TransitiveDependencyScopes(itProvidedScope).............OK (3.6 s)
     [exec] 0143TransitiveDependencyScopes(itRuntimeScope)..............OK (3.4 s)
     [exec] 0143TransitiveDependencyScopes(itTestScope).................OK (3.2 s)
     [exec] 0142DirectDependencyScopes(it0142)..........................OK (3.9 s)
     [exec] 0140(it0140)................................................OK (1.9 s)
     [exec] 0139(it0139)................................................OK (2.1 s)
     [exec] 0138PluginLifecycle(it0138).................................OK (2.8 s)
     [exec] 0137EarLifecycle(it0137)....................................OK (2.8 s)
     [exec] 0136RarLifecycle(it0136)....................................OK (2.8 s)
     [exec] 0135EjbLifecycle(it0135)....................................OK (2.5 s)
     [exec] 0134WarLifecycle(it0134)....................................OK (2.5 s)
     [exec] 0133JarLifecycle(it0133)....................................OK (2.4 s)
     [exec] 0132PomLifecycle(it0132)....................................OK (1.9 s)
     [exec] 0131SiteLifecycle(it0131)...................................OK (1.8 s)
     [exec] 0130CleanLifecycle(it0130)..................................OK (2.1 s)
     [exec] 0113ServerAuthzAvailableToWagonMgrInPlugin(it0113)..........OK (1.6 s)
     [exec] 0090(it0090)................................................OK (1.7 s)
     [exec] 0087(it0087)................................................OK (3.0 s)
     [exec] 0086(it0086)................................................OK (1.7 s)
     [exec] 0085(it0085)................................................OK (2.3 s)
     [exec] 0072(it0072)................................................OK (1.5 s)
     [exec] 0071(it0071)................................................OK (1.7 s)
     [exec] 0064(it0064)................................................OK (1.4 s)
     [exec] 0063(it0063)................................................OK (1.5 s)
     [exec] 0056(it0056)................................................OK (1.4 s)
     [exec] 0052(it0052)................................................OK (2.2 s)
     [exec] 0051(it0051)................................................OK (3.2 s)
     [exec] 0041(it0041)................................................OK (1.8 s)
     [exec] 0040(it0040)................................................OK (1.3 s)
     [exec] 0039(it0039)................................................OK (1.5 s)
     [exec] 0038(it0038)................................................OK (1.3 s)
     [exec] 0037(it0037)................................................OK (1.4 s)
     [exec] 0036(it0036)................................................OK (1.3 s)
     [exec] 0032(it0032)................................................OK (0.9 s)
     [exec] 0030(it0030)................................................OK (5.6 s)
     [exec] 0025(it0025)................................................OK (1.5 s)
     [exec] 0024(it0024)................................................OK (1.3 s)
     [exec] 0023(it0023)................................................OK (1.3 s)
     [exec] 0021(it0021)................................................OK (2.5 s)
     [exec] 0019(it0019)................................................OK (1.8 s)
     [exec] 0018(it0018)................................................OK (2.8 s)
     [exec] 0012(it0012)................................................OK (1.5 s)
     [exec] 0011(it0011)................................................OK (2.5 s)
     [exec] 0010(it0010)................................................OK (2.8 s)
     [exec] 0009(it0009)................................................OK (1.5 s)
     [exec] 0008(it0008)................................................OK (2.9 s)
     [exec] Tests run: 348, Failures: 1, Errors: 0, Skipped: 0, Time elapsed: 1,202.089 sec
<<< FAILURE!
     [exec] testitMNG3641(org.apache.maven.it.MavenITmng3641ProfileActivationWarningTest)
 Time elapsed: 5.637 sec  <<< FAILURE!
     [exec] junit.framework.AssertionFailedError
     [exec] 	at junit.framework.Assert.fail(Assert.java:47)
     [exec] 	at junit.framework.Assert.assertTrue(Assert.java:20)
     [exec] 	at junit.framework.Assert.assertTrue(Assert.java:27)
     [exec] 	at org.apache.maven.it.MavenITmng3641ProfileActivationWarningTest.testitMNG3641(MavenITmng3641ProfileActivationWarningTest.java:71)
     [exec] 
     [exec] 
     [exec] Results :
     [exec] 
     [exec] Failed tests: 
     [exec]   testitMNG3641(org.apache.maven.it.MavenITmng3641ProfileActivationWarningTest)
     [exec] 
     [exec] Tests run: 348, Failures: 1, Errors: 0, Skipped: 0
     [exec] 
     [exec] [INFO] ------------------------------------------------------------------------
     [exec] [ERROR] BUILD FAILURE
     [exec] [INFO] ------------------------------------------------------------------------
     [exec] [INFO] There are test failures.
     [exec] 
     [exec] Please refer to /tmp/maven-integration-tests-2.1.x/core-it-suite/target/surefire-reports
for the individual test results.
     [exec] [INFO] ------------------------------------------------------------------------
     [exec] [INFO] Trace
     [exec] org.apache.maven.BuildFailureException: There are test failures.
     [exec] 
     [exec] Please refer to /tmp/maven-integration-tests-2.1.x/core-it-suite/target/surefire-reports
for the individual test results.
     [exec] 	at org.apache.maven.lifecycle.DefaultLifecycleExecutor.executeGoals(DefaultLifecycleExecutor.java:698)
     [exec] 	at org.apache.maven.lifecycle.DefaultLifecycleExecutor.executeGoalWithLifecycle(DefaultLifecycleExecutor.java:539)
     [exec] 	at org.apache.maven.lifecycle.DefaultLifecycleExecutor.executeGoal(DefaultLifecycleExecutor.java:518)
     [exec] 	at org.apache.maven.lifecycle.DefaultLifecycleExecutor.executeGoalAndHandleFailures(DefaultLifecycleExecutor.java:370)
     [exec] 	at org.apache.maven.lifecycle.DefaultLifecycleExecutor.executeTaskSegments(DefaultLifecycleExecutor.java:331)
     [exec] 	at org.apache.maven.lifecycle.DefaultLifecycleExecutor.execute(DefaultLifecycleExecutor.java:181)
     [exec] 	at org.apache.maven.DefaultMaven.doExecute(DefaultMaven.java:355)
     [exec] 	at org.apache.maven.DefaultMaven.execute(DefaultMaven.java:136)
     [exec] 	at org.apache.maven.cli.MavenCli.main(MavenCli.java:356)
     [exec] 	at sun.reflect.NativeMethodAccessorImpl.invoke0(Native Method)
     [exec] 	at sun.reflect.NativeMethodAccessorImpl.invoke(NativeMethodAccessorImpl.java:39)
     [exec] 	at sun.reflect.DelegatingMethodAccessorImpl.invoke(DelegatingMethodAccessorImpl.java:25)
     [exec] 	at java.lang.reflect.Method.invoke(Method.java:324)
     [exec] 	at org.codehaus.classworlds.Launcher.launchEnhanced(Launcher.java:315)
     [exec] 	at org.codehaus.classworlds.Launcher.launch(Launcher.java:255)
     [exec] 	at org.codehaus.classworlds.Launcher.mainWithExitCode(Launcher.java:430)
     [exec] 	at org.codehaus.classworlds.Launcher.main(Launcher.java:375)
     [exec] Caused by: org.apache.maven.plugin.MojoFailureException: There are test failures.
     [exec] 
     [exec] Please refer to /tmp/maven-integration-tests-2.1.x/core-it-suite/target/surefire-reports
for the individual test results.
     [exec] 	at org.apache.maven.plugin.surefire.SurefirePlugin.execute(SurefirePlugin.java:575)
     [exec] 	at org.apache.maven.plugin.DefaultPluginManager.executeMojo(DefaultPluginManager.java:458)
     [exec] 	at org.apache.maven.lifecycle.DefaultLifecycleExecutor.executeGoals(DefaultLifecycleExecutor.java:677)
     [exec] 	... 16 more
     [exec] [INFO] ------------------------------------------------------------------------
     [exec] [INFO] Total time: 21 minutes 47 seconds
     [exec] [INFO] Finished at: Wed Mar 04 08:47:39 GMT-06:00 2009
     [exec] [INFO] Final Memory: 31M/79M
     [exec] [INFO] ------------------------------------------------------------------------

BUILD FAILED
/home/hudson/workspace/Maven-2.1.x-bootstrap/jdk/1.4/label/ubuntu/maven-2.1.x/build.xml:289:
exec returned: 1

Total time: 23 minutes 52 seconds


Mime
View raw message