maven-notifications mailing list archives

Site index · List index
Message view « Date » · « Thread »
Top « Date » · « Thread »
From Hudson <Hud...@sonatype.org>
Subject Build failed in Hudson: Maven 2.1.x » 1.5,windows #103
Date Fri, 13 Mar 2009 21:15:33 GMT
See http://grid.sonatype.org/ci/job/Maven%202.1.x/./jdk=1.5,label=windows/103/changes

Changes:

[Benjamin Bentmann] o Fixed nesting of if's

------------------------------------------
[...truncated 433 lines...]
[INFO] [resources:resources]
[INFO] Using encoding: 'UTF-8' to copy filtered resources.
[INFO] [compiler:compile]
[INFO] Compiling 4 source files to C:\home\hudson\workspace\Maven 2.1.x\jdk\1.5\label\windows\maven-2.1.xx\maven-plugin-parameter-documenter\target\classes
[INFO] [resources:testResources]
[INFO] Using encoding: 'UTF-8' to copy filtered resources.
[INFO] [compiler:testCompile]
[INFO] Compiling 1 source file to C:\home\hudson\workspace\Maven 2.1.x\jdk\1.5\label\windows\maven-2.1.xx\maven-plugin-parameter-documenter\target\test-classes
[INFO] [surefire:test]
[INFO] Surefire report directory: C:\home\hudson\workspace\Maven 2.1.x\jdk\1.5\label\windows\maven-2.1.xx\maven-plugin-parameter-documenter\target\surefire-reports

-------------------------------------------------------
 T E S T S
-------------------------------------------------------
Running org.apache.maven.usability.plugin.Xpp3ParseTest
Tests run: 1, Failures: 0, Errors: 0, Skipped: 0, Time elapsed: 0.344 sec

Results :

Tests run: 1, Failures: 0, Errors: 0, Skipped: 0

[INFO] [jar:jar]
[INFO] Building jar: C:\home\hudson\workspace\Maven 2.1.x\jdk\1.5\label\windows\maven-2.1.xx\maven-plugin-parameter-documenter\target\maven-plugin-parameter-documenter-2.1.1-SNAPSHOT.jar
[INFO] [install:install]
[INFO] Installing C:\home\hudson\workspace\Maven 2.1.x\jdk\1.5\label\windows\maven-2.1.xx\maven-plugin-parameter-documenter\target\maven-plugin-parameter-documenter-2.1.1-SNAPSHOT.jar
to \opt\repos\maven-2.1.x\org\apache\maven\maven-plugin-parameter-documenter\2.1.1-SNAPSHOT\maven-plugin-parameter-documenter-2.1.1-SNAPSHOT.jar
[INFO] ------------------------------------------------------------------------
[INFO] Building Maven Reporting
[INFO]    task-segment: [clean, install]
[INFO] ------------------------------------------------------------------------
[INFO] [clean:clean]
[INFO] Deleting directory C:\home\hudson\workspace\Maven 2.1.x\jdk\1.5\label\windows\maven-2.1.xx\maven-reporting\target
[INFO] Deleting directory C:\home\hudson\workspace\Maven 2.1.x\jdk\1.5\label\windows\maven-2.1.xx\maven-reporting\target\classes
[INFO] Deleting directory C:\home\hudson\workspace\Maven 2.1.x\jdk\1.5\label\windows\maven-2.1.xx\maven-reporting\target\test-classes
[INFO] Deleting directory C:\home\hudson\workspace\Maven 2.1.x\jdk\1.5\label\windows\maven-2.1.xx\maven-reporting\target\site
[INFO] [remote-resources:process {execution: default}]
[INFO] [site:attach-descriptor]
[INFO] [install:install]
[INFO] Installing C:\home\hudson\workspace\Maven 2.1.x\jdk\1.5\label\windows\maven-2.1.xx\maven-reporting\pom.xml
to \opt\repos\maven-2.1.x\org\apache\maven\reporting\maven-reporting\2.1.1-SNAPSHOT\maven-reporting-2.1.1-SNAPSHOT.pom
[INFO] ------------------------------------------------------------------------
[INFO] Building Maven Reporting API
[INFO]    task-segment: [clean, install]
[INFO] ------------------------------------------------------------------------
[INFO] [clean:clean]
[INFO] Deleting directory C:\home\hudson\workspace\Maven 2.1.x\jdk\1.5\label\windows\maven-2.1.xx\maven-reporting\maven-reporting-api\target
[INFO] Deleting directory C:\home\hudson\workspace\Maven 2.1.x\jdk\1.5\label\windows\maven-2.1.xx\maven-reporting\maven-reporting-api\target\classes
[INFO] Deleting directory C:\home\hudson\workspace\Maven 2.1.x\jdk\1.5\label\windows\maven-2.1.xx\maven-reporting\maven-reporting-api\target\test-classes
[INFO] Deleting directory C:\home\hudson\workspace\Maven 2.1.x\jdk\1.5\label\windows\maven-2.1.xx\maven-reporting\maven-reporting-api\target\site
[INFO] [remote-resources:process {execution: default}]
[INFO] [resources:resources]
[INFO] Using encoding: 'UTF-8' to copy filtered resources.
[INFO] [compiler:compile]
[INFO] Compiling 3 source files to C:\home\hudson\workspace\Maven 2.1.x\jdk\1.5\label\windows\maven-2.1.xx\maven-reporting\maven-reporting-api\target\classes
[INFO] [resources:testResources]
[INFO] Using encoding: 'UTF-8' to copy filtered resources.
[INFO] [compiler:testCompile]
[INFO] No sources to compile
[INFO] [surefire:test]
[INFO] Surefire report directory: C:\home\hudson\workspace\Maven 2.1.x\jdk\1.5\label\windows\maven-2.1.xx\maven-reporting\maven-reporting-api\target\surefire-reports

-------------------------------------------------------
 T E S T S
-------------------------------------------------------
There are no tests to run.

Results :

Tests run: 0, Failures: 0, Errors: 0, Skipped: 0

[INFO] [jar:jar]
[INFO] Building jar: C:\home\hudson\workspace\Maven 2.1.x\jdk\1.5\label\windows\maven-2.1.xx\maven-reporting\maven-reporting-api\target\maven-reporting-api-2.1.1-SNAPSHOT.jar
[INFO] [install:install]
[INFO] Installing C:\home\hudson\workspace\Maven 2.1.x\jdk\1.5\label\windows\maven-2.1.xx\maven-reporting\maven-reporting-api\target\maven-reporting-api-2.1.1-SNAPSHOT.jar
to \opt\repos\maven-2.1.x\org\apache\maven\reporting\maven-reporting-api\2.1.1-SNAPSHOT\maven-reporting-api-2.1.1-SNAPSHOT.jar
[INFO] ------------------------------------------------------------------------
[INFO] Building Maven Profile Model
[INFO]    task-segment: [clean, install]
[INFO] ------------------------------------------------------------------------
[INFO] [clean:clean]
[INFO] Deleting directory C:\home\hudson\workspace\Maven 2.1.x\jdk\1.5\label\windows\maven-2.1.xx\maven-profile\target
[INFO] Deleting directory C:\home\hudson\workspace\Maven 2.1.x\jdk\1.5\label\windows\maven-2.1.xx\maven-profile\target\classes
[INFO] Deleting directory C:\home\hudson\workspace\Maven 2.1.x\jdk\1.5\label\windows\maven-2.1.xx\maven-profile\target\test-classes
[INFO] Deleting directory C:\home\hudson\workspace\Maven 2.1.x\jdk\1.5\label\windows\maven-2.1.xx\maven-profile\target\site
[INFO] [modello:java {execution: standard}]
[INFO] outputDirectory: C:\home\hudson\workspace\Maven 2.1.x\jdk\1.5\label\windows\maven-2.1.xx\maven-profile\target\generated-sources\modello
[INFO] Working on model: src/main/mdo/profiles.mdo
[INFO] Generating current version: 1.0.0
[INFO] [modello:xpp3-reader {execution: standard}]
[INFO] outputDirectory: C:\home\hudson\workspace\Maven 2.1.x\jdk\1.5\label\windows\maven-2.1.xx\maven-profile\target\generated-sources\modello
[INFO] Working on model: src/main/mdo/profiles.mdo
[INFO] Generating current version: 1.0.0
[INFO] [modello:xpp3-writer {execution: standard}]
[INFO] outputDirectory: C:\home\hudson\workspace\Maven 2.1.x\jdk\1.5\label\windows\maven-2.1.xx\maven-profile\target\generated-sources\modello
[INFO] Working on model: src/main/mdo/profiles.mdo
[INFO] Generating current version: 1.0.0
[INFO] [remote-resources:process {execution: default}]
[INFO] [resources:resources]
[INFO] Using encoding: 'UTF-8' to copy filtered resources.
[INFO] [compiler:compile]
[INFO] Compiling 15 source files to C:\home\hudson\workspace\Maven 2.1.x\jdk\1.5\label\windows\maven-2.1.xx\maven-profile\target\classes
[INFO] [resources:testResources]
[INFO] Using encoding: 'UTF-8' to copy filtered resources.
[INFO] [compiler:testCompile]
[INFO] No sources to compile
[INFO] [surefire:test]
[INFO] Surefire report directory: C:\home\hudson\workspace\Maven 2.1.x\jdk\1.5\label\windows\maven-2.1.xx\maven-profile\target\surefire-reports

-------------------------------------------------------
 T E S T S
-------------------------------------------------------
There are no tests to run.

Results :

Tests run: 0, Failures: 0, Errors: 0, Skipped: 0

[INFO] [jar:jar]
[INFO] Building jar: C:\home\hudson\workspace\Maven 2.1.x\jdk\1.5\label\windows\maven-2.1.xx\maven-profile\target\maven-profile-2.1.1-SNAPSHOT.jar
[INFO] [install:install]
[INFO] Installing C:\home\hudson\workspace\Maven 2.1.x\jdk\1.5\label\windows\maven-2.1.xx\maven-profile\target\maven-profile-2.1.1-SNAPSHOT.jar
to \opt\repos\maven-2.1.x\org\apache\maven\maven-profile\2.1.1-SNAPSHOT\maven-profile-2.1.1-SNAPSHOT.jar
[INFO] ------------------------------------------------------------------------
[INFO] Building Maven Error Diagnostics
[INFO]    task-segment: [clean, install]
[INFO] ------------------------------------------------------------------------
[INFO] [clean:clean]
[INFO] Deleting directory C:\home\hudson\workspace\Maven 2.1.x\jdk\1.5\label\windows\maven-2.1.xx\maven-error-diagnostics\target
[INFO] Deleting directory C:\home\hudson\workspace\Maven 2.1.x\jdk\1.5\label\windows\maven-2.1.xx\maven-error-diagnostics\target\classes
[INFO] Deleting directory C:\home\hudson\workspace\Maven 2.1.x\jdk\1.5\label\windows\maven-2.1.xx\maven-error-diagnostics\target\test-classes
[INFO] Deleting directory C:\home\hudson\workspace\Maven 2.1.x\jdk\1.5\label\windows\maven-2.1.xx\maven-error-diagnostics\target\site
[INFO] [remote-resources:process {execution: default}]
[INFO] [resources:resources]
[INFO] Using encoding: 'UTF-8' to copy filtered resources.
[INFO] [compiler:compile]
[INFO] Compiling 3 source files to C:\home\hudson\workspace\Maven 2.1.x\jdk\1.5\label\windows\maven-2.1.xx\maven-error-diagnostics\target\classes
[INFO] [resources:testResources]
[INFO] Using encoding: 'UTF-8' to copy filtered resources.
[INFO] [compiler:testCompile]
[INFO] No sources to compile
[INFO] [surefire:test]
[INFO] Surefire report directory: C:\home\hudson\workspace\Maven 2.1.x\jdk\1.5\label\windows\maven-2.1.xx\maven-error-diagnostics\target\surefire-reports

-------------------------------------------------------
 T E S T S
-------------------------------------------------------
There are no tests to run.

Results :

Tests run: 0, Failures: 0, Errors: 0, Skipped: 0

[INFO] [jar:jar]
[INFO] Building jar: C:\home\hudson\workspace\Maven 2.1.x\jdk\1.5\label\windows\maven-2.1.xx\maven-error-diagnostics\target\maven-error-diagnostics-2.1.1-SNAPSHOT.jar
[INFO] [install:install]
[INFO] Installing C:\home\hudson\workspace\Maven 2.1.x\jdk\1.5\label\windows\maven-2.1.xx\maven-error-diagnostics\target\maven-error-diagnostics-2.1.1-SNAPSHOT.jar
to \opt\repos\maven-2.1.x\org\apache\maven\maven-error-diagnostics\2.1.1-SNAPSHOT\maven-error-diagnostics-2.1.1-SNAPSHOT.jar
[INFO] ------------------------------------------------------------------------
[INFO] Building Maven Plugin Registry Model
[INFO]    task-segment: [clean, install]
[INFO] ------------------------------------------------------------------------
[INFO] [clean:clean]
[INFO] Deleting directory C:\home\hudson\workspace\Maven 2.1.x\jdk\1.5\label\windows\maven-2.1.xx\maven-plugin-registry\target
[INFO] Deleting directory C:\home\hudson\workspace\Maven 2.1.x\jdk\1.5\label\windows\maven-2.1.xx\maven-plugin-registry\target\classes
[INFO] Deleting directory C:\home\hudson\workspace\Maven 2.1.x\jdk\1.5\label\windows\maven-2.1.xx\maven-plugin-registry\target\test-classes
[INFO] Deleting directory C:\home\hudson\workspace\Maven 2.1.x\jdk\1.5\label\windows\maven-2.1.xx\maven-plugin-registry\target\site
[INFO] [modello:java {execution: standard}]
[INFO] outputDirectory: C:\home\hudson\workspace\Maven 2.1.x\jdk\1.5\label\windows\maven-2.1.xx\maven-plugin-registry\target\generated-sources\modello
[INFO] Working on model: plugin-registry.mdo
[INFO] Generating current version: 1.0.0
[INFO] [modello:xpp3-reader {execution: standard}]
[INFO] outputDirectory: C:\home\hudson\workspace\Maven 2.1.x\jdk\1.5\label\windows\maven-2.1.xx\maven-plugin-registry\target\generated-sources\modello
[INFO] Working on model: plugin-registry.mdo
[INFO] Generating current version: 1.0.0
[INFO] [modello:xpp3-writer {execution: standard}]
[INFO] outputDirectory: C:\home\hudson\workspace\Maven 2.1.x\jdk\1.5\label\windows\maven-2.1.xx\maven-plugin-registry\target\generated-sources\modello
[INFO] Working on model: plugin-registry.mdo
[INFO] Generating current version: 1.0.0
[INFO] [remote-resources:process {execution: default}]
[INFO] [resources:resources]
[INFO] Using encoding: 'UTF-8' to copy filtered resources.
[INFO] [compiler:compile]
[INFO] Compiling 9 source files to C:\home\hudson\workspace\Maven 2.1.x\jdk\1.5\label\windows\maven-2.1.xx\maven-plugin-registry\target\classes
[INFO] [resources:testResources]
[INFO] Using encoding: 'UTF-8' to copy filtered resources.
[INFO] [compiler:testCompile]
[INFO] No sources to compile
[INFO] [surefire:test]
[INFO] Surefire report directory: C:\home\hudson\workspace\Maven 2.1.x\jdk\1.5\label\windows\maven-2.1.xx\maven-plugin-registry\target\surefire-reports

-------------------------------------------------------
 T E S T S
-------------------------------------------------------
There are no tests to run.

Results :

Tests run: 0, Failures: 0, Errors: 0, Skipped: 0

[INFO] [jar:jar]
[INFO] Building jar: C:\home\hudson\workspace\Maven 2.1.x\jdk\1.5\label\windows\maven-2.1.xx\maven-plugin-registry\target\maven-plugin-registry-2.1.1-SNAPSHOT.jar
[INFO] [install:install]
[INFO] Installing C:\home\hudson\workspace\Maven 2.1.x\jdk\1.5\label\windows\maven-2.1.xx\maven-plugin-registry\target\maven-plugin-registry-2.1.1-SNAPSHOT.jar
to \opt\repos\maven-2.1.x\org\apache\maven\maven-plugin-registry\2.1.1-SNAPSHOT\maven-plugin-registry-2.1.1-SNAPSHOT.jar
[INFO] ------------------------------------------------------------------------
[INFO] Building Maven Project Builder
[INFO]    task-segment: [clean, install]
[INFO] ------------------------------------------------------------------------
[INFO] [clean:clean]
[INFO] Deleting directory C:\home\hudson\workspace\Maven 2.1.x\jdk\1.5\label\windows\maven-2.1.xx\maven-project\target
[INFO] ------------------------------------------------------------------------
[ERROR] BUILD ERROR
[INFO] ------------------------------------------------------------------------
[INFO] Failed to delete directory: C:\home\hudson\workspace\Maven 2.1.x\jdk\1.5\label\windows\maven-2.1.xx\maven-project\target.
Reason: Unable to delete directory C:\home\hudson\workspace\Maven 2.1.x\jdk\1.5\label\windows\maven-2.1.xx\maven-project\target\test-classes\imports-repo\t01

[INFO] ------------------------------------------------------------------------
[INFO] Trace
org.apache.maven.lifecycle.LifecycleExecutionException: Failed to delete directory: C:\home\hudson\workspace\Maven
2.1.x\jdk\1.5\label\windows\maven-2.1.xx\maven-project\target. Reason: Unable to delete directory
C:\home\hudson\workspace\Maven 2.1.x\jdk\1.5\label\windows\maven-2.1.xx\maven-project\target\test-classes\imports-repo\t01
	at org.apache.maven.lifecycle.DefaultLifecycleExecutor.executeGoals(DefaultLifecycleExecutor.java:701)
	at org.apache.maven.lifecycle.DefaultLifecycleExecutor.executeGoalWithLifecycle(DefaultLifecycleExecutor.java:538)
	at org.apache.maven.lifecycle.DefaultLifecycleExecutor.executeGoal(DefaultLifecycleExecutor.java:517)
	at org.apache.maven.lifecycle.DefaultLifecycleExecutor.executeGoalAndHandleFailures(DefaultLifecycleExecutor.java:369)
	at org.apache.maven.lifecycle.DefaultLifecycleExecutor.executeTaskSegments(DefaultLifecycleExecutor.java:330)
	at org.apache.maven.lifecycle.DefaultLifecycleExecutor.execute(DefaultLifecycleExecutor.java:181)
	at org.apache.maven.DefaultMaven.doExecute(DefaultMaven.java:336)
	at org.apache.maven.DefaultMaven.execute(DefaultMaven.java:129)
	at org.apache.maven.cli.MavenCli.main(MavenCli.java:302)
	at sun.reflect.NativeMethodAccessorImpl.invoke0(Native Method)
	at sun.reflect.NativeMethodAccessorImpl.invoke(NativeMethodAccessorImpl.java:39)
	at sun.reflect.DelegatingMethodAccessorImpl.invoke(DelegatingMethodAccessorImpl.java:25)
	at java.lang.reflect.Method.invoke(Method.java:585)
	at org.codehaus.classworlds.Launcher.launchEnhanced(Launcher.java:315)
	at org.codehaus.classworlds.Launcher.launch(Launcher.java:255)
	at org.codehaus.classworlds.Launcher.mainWithExitCode(Launcher.java:430)
	at org.codehaus.classworlds.Launcher.main(Launcher.java:375)
Caused by: org.apache.maven.plugin.MojoExecutionException: Failed to delete directory: C:\home\hudson\workspace\Maven
2.1.x\jdk\1.5\label\windows\maven-2.1.xx\maven-project\target. Reason: Unable to delete directory
C:\home\hudson\workspace\Maven 2.1.x\jdk\1.5\label\windows\maven-2.1.xx\maven-project\target\test-classes\imports-repo\t01
	at org.apache.maven.plugin.clean.CleanMojo.removeDirectory(CleanMojo.java:189)
	at org.apache.maven.plugin.clean.CleanMojo.execute(CleanMojo.java:129)
	at org.apache.maven.plugin.DefaultPluginManager.executeMojo(DefaultPluginManager.java:458)
	at org.apache.maven.lifecycle.DefaultLifecycleExecutor.executeGoals(DefaultLifecycleExecutor.java:676)
	... 16 more
Caused by: java.io.IOException: Unable to delete directory C:\home\hudson\workspace\Maven
2.1.x\jdk\1.5\label\windows\maven-2.1.xx\maven-project\target\test-classes\imports-repo\t01
	at org.apache.maven.shared.model.fileset.util.FileSetManager.removeDir(FileSetManager.java:449)
	at org.apache.maven.shared.model.fileset.util.FileSetManager.removeDir(FileSetManager.java:423)
	at org.apache.maven.shared.model.fileset.util.FileSetManager.removeDir(FileSetManager.java:423)
	at org.apache.maven.shared.model.fileset.util.FileSetManager.delete(FileSetManager.java:189)
	at org.apache.maven.plugin.clean.CleanMojo.removeDirectory(CleanMojo.java:185)
	... 19 more
[INFO] ------------------------------------------------------------------------
[INFO] Total time: 3 minutes 
[INFO] Finished at: Fri Mar 13 14:15:02 PDT 2009
[INFO] Final Memory: 20M/44M
[INFO] ------------------------------------------------------------------------
[locks-and-latches] Releasing all the locks
[locks-and-latches] All the locks released


Mime
View raw message