maven-notifications mailing list archives

Site index · List index
Message view « Date » · « Thread »
Top « Date » · « Thread »
From Hudson <Hud...@sonatype.org>
Subject Build failed in Hudson: Maven-2.1.x-bootstrap » 1.4,windows #116
Date Sun, 01 Mar 2009 10:28:21 GMT
See http://grid.sonatype.org/ci/job/Maven-2.1.x-bootstrap/./jdk=1.4,label=windows/116/changes

Changes:

[Herve Boutemy] reverted Doxia 1.1 test committed by mistake

[Herve Boutemy] used http://maven.apache.org/xsd/* for schema location

------------------------------------------
[...truncated 4495 lines...]
     [exec] -------------------------------------------------------
     [exec]  T E S T S
     [exec] -------------------------------------------------------
     [exec] There are no tests to run.
     [exec] 
     [exec] Results :
     [exec] 
     [exec] Tests run: 0, Failures: 0, Errors: 0, Skipped: 0
     [exec] 
     [exec] [INFO] [jar:jar]
     [exec] [INFO] Building jar: C:\tmp\maven-integration-tests-2.1.x\core-it-support\core-it-plugins\maven-it-plugin-plexus-utils-11\target\maven-it-plugin-plexus-utils-11-2.1-SNAPSHOT.jar
     [exec] [INFO] [plugin:addPluginArtifactMetadata]
     [exec] [INFO] [install:install]
     [exec] [INFO] Installing C:\tmp\maven-integration-tests-2.1.x\core-it-support\core-it-plugins\maven-it-plugin-plexus-utils-11\target\maven-it-plugin-plexus-utils-11-2.1-SNAPSHOT.jar
to C:\opt\repos\bootstrap-maven-2.1.x\org\apache\maven\its\plugins\maven-it-plugin-plexus-utils-11\2.1-SNAPSHOT\maven-it-plugin-plexus-utils-11-2.1-SNAPSHOT.jar
     [exec] [INFO] [plugin:updateRegistry]
     [exec] [INFO] ------------------------------------------------------------------------
     [exec] [INFO] Building Maven Integration Test Plugin :: Plexus Utils New
     [exec] [INFO]    task-segment: [clean, install]
     [exec] [INFO] ------------------------------------------------------------------------
     [exec] [INFO] [clean:clean]
     [exec] [INFO] Deleting directory C:\tmp\maven-integration-tests-2.1.x\core-it-support\core-it-plugins\maven-it-plugin-plexus-utils-new\target
     [exec] [INFO] [plugin:descriptor]
     [exec] [INFO] Using 2 extractors.
     [exec] [INFO] Applying extractor for language: java
     [exec] [INFO] Extractor for language: java found 1 mojo descriptors.
     [exec] [INFO] Applying extractor for language: bsh
     [exec] [INFO] Extractor for language: bsh found 0 mojo descriptors.
     [exec] [INFO] [remote-resources:process {execution: default}]
     [exec] [INFO] [resources:resources]
     [exec] [INFO] Using encoding: 'UTF-8' to copy filtered resources.
     [exec] [INFO] [compiler:compile]
     [exec] [INFO] Compiling 4 source files to C:\tmp\maven-integration-tests-2.1.x\core-it-support\core-it-plugins\maven-it-plugin-plexus-utils-new\target\classes
     [exec] [INFO] [resources:testResources]
     [exec] [INFO] Using encoding: 'UTF-8' to copy filtered resources.
     [exec] [INFO] [compiler:testCompile]
     [exec] [INFO] No sources to compile
     [exec] [INFO] [surefire:test]
     [exec] [INFO] Surefire report directory: C:\tmp\maven-integration-tests-2.1.x\core-it-support\core-it-plugins\maven-it-plugin-plexus-utils-new\target\surefire-reports
     [exec] 
     [exec] -------------------------------------------------------
     [exec]  T E S T S
     [exec] -------------------------------------------------------
     [exec] There are no tests to run.
     [exec] 
     [exec] Results :
     [exec] 
     [exec] Tests run: 0, Failures: 0, Errors: 0, Skipped: 0
     [exec] 
     [exec] [INFO] [jar:jar]
     [exec] [INFO] Building jar: C:\tmp\maven-integration-tests-2.1.x\core-it-support\core-it-plugins\maven-it-plugin-plexus-utils-new\target\maven-it-plugin-plexus-utils-new-2.1-SNAPSHOT.jar
     [exec] [INFO] [plugin:addPluginArtifactMetadata]
     [exec] [INFO] [install:install]
     [exec] [INFO] Installing C:\tmp\maven-integration-tests-2.1.x\core-it-support\core-it-plugins\maven-it-plugin-plexus-utils-new\target\maven-it-plugin-plexus-utils-new-2.1-SNAPSHOT.jar
to C:\opt\repos\bootstrap-maven-2.1.x\org\apache\maven\its\plugins\maven-it-plugin-plexus-utils-new\2.1-SNAPSHOT\maven-it-plugin-plexus-utils-new-2.1-SNAPSHOT.jar
     [exec] [INFO] [plugin:updateRegistry]
     [exec] [INFO] ------------------------------------------------------------------------
     [exec] [INFO] Building Maven Integration Test Plugin :: Plexus Component API
     [exec] [INFO]    task-segment: [clean, install]
     [exec] [INFO] ------------------------------------------------------------------------
     [exec] [INFO] [clean:clean]
     [exec] [INFO] Deleting directory C:\tmp\maven-integration-tests-2.1.x\core-it-support\core-it-plugins\maven-it-plugin-plexus-component-api\target
     [exec] Downloading: http://repository.sonatype.org:8081/content/groups/public/org/codehaus/plexus/plexus-container-default/1.0-alpha-20/plexus-container-default-1.0-alpha-20.pom
     [exec] 2K downloaded  (plexus-container-default-1.0-alpha-20.pom)
     [exec] Downloading: http://repository.sonatype.org:8081/content/groups/public/org/codehaus/plexus/plexus-containers/1.0-alpha-20/plexus-containers-1.0-alpha-20.pom
     [exec] 1K downloaded  (plexus-containers-1.0-alpha-20.pom)
     [exec] Downloading: http://repository.sonatype.org:8081/content/groups/public/org/codehaus/plexus/plexus-component-api/1.0-alpha-19/plexus-component-api-1.0-alpha-19.pom
     [exec] 2K downloaded  (plexus-component-api-1.0-alpha-19.pom)
     [exec] Downloading: http://repository.sonatype.org:8081/content/groups/public/org/codehaus/plexus/plexus-containers/1.0-alpha-19/plexus-containers-1.0-alpha-19.pom
     [exec] 1K downloaded  (plexus-containers-1.0-alpha-19.pom)
     [exec] Downloading: http://repository.sonatype.org:8081/content/groups/public/org/codehaus/plexus/plexus-classworlds/1.2-alpha-7/plexus-classworlds-1.2-alpha-7.pom
     [exec] 2K downloaded  (plexus-classworlds-1.2-alpha-7.pom)
     [exec] Downloading: http://repository.sonatype.org:8081/content/groups/public/org/codehaus/plexus/plexus-utils/1.3/plexus-utils-1.3.pom
     [exec] 1K downloaded  (plexus-utils-1.3.pom)
     [exec] Downloading: http://repository.sonatype.org:8081/content/groups/public/org/codehaus/plexus/plexus-component-api/1.0-alpha-20/plexus-component-api-1.0-alpha-20.pom
     [exec] 2K downloaded  (plexus-component-api-1.0-alpha-20.pom)
     [exec] Downloading: http://repository.sonatype.org:8081/content/groups/public/org/codehaus/plexus/plexus-container-default/1.0-alpha-20/plexus-container-default-1.0-alpha-20.jar
     [exec] 205K downloaded  (plexus-container-default-1.0-alpha-20.jar)
     [exec] Downloading: http://repository.sonatype.org:8081/content/groups/public/org/codehaus/plexus/plexus-component-api/1.0-alpha-20/plexus-component-api-1.0-alpha-20.jar
     [exec] 32K downloaded  (plexus-component-api-1.0-alpha-20.jar)
     [exec] Downloading: http://repository.sonatype.org:8081/content/groups/public/org/codehaus/plexus/plexus-classworlds/1.2-alpha-7/plexus-classworlds-1.2-alpha-7.jar
     [exec] 41K downloaded  (plexus-classworlds-1.2-alpha-7.jar)
     [exec] Downloading: http://repository.sonatype.org:8081/content/groups/public/org/codehaus/plexus/plexus-utils/1.3/plexus-utils-1.3.jar
     [exec] 176K downloaded  (plexus-utils-1.3.jar)
     [exec] [INFO] [plugin:descriptor]
     [exec] [INFO] Using 2 extractors.
     [exec] [INFO] Applying extractor for language: java
     [exec] [INFO] Extractor for language: java found 1 mojo descriptors.
     [exec] [INFO] Applying extractor for language: bsh
     [exec] [INFO] Extractor for language: bsh found 0 mojo descriptors.
     [exec] [INFO] [remote-resources:process {execution: default}]
     [exec] [INFO] [resources:resources]
     [exec] [INFO] Using encoding: 'UTF-8' to copy filtered resources.
     [exec] [INFO] [compiler:compile]
     [exec] [INFO] Compiling 1 source file to C:\tmp\maven-integration-tests-2.1.x\core-it-support\core-it-plugins\maven-it-plugin-plexus-component-api\target\classes
     [exec] [INFO] [resources:testResources]
     [exec] [INFO] Using encoding: 'UTF-8' to copy filtered resources.
     [exec] [INFO] [compiler:testCompile]
     [exec] [INFO] No sources to compile
     [exec] [INFO] [surefire:test]
     [exec] [INFO] Surefire report directory: C:\tmp\maven-integration-tests-2.1.x\core-it-support\core-it-plugins\maven-it-plugin-plexus-component-api\target\surefire-reports
     [exec] 
     [exec] -------------------------------------------------------
     [exec]  T E S T S
     [exec] -------------------------------------------------------
     [exec] There are no tests to run.
     [exec] 
     [exec] Results :
     [exec] 
     [exec] Tests run: 0, Failures: 0, Errors: 0, Skipped: 0
     [exec] 
     [exec] [INFO] [jar:jar]
     [exec] [INFO] Building jar: C:\tmp\maven-integration-tests-2.1.x\core-it-support\core-it-plugins\maven-it-plugin-plexus-component-api\target\maven-it-plugin-plexus-component-api-2.1-SNAPSHOT.jar
     [exec] [INFO] [plugin:addPluginArtifactMetadata]
     [exec] [INFO] [install:install]
     [exec] [INFO] Installing C:\tmp\maven-integration-tests-2.1.x\core-it-support\core-it-plugins\maven-it-plugin-plexus-component-api\target\maven-it-plugin-plexus-component-api-2.1-SNAPSHOT.jar
to C:\opt\repos\bootstrap-maven-2.1.x\org\apache\maven\its\plugins\maven-it-plugin-plexus-component-api\2.1-SNAPSHOT\maven-it-plugin-plexus-component-api-2.1-SNAPSHOT.jar
     [exec] [INFO] [plugin:updateRegistry]
     [exec] [INFO] ------------------------------------------------------------------------
     [exec] [INFO] Building Maven Integration Test Wagon
     [exec] [INFO]    task-segment: [clean, install]
     [exec] [INFO] ------------------------------------------------------------------------
     [exec] Downloading: http://repository.sonatype.org:8081/content/groups/public/org/codehaus/plexus/plexus-maven-plugin/1.3.5/plexus-maven-plugin-1.3.5.pom
     [exec] 2K downloaded  (plexus-maven-plugin-1.3.5.pom)
     [exec] Downloading: http://repository.sonatype.org:8081/content/groups/public/org/codehaus/plexus/plexus-maven-plugin/1.3.5/plexus-maven-plugin-1.3.5.jar
     [exec] 22K downloaded  (plexus-maven-plugin-1.3.5.jar)
     [exec] [INFO] [clean:clean]
     [exec] [INFO] Deleting directory C:\tmp\maven-integration-tests-2.1.x\core-it-support\core-it-wagon\target
     [exec] Downloading: http://repository.sonatype.org:8081/content/groups/public/doxia/doxia-sink-api/1.0-alpha-4/doxia-sink-api-1.0-alpha-4.pom
     [exec] 1K downloaded  (doxia-sink-api-1.0-alpha-4.pom)
     [exec] Downloading: http://repository.sonatype.org:8081/content/groups/public/org/apache/maven/reporting/maven-reporting-impl/2.0/maven-reporting-impl-2.0.pom
     [exec] 2K downloaded  (maven-reporting-impl-2.0.pom)
     [exec] Downloading: http://repository.sonatype.org:8081/content/groups/public/commons-validator/commons-validator/1.1.4/commons-validator-1.1.4.pom
     [exec] 168b downloaded  (commons-validator-1.1.4.pom)
     [exec] Downloading: http://repository.sonatype.org:8081/content/groups/public/doxia/doxia-core/1.0-alpha-4/doxia-core-1.0-alpha-4.pom
     [exec] 4K downloaded  (doxia-core-1.0-alpha-4.pom)
     [exec] Downloading: http://repository.sonatype.org:8081/content/groups/public/org/codehaus/plexus/plexus-cdc/1.0-alpha-10/plexus-cdc-1.0-alpha-10.pom
     [exec] 1K downloaded  (plexus-cdc-1.0-alpha-10.pom)
     [exec] Downloading: http://repository.sonatype.org:8081/content/groups/public/org/codehaus/plexus/plexus-tools/1.0.8/plexus-tools-1.0.8.pom
     [exec] 953b downloaded  (plexus-tools-1.0.8.pom)
     [exec] Downloading: http://repository.sonatype.org:8081/content/groups/public/org/codehaus/plexus/plexus-container-default/1.0-alpha-14/plexus-container-default-1.0-alpha-14.pom
     [exec] 1K downloaded  (plexus-container-default-1.0-alpha-14.pom)
     [exec] Downloading: http://repository.sonatype.org:8081/content/groups/public/org/codehaus/plexus/plexus-containers/1.0-alpha-14/plexus-containers-1.0-alpha-14.pom
     [exec] 1K downloaded  (plexus-containers-1.0-alpha-14.pom)
     [exec] Downloading: http://repository.sonatype.org:8081/content/groups/public/org/codehaus/plexus/plexus-component-api/1.0-alpha-13/plexus-component-api-1.0-alpha-13.pom
     [exec] 949b downloaded  (plexus-component-api-1.0-alpha-13.pom)
     [exec] Downloading: http://repository.sonatype.org:8081/content/groups/public/org/codehaus/plexus/plexus-containers/1.0.7-alpha-3/plexus-containers-1.0.7-alpha-3.pom
     [exec] 1K downloaded  (plexus-containers-1.0.7-alpha-3.pom)
     [exec] Downloading: http://repository.sonatype.org:8081/content/groups/public/org/codehaus/plexus/plexus-classworlds/1.2-alpha-5/plexus-classworlds-1.2-alpha-5.pom
     [exec] 1K downloaded  (plexus-classworlds-1.2-alpha-5.pom)
     [exec] Downloading: http://repository.sonatype.org:8081/content/groups/public/commons-validator/commons-validator/1.1.4/commons-validator-1.1.4.jar
     [exec] Downloading: http://repository.sonatype.org:8081/content/groups/public/org/apache/maven/reporting/maven-reporting-impl/2.0/maven-reporting-impl-2.0.jar
     [exec] Downloading: http://repository.sonatype.org:8081/content/groups/public/doxia/doxia-core/1.0-alpha-4/doxia-core-1.0-alpha-4.jar
     [exec] Downloading: http://repository.sonatype.org:8081/content/groups/public/org/codehaus/plexus/plexus-cdc/1.0-alpha-10/plexus-cdc-1.0-alpha-10.jar
     [exec] 82K downloaded  (commons-validator-1.1.4.jar)
     [exec] 45K downloaded  (plexus-cdc-1.0-alpha-10.jar)
     [exec] 254K downloaded  (doxia-core-1.0-alpha-4.jar)
     [exec] 15K downloaded  (maven-reporting-impl-2.0.jar)
     [exec] [INFO] [plexus:descriptor {execution: default}]
     [exec] [INFO] [remote-resources:process {execution: default}]
     [exec] [INFO] [resources:resources]
     [exec] [INFO] Using encoding: 'UTF-8' to copy filtered resources.
     [exec] [INFO] [compiler:compile]
     [exec] [INFO] Compiling 1 source file to C:\tmp\maven-integration-tests-2.1.x\core-it-support\core-it-wagon\target\classes
     [exec] [INFO] [resources:testResources]
     [exec] [INFO] Using encoding: 'UTF-8' to copy filtered resources.
     [exec] [INFO] [compiler:testCompile]
     [exec] [INFO] No sources to compile
     [exec] [INFO] [surefire:test]
     [exec] [INFO] Surefire report directory: C:\tmp\maven-integration-tests-2.1.x\core-it-support\core-it-wagon\target\surefire-reports
     [exec] 
     [exec] -------------------------------------------------------
     [exec]  T E S T S
     [exec] -------------------------------------------------------
     [exec] There are no tests to run.
     [exec] 
     [exec] Results :
     [exec] 
     [exec] Tests run: 0, Failures: 0, Errors: 0, Skipped: 0
     [exec] 
     [exec] [INFO] [jar:jar]
     [exec] [INFO] Building jar: C:\tmp\maven-integration-tests-2.1.x\core-it-support\core-it-wagon\target\core-it-wagon-2.1-SNAPSHOT.jar
     [exec] [INFO] [install:install]
     [exec] [INFO] Installing C:\tmp\maven-integration-tests-2.1.x\core-it-support\core-it-wagon\target\core-it-wagon-2.1-SNAPSHOT.jar
to C:\opt\repos\bootstrap-maven-2.1.x\org\apache\maven\its\core-it-wagon\2.1-SNAPSHOT\core-it-wagon-2.1-SNAPSHOT.jar
     [exec] [INFO] ------------------------------------------------------------------------
     [exec] [INFO] Building Maven Integration Test Support Artifacts
     [exec] [INFO]    task-segment: [clean, install]
     [exec] [INFO] ------------------------------------------------------------------------
     [exec] [INFO] [clean:clean]
     [exec] [INFO] Deleting directory C:\tmp\maven-integration-tests-2.1.x\core-it-support\core-it-support-artifacts\target
     [exec] [INFO] [remote-resources:process {execution: default}]
     [exec] [INFO] [site:attach-descriptor]
     [exec] [WARNING] DEPRECATED [descriptor]: Please use descriptors instead
     [exec] [INFO] [assembly:single {execution: default}]
     [exec] [INFO] Building zip: C:\tmp\maven-integration-tests-2.1.x\core-it-support\core-it-support-artifacts\target\core-it-support-artifacts-2.1-SNAPSHOT-repo.zip
     [exec] [INFO] [install:install]
     [exec] [INFO] Installing C:\tmp\maven-integration-tests-2.1.x\core-it-support\core-it-support-artifacts\target\pom-transformed.xml
to C:\opt\repos\bootstrap-maven-2.1.x\org\apache\maven\its\core-it-support-artifacts\2.1-SNAPSHOT\core-it-support-artifacts-2.1-SNAPSHOT.pom
     [exec] [INFO] Installing C:\tmp\maven-integration-tests-2.1.x\core-it-support\core-it-support-artifacts\target\core-it-support-artifacts-2.1-SNAPSHOT-repo.zip
to C:\opt\repos\bootstrap-maven-2.1.x\org\apache\maven\its\core-it-support-artifacts\2.1-SNAPSHOT\core-it-support-artifacts-2.1-SNAPSHOT-repo.zip
     [exec] [INFO] ------------------------------------------------------------------------
     [exec] [INFO] Building Maven Integration Tests
     [exec] [INFO]    task-segment: [clean, install]
     [exec] [INFO] ------------------------------------------------------------------------
     [exec] [INFO] [clean:clean]
     [exec] [INFO] Deleting directory C:\tmp\maven-integration-tests-2.1.x\core-it-suite\target
     [exec] [INFO] ------------------------------------------------------------------------
     [exec] [ERROR] BUILD ERROR
     [exec] [INFO] ------------------------------------------------------------------------
     [exec] [INFO] Failed to delete directory: C:\tmp\maven-integration-tests-2.1.x\core-it-suite\target.
Reason: Unable to delete directory C:\tmp\maven-integration-tests-2.1.x\core-it-suite\target\test-classes\org\apache\maven
     [exec] 
     [exec] [INFO] ------------------------------------------------------------------------
     [exec] [INFO] Trace
     [exec] org.apache.maven.lifecycle.LifecycleExecutionException: Failed to delete directory:
C:\tmp\maven-integration-tests-2.1.x\core-it-suite\target. Reason: Unable to delete directory
C:\tmp\maven-integration-tests-2.1.x\core-it-suite\target\test-classes\org\apache\maven
     [exec] 	at org.apache.maven.lifecycle.DefaultLifecycleExecutor.executeGoals(DefaultLifecycleExecutor.java:702)
     [exec] 	at org.apache.maven.lifecycle.DefaultLifecycleExecutor.executeGoalWithLifecycle(DefaultLifecycleExecutor.java:539)
     [exec] 	at org.apache.maven.lifecycle.DefaultLifecycleExecutor.executeGoal(DefaultLifecycleExecutor.java:518)
     [exec] 	at org.apache.maven.lifecycle.DefaultLifecycleExecutor.executeGoalAndHandleFailures(DefaultLifecycleExecutor.java:370)
     [exec] 	at org.apache.maven.lifecycle.DefaultLifecycleExecutor.executeTaskSegments(DefaultLifecycleExecutor.java:331)
     [exec] 	at org.apache.maven.lifecycle.DefaultLifecycleExecutor.execute(DefaultLifecycleExecutor.java:181)
     [exec] 	at org.apache.maven.DefaultMaven.doExecute(DefaultMaven.java:346)
     [exec] 	at org.apache.maven.DefaultMaven.execute(DefaultMaven.java:133)
     [exec] 	at org.apache.maven.cli.MavenCli.main(MavenCli.java:356)
     [exec] 	at sun.reflect.NativeMethodAccessorImpl.invoke0(Native Method)
     [exec] 	at sun.reflect.NativeMethodAccessorImpl.invoke(NativeMethodAccessorImpl.java:39)
     [exec] 	at sun.reflect.DelegatingMethodAccessorImpl.invoke(DelegatingMethodAccessorImpl.java:25)
     [exec] 	at java.lang.reflect.Method.invoke(Method.java:324)
     [exec] 	at org.codehaus.classworlds.Launcher.launchEnhanced(Launcher.java:315)
     [exec] 	at org.codehaus.classworlds.Launcher.launch(Launcher.java:255)
     [exec] 	at org.codehaus.classworlds.Launcher.mainWithExitCode(Launcher.java:430)
     [exec] 	at org.codehaus.classworlds.Launcher.main(Launcher.java:375)
     [exec] Caused by: org.apache.maven.plugin.MojoExecutionException: Failed to delete directory:
C:\tmp\maven-integration-tests-2.1.x\core-it-suite\target. Reason: Unable to delete directory
C:\tmp\maven-integration-tests-2.1.x\core-it-suite\target\test-classes\org\apache\maven
     [exec] 	at org.apache.maven.plugin.clean.CleanMojo.removeDirectory(CleanMojo.java:265)
     [exec] 	at org.apache.maven.plugin.clean.CleanMojo.execute(CleanMojo.java:173)
     [exec] 	at org.apache.maven.plugin.DefaultPluginManager.executeMojo(DefaultPluginManager.java:458)
     [exec] 	at org.apache.maven.lifecycle.DefaultLifecycleExecutor.executeGoals(DefaultLifecycleExecutor.java:677)
     [exec] 	... 16 more
     [exec] Caused by: java.io.IOException: Unable to delete directory C:\tmp\maven-integration-tests-2.1.x\core-it-suite\target\test-classes\org\apache\maven
     [exec] 	at org.apache.maven.shared.model.fileset.util.FileSetManager.removeDir(FileSetManager.java:599)
     [exec] 	at org.apache.maven.shared.model.fileset.util.FileSetManager.removeDir(FileSetManager.java:574)
     [exec] 	at org.apache.maven.shared.model.fileset.util.FileSetManager.removeDir(FileSetManager.java:574)
     [exec] 	at org.apache.maven.shared.model.fileset.util.FileSetManager.delete(FileSetManager.java:309)
     [exec] 	at org.apache.maven.plugin.clean.CleanMojo.removeDirectory(CleanMojo.java:261)
     [exec] 	... 19 more
     [exec] [INFO] ------------------------------------------------------------------------
     [exec] [INFO] Total time: 1 minute 15 seconds
     [exec] [INFO] Finished at: Sun Mar 01 02:28:06 PST 2009
     [exec] [INFO] Final Memory: 44M/79M
     [exec] [INFO] ------------------------------------------------------------------------

BUILD FAILED
C:\home\hudson\workspace\Maven-2.1.x-bootstrap\jdk\1.4\label\windows\maven-2.1.x\build.xml:258:
exec returned: 1

Total time: 4 minutes 36 seconds


Mime
View raw message