maven-notifications mailing list archives

Site index · List index
Message view « Date » · « Thread »
Top « Date » · « Thread »
From Hudson <Hud...@sonatype.org>
Subject Build failed in Hudson: Maven-2.1.x-bootstrap » 1.4,osx #117
Date Sun, 01 Mar 2009 14:25:26 GMT
See http://grid.sonatype.org/ci/job/Maven-2.1.x-bootstrap/./jdk=1.4,label=osx/117/changes

Changes:

[Benjamin Bentmann] [MNG-2921] ejb-client dependency no longer resolved in reactor build

o Fixed regression introduced by misplaced else block in r742799

[Benjamin Bentmann] o Fixed typo

------------------------------------------
[...truncated 1450 lines...]
     [java] [INFO] Excluding org.apache.maven:maven-error-diagnostics:jar:2.1.0-SNAPSHOT from
the shaded jar.
     [java] [INFO] Excluding org.apache.maven:maven-project:jar:2.1.0-SNAPSHOT from the shaded
jar.
     [java] [INFO] Excluding org.apache.maven:maven-artifact-manager:jar:2.1.0-SNAPSHOT from
the shaded jar.
     [java] [INFO] Excluding backport-util-concurrent:backport-util-concurrent:jar:3.1 from
the shaded jar.
     [java] [INFO] Excluding org.apache.maven:maven-plugin-registry:jar:2.1.0-SNAPSHOT from
the shaded jar.
     [java] [INFO] Excluding commons-cli:commons-cli:jar:1.0 from the shaded jar.
     [java] [INFO] Excluding org.apache.maven:maven-plugin-api:jar:2.1.0-SNAPSHOT from the
shaded jar.
     [java] [INFO] Excluding org.apache.maven.wagon:wagon-ssh-external:jar:1.0-beta-5 from
the shaded jar.
     [java] [INFO] Excluding org.apache.maven.wagon:wagon-ssh-common:jar:1.0-beta-5 from the
shaded jar.
     [java] [INFO] Excluding org.codehaus.plexus:plexus-interactivity-api:jar:1.0-alpha-4
from the shaded jar.
     [java] [INFO] Excluding org.apache.maven:maven-plugin-descriptor:jar:2.1.0-SNAPSHOT from
the shaded jar.
     [java] [INFO] Excluding org.apache.maven:maven-monitor:jar:2.1.0-SNAPSHOT from the shaded
jar.
     [java] [INFO] Excluding org.apache.maven.wagon:wagon-ssh:jar:1.0-beta-5 from the shaded
jar.
     [java] [INFO] Excluding com.jcraft:jsch:jar:0.1.38 from the shaded jar.
     [java] [INFO] Excluding org.sonatype.plexus:plexus-sec-dispatcher:jar:1.0 from the shaded
jar.
     [java] [INFO] Excluding org.sonatype.plexus:plexus-cipher:jar:1.1 from the shaded jar.
     [java] [INFO] Replacing original artifact with shaded artifact.
     [java] [INFO] Replacing http://grid.sonatype.org/ci/job/Maven-2.1.x-bootstrap/./jdk=1.4,label=osx/ws/maven-2.1.x/maven-toolchain/target/maven-toolchain-2.1.0-SNAPSHOT.jar
 with http://grid.sonatype.org/ci/job/Maven-2.1.x-bootstrap/./jdk=1.4,label=osx/ws/maven-2.1.x/maven-toolchain/target/maven-toolchain-2.1.0-SNAPSHOT-shaded.jar

     [java] [INFO] [install:install]
     [java] [INFO] Installing http://grid.sonatype.org/ci/job/Maven-2.1.x-bootstrap/./jdk=1.4,label=osx/ws/maven-2.1.x/maven-toolchain/target/maven-toolchain-2.1.0-SNAPSHOT.jar
 to /opt/repos/bootstrap-maven-2.1.x/org/apache/maven/maven-toolchain/2.1.0-SNAPSHOT/maven-toolchain-2.1.0-SNAPSHOT.jar
     [java] [INFO] ------------------------------------------------------------------------
     [java] [INFO] Building Maven Distribution
     [java] [INFO]    task-segment: [clean, install]
     [java] [INFO] ------------------------------------------------------------------------
     [java] [INFO] [clean:clean]
     [java] [INFO] Deleting directory http://grid.sonatype.org/ci/job/Maven-2.1.x-bootstrap/./jdk=1.4,label=osx/ws/maven-2.1.x/apache-maven/target

     [java] [INFO] Deleting directory http://grid.sonatype.org/ci/job/Maven-2.1.x-bootstrap/./jdk=1.4,label=osx/ws/maven-2.1.x/apache-maven/target/classes

     [java] [INFO] Deleting directory http://grid.sonatype.org/ci/job/Maven-2.1.x-bootstrap/./jdk=1.4,label=osx/ws/maven-2.1.x/apache-maven/target/test-classes

     [java] [INFO] Deleting directory http://grid.sonatype.org/ci/job/Maven-2.1.x-bootstrap/./jdk=1.4,label=osx/ws/maven-2.1.x/apache-maven/target/site

     [java] [INFO] [remote-resources:process {execution: default}]
     [java] [INFO] [resources:resources]
     [java] [INFO] Using encoding: 'UTF-8' to copy filtered resources.
     [java] [INFO] [compiler:compile]
     [java] [INFO] No sources to compile
     [java] [INFO] [resources:testResources]
     [java] [INFO] Using encoding: 'UTF-8' to copy filtered resources.
     [java] [INFO] [compiler:testCompile]
     [java] [INFO] Compiling 1 source file to http://grid.sonatype.org/ci/job/Maven-2.1.x-bootstrap/./jdk=1.4,label=osx/ws/maven-2.1.x/apache-maven/target/test-classes

     [java] [INFO] [surefire:test]
     [java] [INFO] Surefire report directory: http://grid.sonatype.org/ci/job/Maven-2.1.x-bootstrap/./jdk=1.4,label=osx/ws/maven-2.1.x/apache-maven/target/surefire-reports

     [java] 
     [java] -------------------------------------------------------
     [java]  T E S T S
     [java] -------------------------------------------------------
     [java] Running org.apache.maven.settings.GlobalSettingsTest
     [java] Tests run: 1, Failures: 0, Errors: 0, Skipped: 0, Time elapsed: 0.077 sec
     [java] 
     [java] Results :
     [java] 
     [java] Tests run: 1, Failures: 0, Errors: 0, Skipped: 0
     [java] 
     [java] [INFO] [jar:jar]
     [java] [INFO] Building jar: http://grid.sonatype.org/ci/job/Maven-2.1.x-bootstrap/./jdk=1.4,label=osx/ws/maven-2.1.x/apache-maven/target/apache-maven-2.1.0-SNAPSHOT.jar

     [java] [INFO] [shade:shade {execution: default}]
     [java] [INFO] Including org.apache.maven:maven-core:jar:2.1.0-SNAPSHOT in the shaded
jar.
     [java] [INFO] Including org.apache.maven:maven-settings:jar:2.1.0-SNAPSHOT in the shaded
jar.
     [java] [INFO] Including org.apache.maven:maven-model:jar:2.1.0-SNAPSHOT in the shaded
jar.
     [java] [INFO] Including org.codehaus.plexus:plexus-utils:jar:1.5.6 in the shaded jar.
     [java] [INFO] Including org.codehaus.plexus:plexus-interpolation:jar:1.8.1 in the shaded
jar.
     [java] [INFO] Including org.codehaus.plexus:plexus-container-default:jar:1.0-alpha-9-stable-1
in the shaded jar.
     [java] [INFO] Excluding classworlds:classworlds:jar:1.1 from the shaded jar.
     [java] [INFO] Including org.apache.maven.wagon:wagon-file:jar:1.0-beta-5 in the shaded
jar.
     [java] [INFO] Including org.apache.maven.wagon:wagon-provider-api:jar:1.0-beta-5 in the
shaded jar.
     [java] [INFO] Including org.apache.maven:maven-plugin-parameter-documenter:jar:2.1.0-SNAPSHOT
in the shaded jar.
     [java] [INFO] Including org.apache.maven.wagon:wagon-webdav-jackrabbit:jar:1.0-beta-5
in the shaded jar.
     [java] [INFO] Including org.apache.maven.wagon:wagon-http-shared:jar:1.0-beta-5 in the
shaded jar.
     [java] [INFO] Including nekohtml:xercesMinimal:jar:1.9.6.2 in the shaded jar.
     [java] [INFO] Including nekohtml:nekohtml:jar:1.9.6.2 in the shaded jar.
     [java] [INFO] Including commons-httpclient:commons-httpclient:jar:3.1 in the shaded jar.
     [java] [INFO] Including commons-logging:commons-logging:jar:1.0.4 in the shaded jar.
     [java] [INFO] Including commons-codec:commons-codec:jar:1.2 in the shaded jar.
     [java] [INFO] Including org.apache.jackrabbit:jackrabbit-webdav:jar:1.5.0 in the shaded
jar.
     [java] [INFO] Including org.apache.jackrabbit:jackrabbit-jcr-commons:jar:1.5.0 in the
shaded jar.
     [java] [INFO] Including org.slf4j:slf4j-api:jar:1.5.3 in the shaded jar.
     [java] [INFO] Including org.slf4j:slf4j-nop:jar:1.5.3 in the shaded jar.
     [java] [INFO] Including org.apache.maven.wagon:wagon-http-lightweight:jar:1.0-beta-5
in the shaded jar.
     [java] [INFO] Including org.apache.maven.reporting:maven-reporting-api:jar:2.1.0-SNAPSHOT
in the shaded jar.
     [java] [INFO] Including org.apache.maven.doxia:doxia-sink-api:jar:1.0 in the shaded jar.
     [java] [INFO] Including org.apache.maven:maven-profile:jar:2.1.0-SNAPSHOT in the shaded
jar.
     [java] [INFO] Including org.apache.maven:maven-artifact:jar:2.1.0-SNAPSHOT in the shaded
jar.
     [java] [INFO] Including org.apache.maven:maven-repository-metadata:jar:2.1.0-SNAPSHOT
in the shaded jar.
     [java] [INFO] Including org.apache.maven:maven-error-diagnostics:jar:2.1.0-SNAPSHOT in
the shaded jar.
     [java] [INFO] Including org.apache.maven:maven-project:jar:2.1.0-SNAPSHOT in the shaded
jar.
     [java] [INFO] Including org.apache.maven:maven-artifact-manager:jar:2.1.0-SNAPSHOT in
the shaded jar.
     [java] [INFO] Including backport-util-concurrent:backport-util-concurrent:jar:3.1 in
the shaded jar.
     [java] [INFO] Including org.apache.maven:maven-plugin-registry:jar:2.1.0-SNAPSHOT in
the shaded jar.
     [java] [INFO] Including commons-cli:commons-cli:jar:1.0 in the shaded jar.
     [java] [INFO] Including org.apache.maven:maven-plugin-api:jar:2.1.0-SNAPSHOT in the shaded
jar.
     [java] [INFO] Including org.apache.maven.wagon:wagon-ssh-external:jar:1.0-beta-5 in the
shaded jar.
     [java] [INFO] Including org.apache.maven.wagon:wagon-ssh-common:jar:1.0-beta-5 in the
shaded jar.
     [java] [INFO] Including org.codehaus.plexus:plexus-interactivity-api:jar:1.0-alpha-4
in the shaded jar.
     [java] [INFO] Including org.apache.maven:maven-plugin-descriptor:jar:2.1.0-SNAPSHOT in
the shaded jar.
     [java] [INFO] Including org.apache.maven:maven-monitor:jar:2.1.0-SNAPSHOT in the shaded
jar.
     [java] [INFO] Including org.apache.maven.wagon:wagon-ssh:jar:1.0-beta-5 in the shaded
jar.
     [java] [INFO] Including com.jcraft:jsch:jar:0.1.38 in the shaded jar.
     [java] [INFO] Including org.sonatype.plexus:plexus-sec-dispatcher:jar:1.0 in the shaded
jar.
     [java] [INFO] Including org.sonatype.plexus:plexus-cipher:jar:1.1 in the shaded jar.
     [java] [INFO] Including org.apache.maven:maven-toolchain:jar:2.1.0-SNAPSHOT in the shaded
jar.
     [java] [WARNING] We have a duplicate hidden/org/apache/jackrabbit/webdav/client/methods/XmlRequestEntity
in /opt/repos/bootstrap-maven-2.1.x/org/apache/jackrabbit/jackrabbit-webdav/1.5.0/jackrabbit-webdav-1.5.0.jar
     [java] [WARNING] We have a duplicate hidden/org/apache/jackrabbit/webdav/MultiStatus
in /opt/repos/bootstrap-maven-2.1.x/org/apache/jackrabbit/jackrabbit-webdav/1.5.0/jackrabbit-webdav-1.5.0.jar
     [java] [INFO] Replacing original artifact with shaded artifact.
     [java] [INFO] Replacing http://grid.sonatype.org/ci/job/Maven-2.1.x-bootstrap/./jdk=1.4,label=osx/ws/maven-2.1.x/apache-maven/target/maven-2.1.0-SNAPSHOT-uber.jar
 with http://grid.sonatype.org/ci/job/Maven-2.1.x-bootstrap/./jdk=1.4,label=osx/ws/maven-2.1.x/apache-maven/target/apache-maven-2.1.0-SNAPSHOT-shaded.jar

     [java] [INFO] [assembly:single {execution: bin-assembly}]
     [java] [INFO] Building tar : http://grid.sonatype.org/ci/job/Maven-2.1.x-bootstrap/./jdk=1.4,label=osx/ws/maven-2.1.x/apache-maven/target/apache-maven-2.1.0-SNAPSHOT-bin.tar.gz

     [java] [INFO] Building tar : http://grid.sonatype.org/ci/job/Maven-2.1.x-bootstrap/./jdk=1.4,label=osx/ws/maven-2.1.x/apache-maven/target/apache-maven-2.1.0-SNAPSHOT-bin.tar.bz2

     [java] [INFO] Building zip: http://grid.sonatype.org/ci/job/Maven-2.1.x-bootstrap/./jdk=1.4,label=osx/ws/maven-2.1.x/apache-maven/target/apache-maven-2.1.0-SNAPSHOT-bin.zip

     [java] [INFO] [install:install]
     [java] [INFO] Installing http://grid.sonatype.org/ci/job/Maven-2.1.x-bootstrap/./jdk=1.4,label=osx/ws/maven-2.1.x/apache-maven/target/apache-maven-2.1.0-SNAPSHOT.jar
 to /opt/repos/bootstrap-maven-2.1.x/org/apache/maven/apache-maven/2.1.0-SNAPSHOT/apache-maven-2.1.0-SNAPSHOT.jar
     [java] [INFO] Installing http://grid.sonatype.org/ci/job/Maven-2.1.x-bootstrap/./jdk=1.4,label=osx/ws/maven-2.1.x/apache-maven/target/apache-maven-2.1.0-SNAPSHOT-bin.tar.gz
 to /opt/repos/bootstrap-maven-2.1.x/org/apache/maven/apache-maven/2.1.0-SNAPSHOT/apache-maven-2.1.0-SNAPSHOT-bin.tar.gz
     [java] [INFO] Installing http://grid.sonatype.org/ci/job/Maven-2.1.x-bootstrap/./jdk=1.4,label=osx/ws/maven-2.1.x/apache-maven/target/apache-maven-2.1.0-SNAPSHOT-bin.tar.bz2
 to /opt/repos/bootstrap-maven-2.1.x/org/apache/maven/apache-maven/2.1.0-SNAPSHOT/apache-maven-2.1.0-SNAPSHOT-bin.tar.bz2
     [java] [INFO] Installing http://grid.sonatype.org/ci/job/Maven-2.1.x-bootstrap/./jdk=1.4,label=osx/ws/maven-2.1.x/apache-maven/target/apache-maven-2.1.0-SNAPSHOT-bin.zip
 to /opt/repos/bootstrap-maven-2.1.x/org/apache/maven/apache-maven/2.1.0-SNAPSHOT/apache-maven-2.1.0-SNAPSHOT-bin.zip
     [java] [INFO] 
     [java] [INFO] 
     [java] [INFO] ------------------------------------------------------------------------
     [java] [INFO] Reactor Summary:
     [java] [INFO] ------------------------------------------------------------------------
     [java] [INFO] Maven ................................................. SUCCESS [3.597s]
     [java] [INFO] Maven Artifact ........................................ SUCCESS [4.431s]
     [java] [INFO] Maven Repository Metadata Model ....................... SUCCESS [2.145s]
     [java] [INFO] Maven Artifact Manager ................................ SUCCESS [3.220s]
     [java] [INFO] Maven Model ........................................... SUCCESS [1.715s]
     [java] [INFO] Maven Local Settings Model ............................ SUCCESS [1.266s]
     [java] [INFO] Maven Artifact Test Helper Library .................... SUCCESS [0.492s]
     [java] [INFO] Maven Plugin Parameter Documenter API ................. SUCCESS [0.743s]
     [java] [INFO] Maven Reporting ....................................... SUCCESS [0.052s]
     [java] [INFO] Maven Reporting API ................................... SUCCESS [0.653s]
     [java] [INFO] Maven Profile Model ................................... SUCCESS [0.629s]
     [java] [INFO] Maven Error Diagnostics ............................... SUCCESS [0.445s]
     [java] [INFO] Maven Plugin Registry Model ........................... SUCCESS [0.579s]
     [java] [INFO] Maven Project Builder ................................. SUCCESS [8.574s]
     [java] [INFO] Maven Plugin API ...................................... SUCCESS [0.400s]
     [java] [INFO] Maven Plugin Descriptor Model ......................... SUCCESS [0.980s]
     [java] [INFO] Maven Monitor ......................................... SUCCESS [0.463s]
     [java] [INFO] Maven Core ............................................ SUCCESS [4.956s]
     [java] [INFO] Maven Script Support Root ............................. SUCCESS [0.049s]
     [java] [INFO] Maven Ant Mojo Support ................................ SUCCESS [1.960s]
     [java] [INFO] Maven Beanshell Mojo Support .......................... SUCCESS [0.528s]
     [java] [INFO] Maven Toolchains ...................................... SUCCESS [1.677s]
     [java] [INFO] Maven Distribution .................................... SUCCESS [23.050s]
     [java] [INFO] ------------------------------------------------------------------------
     [java] [INFO] ------------------------------------------------------------------------
     [java] [INFO] BUILD SUCCESSFUL
     [java] [INFO] ------------------------------------------------------------------------
     [java] [INFO] Total time: 1 minute 3 seconds
     [java] [INFO] Finished at: Sun Mar 01 08:24:58 CST 2009
     [java] [INFO] Final Memory: 41M/74M
     [java] [INFO] ------------------------------------------------------------------------

maven-assembly:
     [echo] 
     [echo]     The new Maven distribution was created as part of the MAVEN-COMPILE step,
above.
     [echo]     This goal just validates the presence of that distribution.
     [echo]     

extract-assembly:
     [echo] Extracting assembly to /tmp ...
   [delete] Deleting directory /tmp/apache-maven-2.1.0-SNAPSHOT
    [mkdir] Created dir: /tmp/apache-maven-2.1.0-SNAPSHOT
    [unzip] Expanding: http://grid.sonatype.org/ci/job/Maven-2.1.x-bootstrap/./jdk=1.4,label=osx/ws/maven-2.1.x/apache-maven/target/apache-maven-2.1.0-SNAPSHOT-bin.zip
 into /tmp

all:

its-setup:

its-win32:

its-unix:
     [echo] Retrieving integration tests
     [exec] + Error stacktraces are turned on.
     [exec] [INFO] Scanning for projects...
     [exec] [INFO] ------------------------------------------------------------------------
     [exec] [INFO] Building Maven Integration-Test Importer
     [exec] [INFO]    task-segment: [process-resources]
     [exec] [INFO] ------------------------------------------------------------------------
     [exec] [INFO] [resources:resources]
     [exec] [INFO] Using default encoding to copy filtered resources.
     [exec] [INFO] ------------------------------------------------------------------------
     [exec] [INFO] BUILD SUCCESSFUL
     [exec] [INFO] ------------------------------------------------------------------------
     [exec] [INFO] Total time: 1 second
     [exec] [INFO] Finished at: Sun Mar 01 08:25:00 CST 2009
     [exec] [INFO] Final Memory: 4M/7M
     [exec] [INFO] ------------------------------------------------------------------------
     [exec] + Error stacktraces are turned on.
     [exec] [INFO] Scanning for projects...
     [exec] [INFO] ------------------------------------------------------------------------
     [exec] [INFO] Building Maven Integration-Test Importer
     [exec] [INFO]    task-segment: [package]
     [exec] [INFO] ------------------------------------------------------------------------
     [exec] [INFO] [resources:resources]
     [exec] [INFO] Using default encoding to copy filtered resources.
     [exec] [INFO] [compiler:compile]
     [exec] [INFO] No sources to compile
     [exec] [INFO] [resources:testResources]
     [exec] [INFO] Using default encoding to copy filtered resources.
     [exec] [INFO] [compiler:testCompile]
     [exec] [INFO] No sources to compile
     [exec] [INFO] [surefire:test]
     [exec] [INFO] No tests to run.
     [exec] [INFO] [jar:jar]
     [exec] [INFO] Building jar: http://grid.sonatype.org/ci/job/Maven-2.1.x-bootstrap/./jdk=1.4,label=osx/ws/maven-2.1.x/maven-integration-tests/target/classes/target/maven-integration-tests-2.1.x.jar

     [exec] [INFO] [scm:update {execution: scm}]
     [exec] [INFO] Executing: /bin/sh -c cd /tmp/maven-integration-tests-2.1.x &&
svn --non-interactive update /tmp/maven-integration-tests-2.1.x
     [exec] [INFO] Working directory: /tmp/maven-integration-tests-2.1.x
     [exec] [ERROR] Provider message:
     [exec] [ERROR] The svn command failed.
     [exec] [ERROR] Command output:
     [exec] [ERROR] svn: Can't open file '/tmp/maven-integration-tests-2.1.x/core-it-support/maven-it-sample/src/test/java/org/apache/maven/it/.svn/text-base/MavenITmngXXXXDescriptionOfProblemTest.java.svn-base':
No such file or directory
     [exec] 
     [exec] [INFO] ------------------------------------------------------------------------
     [exec] [ERROR] BUILD ERROR
     [exec] [INFO] ------------------------------------------------------------------------
     [exec] [INFO] Command failed.The svn command failed.
     [exec] [INFO] ------------------------------------------------------------------------
     [exec] [INFO] Trace
     [exec] org.apache.maven.lifecycle.LifecycleExecutionException: Command failed.The svn
command failed.
     [exec] 	at org.apache.maven.lifecycle.DefaultLifecycleExecutor.executeGoals(DefaultLifecycleExecutor.java:702)
     [exec] 	at org.apache.maven.lifecycle.DefaultLifecycleExecutor.executeGoalWithLifecycle(DefaultLifecycleExecutor.java:539)
     [exec] 	at org.apache.maven.lifecycle.DefaultLifecycleExecutor.executeGoal(DefaultLifecycleExecutor.java:518)
     [exec] 	at org.apache.maven.lifecycle.DefaultLifecycleExecutor.executeGoalAndHandleFailures(DefaultLifecycleExecutor.java:370)
     [exec] 	at org.apache.maven.lifecycle.DefaultLifecycleExecutor.executeTaskSegments(DefaultLifecycleExecutor.java:331)
     [exec] 	at org.apache.maven.lifecycle.DefaultLifecycleExecutor.execute(DefaultLifecycleExecutor.java:181)
     [exec] 	at org.apache.maven.DefaultMaven.doExecute(DefaultMaven.java:346)
     [exec] 	at org.apache.maven.DefaultMaven.execute(DefaultMaven.java:133)
     [exec] 	at org.apache.maven.cli.MavenCli.main(MavenCli.java:356)
     [exec] 	at sun.reflect.NativeMethodAccessorImpl.invoke0(Native Method)
     [exec] 	at sun.reflect.NativeMethodAccessorImpl.invoke(NativeMethodAccessorImpl.java:39)
     [exec] 	at sun.reflect.DelegatingMethodAccessorImpl.invoke(DelegatingMethodAccessorImpl.java:25)
     [exec] 	at java.lang.reflect.Method.invoke(Method.java:324)
     [exec] 	at org.codehaus.classworlds.Launcher.launchEnhanced(Launcher.java:315)
     [exec] 	at org.codehaus.classworlds.Launcher.launch(Launcher.java:255)
     [exec] 	at org.codehaus.classworlds.Launcher.mainWithExitCode(Launcher.java:430)
     [exec] 	at org.codehaus.classworlds.Launcher.main(Launcher.java:375)
     [exec] Caused by: org.apache.maven.plugin.MojoExecutionException: Command failed.The
svn command failed.
     [exec] 	at org.apache.maven.scm.plugin.AbstractScmMojo.checkResult(AbstractScmMojo.java:400)
     [exec] 	at org.apache.maven.scm.plugin.UpdateMojo.execute(UpdateMojo.java:93)
     [exec] 	at org.apache.maven.plugin.DefaultPluginManager.executeMojo(DefaultPluginManager.java:458)
     [exec] 	at org.apache.maven.lifecycle.DefaultLifecycleExecutor.executeGoals(DefaultLifecycleExecutor.java:677)
     [exec] 	... 16 more
     [exec] [INFO] ------------------------------------------------------------------------
     [exec] [INFO] Total time: 24 seconds
     [exec] [INFO] Finished at: Sun Mar 01 08:25:25 CST 2009
     [exec] [INFO] Final Memory: 13M/26M
     [exec] [INFO] ------------------------------------------------------------------------

BUILD FAILED
http://grid.sonatype.org/ci/job/Maven-2.1.x-bootstrap/./jdk=1.4,label=osx/ws/maven-2.1.x/build.xml
:280: exec returned: 1

Total time: 1 minute 51 seconds


Mime
View raw message