maven-notifications mailing list archives

Site index · List index
Message view « Date » · « Thread »
Top « Date » · « Thread »
From Hudson <Hud...@sonatype.org>
Subject Build failed in Hudson: Maven 2.1.x » 1.5,windows #120
Date Mon, 27 Apr 2009 13:07:43 GMT
See http://grid.sonatype.org/ci/job/Maven%202.1.x/./jdk=1.5,label=windows/120/

------------------------------------------
[...truncated 1555 lines...]

-------------------------------------------------------
 T E S T S
-------------------------------------------------------
Running org.apache.maven.plugin.lifecycle.LifecycleXpp3ReaderTest
Tests run: 1, Failures: 0, Errors: 0, Skipped: 0, Time elapsed: 0.05 sec

Results :

Tests run: 1, Failures: 0, Errors: 0, Skipped: 0

[INFO] [jar:jar]
[INFO] Building jar: C:\home\hudson\workspace\Maven 2.1.x\jdk\1.5\label\windows\maven-2.1.xx\maven-plugin-descriptor\target\maven-plugin-descriptor-2.1.1-SNAPSHOT.jar
[INFO] [install:install]
[INFO] Installing C:\home\hudson\workspace\Maven 2.1.x\jdk\1.5\label\windows\maven-2.1.xx\maven-plugin-descriptor\target\maven-plugin-descriptor-2.1.1-SNAPSHOT.jar
to \opt\repos\maven-2.1.x\org\apache\maven\maven-plugin-descriptor\2.1.1-SNAPSHOT\maven-plugin-descriptor-2.1.1-SNAPSHOT.jar
[INFO] ------------------------------------------------------------------------
[INFO] Building Maven Monitor
[INFO]    task-segment: [clean, install]
[INFO] ------------------------------------------------------------------------
[INFO] [clean:clean]
[INFO] Deleting directory C:\home\hudson\workspace\Maven 2.1.x\jdk\1.5\label\windows\maven-2.1.xx\maven-monitor\target
[INFO] Deleting directory C:\home\hudson\workspace\Maven 2.1.x\jdk\1.5\label\windows\maven-2.1.xx\maven-monitor\target\classes
[INFO] Deleting directory C:\home\hudson\workspace\Maven 2.1.x\jdk\1.5\label\windows\maven-2.1.xx\maven-monitor\target\test-classes
[INFO] Deleting directory C:\home\hudson\workspace\Maven 2.1.x\jdk\1.5\label\windows\maven-2.1.xx\maven-monitor\target\site
[INFO] [enforcer:enforce {execution: enforce-jdk}]
[INFO] [remote-resources:process {execution: default}]
[INFO] [resources:resources]
[INFO] Using encoding: 'UTF-8' to copy filtered resources.
[INFO] [compiler:compile]
[INFO] Compiling 5 source files to C:\home\hudson\workspace\Maven 2.1.x\jdk\1.5\label\windows\maven-2.1.xx\maven-monitor\target\classes
[INFO] [resources:testResources]
[INFO] Using encoding: 'UTF-8' to copy filtered resources.
[INFO] [compiler:testCompile]
[INFO] No sources to compile
[INFO] [surefire:test]
[INFO] Surefire report directory: C:\home\hudson\workspace\Maven 2.1.x\jdk\1.5\label\windows\maven-2.1.xx\maven-monitor\target\surefire-reports

-------------------------------------------------------
 T E S T S
-------------------------------------------------------
There are no tests to run.

Results :

Tests run: 0, Failures: 0, Errors: 0, Skipped: 0

[INFO] [jar:jar]
[INFO] Building jar: C:\home\hudson\workspace\Maven 2.1.x\jdk\1.5\label\windows\maven-2.1.xx\maven-monitor\target\maven-monitor-2.1.1-SNAPSHOT.jar
[INFO] [install:install]
[INFO] Installing C:\home\hudson\workspace\Maven 2.1.x\jdk\1.5\label\windows\maven-2.1.xx\maven-monitor\target\maven-monitor-2.1.1-SNAPSHOT.jar
to \opt\repos\maven-2.1.x\org\apache\maven\maven-monitor\2.1.1-SNAPSHOT\maven-monitor-2.1.1-SNAPSHOT.jar
[INFO] ------------------------------------------------------------------------
[INFO] Building Maven Core
[INFO]    task-segment: [clean, install]
[INFO] ------------------------------------------------------------------------
Downloading: http://repository.sonatype.org:8081/content/groups/sonatype-grid/org/codehaus/mojo/buildnumber-maven-plugin/1.0-beta-1/buildnumber-maven-plugin-1.0-beta-1.pom
6K downloaded
Downloading: http://repository.sonatype.org:8081/content/groups/sonatype-grid/org/codehaus/mojo/mojo/16/mojo-16.pom
8K downloaded
Downloading: http://repository.sonatype.org:8081/content/groups/sonatype-grid/org/codehaus/mojo/buildnumber-maven-plugin/1.0-beta-1/buildnumber-maven-plugin-1.0-beta-1.jar
13K downloaded
[INFO] [clean:clean]
[INFO] Deleting directory C:\home\hudson\workspace\Maven 2.1.x\jdk\1.5\label\windows\maven-2.1.xx\maven-core\target
[INFO] Deleting directory C:\home\hudson\workspace\Maven 2.1.x\jdk\1.5\label\windows\maven-2.1.xx\maven-core\target\classes
[INFO] Deleting directory C:\home\hudson\workspace\Maven 2.1.x\jdk\1.5\label\windows\maven-2.1.xx\maven-core\target\test-classes
[INFO] Deleting directory C:\home\hudson\workspace\Maven 2.1.x\jdk\1.5\label\windows\maven-2.1.xx\maven-core\target\site
Downloading: http://repository.sonatype.org:8081/content/groups/sonatype-grid/org/apache/maven/wagon/wagon-webdav-jackrabbit/1.0-beta-5/wagon-webdav-jackrabbit-1.0-beta-5.pom
3K downloaded
Downloading: http://repository.sonatype.org:8081/content/groups/sonatype-grid/commons-httpclient/commons-httpclient/3.1/commons-httpclient-3.1.pom
7K downloaded
Downloading: http://repository.sonatype.org:8081/content/groups/sonatype-grid/commons-codec/commons-codec/1.2/commons-codec-1.2.pom
3K downloaded
Downloading: http://repository.sonatype.org:8081/content/groups/sonatype-grid/org/apache/jackrabbit/jackrabbit-webdav/1.5.0/jackrabbit-webdav-1.5.0.pom
3K downloaded
Downloading: http://repository.sonatype.org:8081/content/groups/sonatype-grid/org/apache/jackrabbit/jackrabbit-parent/1.5.0/jackrabbit-parent-1.5.0.pom
24K downloaded
Downloading: http://repository.sonatype.org:8081/content/groups/sonatype-grid/org/apache/jackrabbit/jackrabbit-jcr-commons/1.5.0/jackrabbit-jcr-commons-1.5.0.pom
2K downloaded
Downloading: http://repository.sonatype.org:8081/content/groups/sonatype-grid/org/slf4j/slf4j-api/1.5.3/slf4j-api-1.5.3.pom
2K downloaded
Downloading: http://repository.sonatype.org:8081/content/groups/sonatype-grid/org/slf4j/slf4j-parent/1.5.3/slf4j-parent-1.5.3.pom
7K downloaded
Downloading: http://repository.sonatype.org:8081/content/groups/sonatype-grid/commons-httpclient/commons-httpclient/3.0/commons-httpclient-3.0.pom
7K downloaded
Downloading: http://repository.sonatype.org:8081/content/groups/sonatype-grid/org/slf4j/slf4j-nop/1.5.3/slf4j-nop-1.5.3.pom
1K downloaded
Downloading: http://repository.sonatype.org:8081/content/groups/sonatype-grid/org/apache/maven/wagon/wagon-ssh-external/1.0-beta-5/wagon-ssh-external-1.0-beta-5.pom
2K downloaded
Downloading: http://repository.sonatype.org:8081/content/groups/sonatype-grid/org/apache/maven/wagon/wagon-ssh-common/1.0-beta-5/wagon-ssh-common-1.0-beta-5.pom
1K downloaded
Downloading: http://repository.sonatype.org:8081/content/groups/sonatype-grid/org/codehaus/plexus/plexus-interactivity-api/1.0-alpha-6/plexus-interactivity-api-1.0-alpha-6.pom
726b downloaded
Downloading: http://repository.sonatype.org:8081/content/groups/sonatype-grid/org/codehaus/plexus/plexus-interactivity/1.0-alpha-6/plexus-interactivity-1.0-alpha-6.pom
1K downloaded
Downloading: http://repository.sonatype.org:8081/content/groups/sonatype-grid/org/codehaus/plexus/plexus-components/1.1.9/plexus-components-1.1.9.pom
2K downloaded
Downloading: http://repository.sonatype.org:8081/content/groups/sonatype-grid/org/apache/maven/wagon/wagon-ssh/1.0-beta-5/wagon-ssh-1.0-beta-5.pom
2K downloaded
Downloading: http://repository.sonatype.org:8081/content/groups/sonatype-grid/com/jcraft/jsch/0.1.38/jsch-0.1.38.pom
967b downloaded
[INFO] snapshot org.sonatype.plexus:plexus-sec-dispatcher:1.3-SNAPSHOT: checking for updates
from central
[INFO] snapshot org.sonatype.plexus:plexus-sec-dispatcher:1.3-SNAPSHOT: checking for updates
from apache.snapshots
Downloading: http://repository.sonatype.org:8081/content/groups/sonatype-grid/org/sonatype/plexus/plexus-sec-dispatcher/1.3-SNAPSHOT/plexus-sec-dispatcher-1.3-SNAPSHOT.pom
Downloading: http://repository.sonatype.org:8081/content/groups/sonatype-grid/org/sonatype/plexus/plexus-sec-dispatcher/1.3-SNAPSHOT/plexus-sec-dispatcher-1.3-SNAPSHOT.pom
Downloading: http://repository.sonatype.org:8081/content/groups/sonatype-grid/org/apache/maven/wagon/wagon-webdav-jackrabbit/1.0-beta-5/wagon-webdav-jackrabbit-1.0-beta-5.jar
17K downloaded
Downloading: http://repository.sonatype.org:8081/content/groups/sonatype-grid/commons-httpclient/commons-httpclient/3.1/commons-httpclient-3.1.jar
297K downloaded
Downloading: http://repository.sonatype.org:8081/content/groups/sonatype-grid/commons-logging/commons-logging/1.0.4/commons-logging-1.0.4.jar
37K downloaded
Downloading: http://repository.sonatype.org:8081/content/groups/sonatype-grid/commons-codec/commons-codec/1.2/commons-codec-1.2.jar
29K downloaded
Downloading: http://repository.sonatype.org:8081/content/groups/sonatype-grid/org/apache/jackrabbit/jackrabbit-webdav/1.5.0/jackrabbit-webdav-1.5.0.jar
295K downloaded
Downloading: http://repository.sonatype.org:8081/content/groups/sonatype-grid/org/apache/jackrabbit/jackrabbit-jcr-commons/1.5.0/jackrabbit-jcr-commons-1.5.0.jar
198K downloaded
Downloading: http://repository.sonatype.org:8081/content/groups/sonatype-grid/org/slf4j/slf4j-api/1.5.3/slf4j-api-1.5.3.jar
19K downloaded
Downloading: http://repository.sonatype.org:8081/content/groups/sonatype-grid/org/slf4j/slf4j-nop/1.5.3/slf4j-nop-1.5.3.jar
5K downloaded
Downloading: http://repository.sonatype.org:8081/content/groups/sonatype-grid/commons-cli/commons-cli/1.0/commons-cli-1.0.jar
29K downloaded
Downloading: http://repository.sonatype.org:8081/content/groups/sonatype-grid/org/apache/maven/wagon/wagon-ssh-external/1.0-beta-5/wagon-ssh-external-1.0-beta-5.jar
14K downloaded
Downloading: http://repository.sonatype.org:8081/content/groups/sonatype-grid/org/apache/maven/wagon/wagon-ssh-common/1.0-beta-5/wagon-ssh-common-1.0-beta-5.jar
25K downloaded
Downloading: http://repository.sonatype.org:8081/content/groups/sonatype-grid/org/codehaus/plexus/plexus-interactivity-api/1.0-alpha-4/plexus-interactivity-api-1.0-alpha-4.jar
13K downloaded
Downloading: http://repository.sonatype.org:8081/content/groups/sonatype-grid/org/apache/maven/wagon/wagon-ssh/1.0-beta-5/wagon-ssh-1.0-beta-5.jar
27K downloaded
Downloading: http://repository.sonatype.org:8081/content/groups/sonatype-grid/com/jcraft/jsch/0.1.38/jsch-0.1.38.jar
173K downloaded
Downloading: http://repository.sonatype.org:8081/content/groups/sonatype-grid/org/sonatype/plexus/plexus-sec-dispatcher/1.3-SNAPSHOT/plexus-sec-dispatcher-1.3-SNAPSHOT.jar
Downloading: http://repository.sonatype.org:8081/content/groups/sonatype-grid/org/sonatype/plexus/plexus-sec-dispatcher/1.3-SNAPSHOT/plexus-sec-dispatcher-1.3-SNAPSHOT.jar
[INFO] ------------------------------------------------------------------------
[ERROR] BUILD ERROR
[INFO] ------------------------------------------------------------------------
[INFO] Failed to resolve artifact.

Missing:
----------
1) org.sonatype.plexus:plexus-sec-dispatcher:jar:1.3-SNAPSHOT

  Try downloading the file manually from the project website.

  Then, install it using the command: 
      mvn install:install-file -DgroupId=org.sonatype.plexus -DartifactId=plexus-sec-dispatcher
-Dversion=1.3-SNAPSHOT -Dpackaging=jar -Dfile=/path/to/file

  Alternatively, if you host your own repository you can deploy the file there: 
      mvn deploy:deploy-file -DgroupId=org.sonatype.plexus -DartifactId=plexus-sec-dispatcher
-Dversion=1.3-SNAPSHOT -Dpackaging=jar -Dfile=/path/to/file -Durl=[url] -DrepositoryId=[id]

  Path to dependency: 
  	1) org.apache.maven:maven-core:jar:2.1.1-SNAPSHOT
  	2) org.sonatype.plexus:plexus-sec-dispatcher:jar:1.3-SNAPSHOT

----------
1 required artifact is missing.

for artifact: 
  org.apache.maven:maven-core:jar:2.1.1-SNAPSHOT

from the specified remote repositories:
  Nexus (http://repository.sonatype.org:8081/content/groups/sonatype-grid)



[INFO] ------------------------------------------------------------------------
[INFO] Trace
org.apache.maven.lifecycle.LifecycleExecutionException: Missing:
----------
1) org.sonatype.plexus:plexus-sec-dispatcher:jar:1.3-SNAPSHOT

  Try downloading the file manually from the project website.

  Then, install it using the command: 
      mvn install:install-file -DgroupId=org.sonatype.plexus -DartifactId=plexus-sec-dispatcher
-Dversion=1.3-SNAPSHOT -Dpackaging=jar -Dfile=/path/to/file

  Alternatively, if you host your own repository you can deploy the file there: 
      mvn deploy:deploy-file -DgroupId=org.sonatype.plexus -DartifactId=plexus-sec-dispatcher
-Dversion=1.3-SNAPSHOT -Dpackaging=jar -Dfile=/path/to/file -Durl=[url] -DrepositoryId=[id]

  Path to dependency: 
  	1) org.apache.maven:maven-core:jar:2.1.1-SNAPSHOT
  	2) org.sonatype.plexus:plexus-sec-dispatcher:jar:1.3-SNAPSHOT

----------
1 required artifact is missing.

for artifact: 
  org.apache.maven:maven-core:jar:2.1.1-SNAPSHOT

from the specified remote repositories:
  Nexus (http://repository.sonatype.org:8081/content/groups/sonatype-grid)


	at org.apache.maven.lifecycle.DefaultLifecycleExecutor.executeGoals(DefaultLifecycleExecutor.java:693)
	at org.apache.maven.lifecycle.DefaultLifecycleExecutor.executeGoalWithLifecycle(DefaultLifecycleExecutor.java:538)
	at org.apache.maven.lifecycle.DefaultLifecycleExecutor.executeGoal(DefaultLifecycleExecutor.java:517)
	at org.apache.maven.lifecycle.DefaultLifecycleExecutor.executeGoalAndHandleFailures(DefaultLifecycleExecutor.java:369)
	at org.apache.maven.lifecycle.DefaultLifecycleExecutor.executeTaskSegments(DefaultLifecycleExecutor.java:330)
	at org.apache.maven.lifecycle.DefaultLifecycleExecutor.execute(DefaultLifecycleExecutor.java:181)
	at org.apache.maven.DefaultMaven.doExecute(DefaultMaven.java:336)
	at org.apache.maven.DefaultMaven.execute(DefaultMaven.java:129)
	at org.apache.maven.cli.MavenCli.main(MavenCli.java:302)
	at sun.reflect.NativeMethodAccessorImpl.invoke0(Native Method)
	at sun.reflect.NativeMethodAccessorImpl.invoke(NativeMethodAccessorImpl.java:39)
	at sun.reflect.DelegatingMethodAccessorImpl.invoke(DelegatingMethodAccessorImpl.java:25)
	at java.lang.reflect.Method.invoke(Method.java:585)
	at org.codehaus.classworlds.Launcher.launchEnhanced(Launcher.java:315)
	at org.codehaus.classworlds.Launcher.launch(Launcher.java:255)
	at org.codehaus.classworlds.Launcher.mainWithExitCode(Launcher.java:430)
	at org.codehaus.classworlds.Launcher.main(Launcher.java:375)
Caused by: org.apache.maven.artifact.resolver.MultipleArtifactsNotFoundException: Missing:
----------
1) org.sonatype.plexus:plexus-sec-dispatcher:jar:1.3-SNAPSHOT

  Try downloading the file manually from the project website.

  Then, install it using the command: 
      mvn install:install-file -DgroupId=org.sonatype.plexus -DartifactId=plexus-sec-dispatcher
-Dversion=1.3-SNAPSHOT -Dpackaging=jar -Dfile=/path/to/file

  Alternatively, if you host your own repository you can deploy the file there: 
      mvn deploy:deploy-file -DgroupId=org.sonatype.plexus -DartifactId=plexus-sec-dispatcher
-Dversion=1.3-SNAPSHOT -Dpackaging=jar -Dfile=/path/to/file -Durl=[url] -DrepositoryId=[id]

  Path to dependency: 
  	1) org.apache.maven:maven-core:jar:2.1.1-SNAPSHOT
  	2) org.sonatype.plexus:plexus-sec-dispatcher:jar:1.3-SNAPSHOT

----------
1 required artifact is missing.

for artifact: 
  org.apache.maven:maven-core:jar:2.1.1-SNAPSHOT

from the specified remote repositories:
  Nexus (http://repository.sonatype.org:8081/content/groups/sonatype-grid)


	at org.apache.maven.artifact.resolver.DefaultArtifactResolver.resolveTransitively(DefaultArtifactResolver.java:324)
	at org.apache.maven.artifact.resolver.DefaultArtifactResolver.resolveTransitively(DefaultArtifactResolver.java:288)
	at org.apache.maven.plugin.DefaultPluginManager.resolveTransitiveDependencies(DefaultPluginManager.java:1440)
	at org.apache.maven.plugin.DefaultPluginManager.executeMojo(DefaultPluginManager.java:410)
	at org.apache.maven.lifecycle.DefaultLifecycleExecutor.executeGoals(DefaultLifecycleExecutor.java:676)
	... 16 more
[INFO] ------------------------------------------------------------------------
[INFO] Total time: 1 minute 14 seconds
[INFO] Finished at: Mon Apr 27 06:07:21 PDT 2009
[INFO] Final Memory: 30M/64M
[INFO] ------------------------------------------------------------------------
[locks-and-latches] Releasing all the locks
[locks-and-latches] All the locks released


Mime
View raw message