maven-notifications mailing list archives

Site index · List index
Message view « Date » · « Thread »
Top « Date » · « Thread »
From Hudson <Hud...@sonatype.org>
Subject Build failed in Hudson: Maven-2.1.x-bootstrap » 1.4,ubuntu #150
Date Tue, 21 Apr 2009 17:24:11 GMT
See http://grid.sonatype.org/ci/job/Maven-2.1.x-bootstrap/./jdk=1.4,label=ubuntu/150/changes

Changes:

[John Casey] update to require java 1.5.

------------------------------------------
[...truncated 348 lines...]
  [modello] Generating sources for maven-repository-metadata/src/main/mdo/metadata.mdo
  [modello] Generating sources for maven-toolchain/src/main/mdo/toolchains.xml

compile-boot:
    [mkdir] Created dir: /home/hudson/workspace/Maven-2.1.x-bootstrap/jdk/1.4/label/ubuntu/maven-2.1.x/bootstrap/target/classes
    [javac] Compiling 356 source files to /home/hudson/workspace/Maven-2.1.x-bootstrap/jdk/1.4/label/ubuntu/maven-2.1.x/bootstrap/target/classes
    [javac] Note: Some input files use or override a deprecated API.
    [javac] Note: Recompile with -deprecation for details.
    [mkdir] Created dir: /home/hudson/workspace/Maven-2.1.x-bootstrap/jdk/1.4/label/ubuntu/maven-2.1.x/bootstrap/target/classes/META-INF/maven/org.apache.maven/maven-core

maven-compile:
     [java] + Error stacktraces are turned on.
     [java] [INFO] Scanning for projects...
     [java] [INFO] Reactor build order: 
     [java] [INFO]   Maven
     [java] [INFO]   Maven Artifact
     [java] [INFO]   Maven Repository Metadata Model
     [java] [INFO]   Maven Artifact Manager
     [java] [INFO]   Maven Model
     [java] [INFO]   Maven Local Settings Model
     [java] [INFO]   Maven Artifact Test Helper Library
     [java] [INFO]   Maven Plugin Parameter Documenter API
     [java] [INFO]   Maven Reporting
     [java] [INFO]   Maven Reporting API
     [java] [INFO]   Maven Profile Model
     [java] [INFO]   Maven Error Diagnostics
     [java] [INFO]   Maven Plugin Registry Model
     [java] [INFO]   Maven Project Builder
     [java] [INFO]   Maven Plugin API
     [java] [INFO]   Maven Plugin Descriptor Model
     [java] [INFO]   Maven Monitor
     [java] [INFO]   Maven Core
     [java] [INFO]   Maven Script Support Root
     [java] [INFO]   Maven Ant Mojo Support
     [java] [INFO]   Maven Beanshell Mojo Support
     [java] [INFO]   Maven Toolchains
     [java] [INFO]   Maven Distribution
     [java] [INFO] ------------------------------------------------------------------------
     [java] [INFO] Building Maven
     [java] [INFO]    task-segment: [clean, install]
     [java] [INFO] ------------------------------------------------------------------------
     [java] Downloading: http://repository.sonatype.org:8081/content/groups/sonatype-grid/org/apache/maven/plugins/maven-clean-plugin/2.1.1/maven-clean-plugin-2.1.1.pom
     [java] 1K downloaded  (maven-clean-plugin-2.1.1.pom)
     [java] Downloading: http://repository.sonatype.org:8081/content/groups/sonatype-grid/org/apache/maven/plugins/maven-plugins/3/maven-plugins-3.pom
     [java] 6K downloaded  (maven-plugins-3.pom)
     [java] Downloading: http://repository.sonatype.org:8081/content/groups/sonatype-grid/org/apache/maven/plugins/maven-clean-plugin/2.1.1/maven-clean-plugin-2.1.1.jar
     [java] 6K downloaded  (maven-clean-plugin-2.1.1.jar)
     [java] Downloading: http://repository.sonatype.org:8081/content/groups/sonatype-grid/org/apache/maven/plugins/maven-remote-resources-plugin/1.0-beta-2/maven-remote-resources-plugin-1.0-beta-2.pom
     [java] 6K downloaded  (maven-remote-resources-plugin-1.0-beta-2.pom)
     [java] Downloading: http://repository.sonatype.org:8081/content/groups/sonatype-grid/org/apache/maven/plugins/maven-plugins/10/maven-plugins-10.pom
     [java] 7K downloaded  (maven-plugins-10.pom)
     [java] Downloading: http://repository.sonatype.org:8081/content/groups/sonatype-grid/org/apache/maven/maven-parent/7/maven-parent-7.pom
     [java] 20K downloaded  (maven-parent-7.pom)
     [java] Downloading: http://repository.sonatype.org:8081/content/groups/sonatype-grid/org/apache/maven/plugins/maven-remote-resources-plugin/1.0-beta-2/maven-remote-resources-plugin-1.0-beta-2.jar
     [java] 47K downloaded  (maven-remote-resources-plugin-1.0-beta-2.jar)
     [java] Downloading: http://repository.sonatype.org:8081/content/groups/sonatype-grid/org/apache/maven/plugins/maven-enforcer-plugin/1.0-alpha-4/maven-enforcer-plugin-1.0-alpha-4.pom
     [java] 5K downloaded  (maven-enforcer-plugin-1.0-alpha-4.pom)
     [java] Downloading: http://repository.sonatype.org:8081/content/groups/sonatype-grid/org/apache/maven/enforcer/enforcer/1/enforcer-1.pom
     [java] 9K downloaded  (enforcer-1.pom)
     [java] Downloading: http://repository.sonatype.org:8081/content/groups/sonatype-grid/org/apache/maven/maven-parent/9/maven-parent-9.pom
     [java] 32K downloaded  (maven-parent-9.pom)
     [java] Downloading: http://repository.sonatype.org:8081/content/groups/sonatype-grid/org/apache/maven/plugins/maven-enforcer-plugin/1.0-alpha-4/maven-enforcer-plugin-1.0-alpha-4.jar
     [java] 20K downloaded  (maven-enforcer-plugin-1.0-alpha-4.jar)
     [java] Downloading: http://repository.sonatype.org:8081/content/groups/sonatype-grid/org/apache/maven/maven-plugin-api/2.0/maven-plugin-api-2.0.pom
     [java] 601b downloaded  (maven-plugin-api-2.0.pom)
     [java] Downloading: http://repository.sonatype.org:8081/content/groups/sonatype-grid/org/apache/maven/maven/2.0/maven-2.0.pom
     [java] 8K downloaded  (maven-2.0.pom)
     [java] Downloading: http://repository.sonatype.org:8081/content/groups/sonatype-grid/org/apache/maven/shared/file-management/1.0/file-management-1.0.pom
     [java] 1K downloaded  (file-management-1.0.pom)
     [java] Downloading: http://repository.sonatype.org:8081/content/groups/sonatype-grid/org/apache/maven/shared/shared-components-parent/1/shared-components-parent-1.pom
     [java] 4K downloaded  (shared-components-parent-1.pom)
     [java] Downloading: http://repository.sonatype.org:8081/content/groups/sonatype-grid/org/codehaus/plexus/plexus-utils/1.1/plexus-utils-1.1.pom
     [java] 767b downloaded  (plexus-utils-1.1.pom)
     [java] Downloading: http://repository.sonatype.org:8081/content/groups/sonatype-grid/org/codehaus/plexus/plexus-utils/1.1/plexus-utils-1.1.jar
     [java] Downloading: http://repository.sonatype.org:8081/content/groups/sonatype-grid/org/apache/maven/shared/file-management/1.0/file-management-1.0.jar
     [java] 164K downloaded  (plexus-utils-1.1.jar)
     [java] 19K downloaded  (file-management-1.0.jar)
     [java] Downloading: http://repository.sonatype.org:8081/content/groups/sonatype-grid/org/apache/maven/maven-plugin-api/2.0/maven-plugin-api-2.0.jar
     [java] 9K downloaded  (maven-plugin-api-2.0.jar)
     [java] [INFO] [clean:clean]
     [java] [INFO] Deleting directory /home/hudson/workspace/Maven-2.1.x-bootstrap/jdk/1.4/label/ubuntu/maven-2.1.x/target
     [java] [INFO] Deleting directory /home/hudson/workspace/Maven-2.1.x-bootstrap/jdk/1.4/label/ubuntu/maven-2.1.x/target/classes
     [java] [INFO] Deleting directory /home/hudson/workspace/Maven-2.1.x-bootstrap/jdk/1.4/label/ubuntu/maven-2.1.x/target/test-classes
     [java] [INFO] Deleting directory /home/hudson/workspace/Maven-2.1.x-bootstrap/jdk/1.4/label/ubuntu/maven-2.1.x/target/site
     [java] Downloading: http://repository.sonatype.org:8081/content/groups/sonatype-grid/org/apache/maven/plugins/maven-site-plugin/2.0/maven-site-plugin-2.0.pom
     [java] 11K downloaded  (maven-site-plugin-2.0.pom)
     [java] Downloading: http://repository.sonatype.org:8081/content/groups/sonatype-grid/org/apache/maven/plugins/maven-plugins/13/maven-plugins-13.pom
     [java] 11K downloaded  (maven-plugins-13.pom)
     [java] Downloading: http://repository.sonatype.org:8081/content/groups/sonatype-grid/org/apache/maven/plugins/maven-site-plugin/2.0/maven-site-plugin-2.0.jar
     [java] 78K downloaded  (maven-site-plugin-2.0.jar)
     [java] Downloading: http://repository.sonatype.org:8081/content/groups/sonatype-grid/org/apache/maven/plugins/maven-install-plugin/2.1/maven-install-plugin-2.1.pom
     [java] 981b downloaded  (maven-install-plugin-2.1.pom)
     [java] Downloading: http://repository.sonatype.org:8081/content/groups/sonatype-grid/org/apache/maven/plugins/maven-plugin-parent/2.0/maven-plugin-parent-2.0.pom
     [java] 6K downloaded  (maven-plugin-parent-2.0.pom)
     [java] Downloading: http://repository.sonatype.org:8081/content/groups/sonatype-grid/org/apache/maven/plugins/maven-install-plugin/2.1/maven-install-plugin-2.1.jar
     [java] 8K downloaded  (maven-install-plugin-2.1.jar)
     [java] Downloading: http://repository.sonatype.org:8081/content/groups/sonatype-grid/org/apache/maven/maven-artifact/2.0.9/maven-artifact-2.0.9.pom
     [java] 1K downloaded  (maven-artifact-2.0.9.pom)
     [java] Downloading: http://repository.sonatype.org:8081/content/groups/sonatype-grid/org/apache/maven/maven/2.0.9/maven-2.0.9.pom
     [java] 18K downloaded  (maven-2.0.9.pom)
     [java] Downloading: http://repository.sonatype.org:8081/content/groups/sonatype-grid/org/apache/maven/maven-parent/8/maven-parent-8.pom
     [java] 23K downloaded  (maven-parent-8.pom)
     [java] Downloading: http://repository.sonatype.org:8081/content/groups/sonatype-grid/org/codehaus/plexus/plexus-utils/1.5.1/plexus-utils-1.5.1.pom
     [java] 2K downloaded  (plexus-utils-1.5.1.pom)
     [java] Downloading: http://repository.sonatype.org:8081/content/groups/sonatype-grid/org/apache/maven/maven-plugin-api/2.0.9/maven-plugin-api-2.0.9.pom
     [java] 1K downloaded  (maven-plugin-api-2.0.9.pom)
     [java] Downloading: http://repository.sonatype.org:8081/content/groups/sonatype-grid/org/apache/maven/maven-project/2.0.9/maven-project-2.0.9.pom
     [java] 2K downloaded  (maven-project-2.0.9.pom)
     [java] Downloading: http://repository.sonatype.org:8081/content/groups/sonatype-grid/org/apache/maven/maven-settings/2.0.9/maven-settings-2.0.9.pom
     [java] 2K downloaded  (maven-settings-2.0.9.pom)
     [java] Downloading: http://repository.sonatype.org:8081/content/groups/sonatype-grid/org/apache/maven/maven-model/2.0.9/maven-model-2.0.9.pom
     [java] 3K downloaded  (maven-model-2.0.9.pom)
     [java] Downloading: http://repository.sonatype.org:8081/content/groups/sonatype-grid/junit/junit/3.8.2/junit-3.8.2.pom
     [java] 747b downloaded  (junit-3.8.2.pom)
     [java] Downloading: http://repository.sonatype.org:8081/content/groups/sonatype-grid/org/apache/maven/maven-profile/2.0.9/maven-profile-2.0.9.pom
     [java] 2K downloaded  (maven-profile-2.0.9.pom)
     [java] Downloading: http://repository.sonatype.org:8081/content/groups/sonatype-grid/org/apache/maven/maven-artifact-manager/2.0.9/maven-artifact-manager-2.0.9.pom
     [java] 2K downloaded  (maven-artifact-manager-2.0.9.pom)
     [java] Downloading: http://repository.sonatype.org:8081/content/groups/sonatype-grid/org/apache/maven/maven-repository-metadata/2.0.9/maven-repository-metadata-2.0.9.pom
     [java] 1K downloaded  (maven-repository-metadata-2.0.9.pom)
     [java] Downloading: http://repository.sonatype.org:8081/content/groups/sonatype-grid/org/apache/maven/maven-plugin-registry/2.0.9/maven-plugin-registry-2.0.9.pom
     [java] 1K downloaded  (maven-plugin-registry-2.0.9.pom)
     [java] Downloading: http://repository.sonatype.org:8081/content/groups/sonatype-grid/org/apache/maven/maven-core/2.0.9/maven-core-2.0.9.pom
     [java] 7K downloaded  (maven-core-2.0.9.pom)
     [java] Downloading: http://repository.sonatype.org:8081/content/groups/sonatype-grid/org/apache/maven/wagon/wagon-file/1.0-beta-2/wagon-file-1.0-beta-2.pom
     [java] 637b downloaded  (wagon-file-1.0-beta-2.pom)
     [java] Downloading: http://repository.sonatype.org:8081/content/groups/sonatype-grid/org/apache/maven/wagon/wagon-providers/1.0-beta-2/wagon-providers-1.0-beta-2.pom
     [java] 1K downloaded  (wagon-providers-1.0-beta-2.pom)
     [java] Downloading: http://repository.sonatype.org:8081/content/groups/sonatype-grid/org/apache/maven/maven-plugin-parameter-documenter/2.0.9/maven-plugin-parameter-documenter-2.0.9.pom
     [java] 1K downloaded  (maven-plugin-parameter-documenter-2.0.9.pom)
     [java] Downloading: http://repository.sonatype.org:8081/content/groups/sonatype-grid/org/apache/maven/wagon/wagon-webdav/1.0-beta-2/wagon-webdav-1.0-beta-2.pom
     [java] 1K downloaded  (wagon-webdav-1.0-beta-2.pom)
     [java] Downloading: http://repository.sonatype.org:8081/content/groups/sonatype-grid/slide/slide-webdavlib/2.1/slide-webdavlib-2.1.pom
     [java] 648b downloaded  (slide-webdavlib-2.1.pom)
     [java] Downloading: http://repository.sonatype.org:8081/content/groups/sonatype-grid/commons-httpclient/commons-httpclient/2.0.2/commons-httpclient-2.0.2.pom
     [java] 6K downloaded  (commons-httpclient-2.0.2.pom)
     [java] Downloading: http://repository.sonatype.org:8081/content/groups/sonatype-grid/commons-logging/commons-logging/1.0.3/commons-logging-1.0.3.pom
     [java] 866b downloaded  (commons-logging-1.0.3.pom)
     [java] Downloading: http://repository.sonatype.org:8081/content/groups/sonatype-grid/jdom/jdom/1.0/jdom-1.0.pom
     [java] 1K downloaded  (jdom-1.0.pom)
     [java] Downloading: http://repository.sonatype.org:8081/content/groups/sonatype-grid/de/zeigermann/xml/xml-im-exporter/1.1/xml-im-exporter-1.1.pom
     [java] 248b downloaded  (xml-im-exporter-1.1.pom)
     [java] Downloading: http://repository.sonatype.org:8081/content/groups/sonatype-grid/org/apache/maven/wagon/wagon-http-lightweight/1.0-beta-2/wagon-http-lightweight-1.0-beta-2.pom
     [java] 1K downloaded  (wagon-http-lightweight-1.0-beta-2.pom)
     [java] Downloading: http://repository.sonatype.org:8081/content/groups/sonatype-grid/org/apache/maven/wagon/wagon-http-shared/1.0-beta-2/wagon-http-shared-1.0-beta-2.pom
     [java] 845b downloaded  (wagon-http-shared-1.0-beta-2.pom)
     [java] Downloading: http://repository.sonatype.org:8081/content/groups/sonatype-grid/jtidy/jtidy/4aug2000r7-dev/jtidy-4aug2000r7-dev.pom
     [java] 1K downloaded  (jtidy-4aug2000r7-dev.pom)
     [java] Downloading: http://repository.sonatype.org:8081/content/groups/sonatype-grid/xml-apis/xml-apis/1.0.b2/xml-apis-1.0.b2.pom
     [java] 2K downloaded  (xml-apis-1.0.b2.pom)
     [java] Downloading: http://repository.sonatype.org:8081/content/groups/sonatype-grid/org/apache/maven/reporting/maven-reporting-api/2.0.9/maven-reporting-api-2.0.9.pom
     [java] 1K downloaded  (maven-reporting-api-2.0.9.pom)
     [java] Downloading: http://repository.sonatype.org:8081/content/groups/sonatype-grid/org/apache/maven/reporting/maven-reporting/2.0.9/maven-reporting-2.0.9.pom
     [java] 1K downloaded  (maven-reporting-2.0.9.pom)
     [java] Downloading: http://repository.sonatype.org:8081/content/groups/sonatype-grid/org/apache/maven/doxia/doxia-sink-api/1.0-alpha-10/doxia-sink-api-1.0-alpha-10.pom
     [java] 1K downloaded  (doxia-sink-api-1.0-alpha-10.pom)
     [java] Downloading: http://repository.sonatype.org:8081/content/groups/sonatype-grid/org/apache/maven/doxia/doxia/1.0-alpha-10/doxia-1.0-alpha-10.pom
     [java] 8K downloaded  (doxia-1.0-alpha-10.pom)
     [java] Downloading: http://repository.sonatype.org:8081/content/groups/sonatype-grid/org/apache/maven/maven-parent/6/maven-parent-6.pom
     [java] 19K downloaded  (maven-parent-6.pom)
     [java] Downloading: http://repository.sonatype.org:8081/content/groups/sonatype-grid/org/apache/maven/maven-error-diagnostics/2.0.9/maven-error-diagnostics-2.0.9.pom
     [java] 1K downloaded  (maven-error-diagnostics-2.0.9.pom)
     [java] Downloading: http://repository.sonatype.org:8081/content/groups/sonatype-grid/org/apache/maven/wagon/wagon-ssh-external/1.0-beta-2/wagon-ssh-external-1.0-beta-2.pom
     [java] 1K downloaded  (wagon-ssh-external-1.0-beta-2.pom)
     [java] Downloading: http://repository.sonatype.org:8081/content/groups/sonatype-grid/org/apache/maven/wagon/wagon-ssh-common/1.0-beta-2/wagon-ssh-common-1.0-beta-2.pom
     [java] 851b downloaded  (wagon-ssh-common-1.0-beta-2.pom)
     [java] Downloading: http://repository.sonatype.org:8081/content/groups/sonatype-grid/org/codehaus/plexus/plexus-interactivity-api/1.0-alpha-4/plexus-interactivity-api-1.0-alpha-4.pom
     [java] 6K downloaded  (plexus-interactivity-api-1.0-alpha-4.pom)
     [java] Downloading: http://repository.sonatype.org:8081/content/groups/sonatype-grid/org/codehaus/plexus/plexus-container-default/1.0-alpha-7/plexus-container-default-1.0-alpha-7.pom
     [java] 1K downloaded  (plexus-container-default-1.0-alpha-7.pom)
     [java] Downloading: http://repository.sonatype.org:8081/content/groups/sonatype-grid/plexus/plexus-containers/1.0.2/plexus-containers-1.0.2.pom
     [java] 471b downloaded  (plexus-containers-1.0.2.pom)
     [java] Downloading: http://repository.sonatype.org:8081/content/groups/sonatype-grid/plexus/plexus-root/1.0.3/plexus-root-1.0.3.pom
     [java] 5K downloaded  (plexus-root-1.0.3.pom)
     [java] Downloading: http://repository.sonatype.org:8081/content/groups/sonatype-grid/plexus/plexus-utils/1.0.2/plexus-utils-1.0.2.pom
     [java] 740b downloaded  (plexus-utils-1.0.2.pom)
     [java] Downloading: http://repository.sonatype.org:8081/content/groups/sonatype-grid/org/apache/maven/maven-plugin-descriptor/2.0.9/maven-plugin-descriptor-2.0.9.pom
     [java] 2K downloaded  (maven-plugin-descriptor-2.0.9.pom)
     [java] Downloading: http://repository.sonatype.org:8081/content/groups/sonatype-grid/org/apache/maven/maven-monitor/2.0.9/maven-monitor-2.0.9.pom
     [java] 1K downloaded  (maven-monitor-2.0.9.pom)
     [java] Downloading: http://repository.sonatype.org:8081/content/groups/sonatype-grid/org/apache/maven/wagon/wagon-ssh/1.0-beta-2/wagon-ssh-1.0-beta-2.pom
     [java] 1K downloaded  (wagon-ssh-1.0-beta-2.pom)
     [java] Downloading: http://repository.sonatype.org:8081/content/groups/sonatype-grid/com/jcraft/jsch/0.1.27/jsch-0.1.27.pom
     [java] 965b downloaded  (jsch-0.1.27.pom)
     [java] Downloading: http://repository.sonatype.org:8081/content/groups/sonatype-grid/commons-lang/commons-lang/2.3/commons-lang-2.3.pom
     [java] 10K downloaded  (commons-lang-2.3.pom)
     [java] Downloading: http://repository.sonatype.org:8081/content/groups/sonatype-grid/org/apache/maven/enforcer/enforcer-api/1.0-alpha-4/enforcer-api-1.0-alpha-4.pom
     [java] 3K downloaded  (enforcer-api-1.0-alpha-4.pom)
     [java] Downloading: http://repository.sonatype.org:8081/content/groups/sonatype-grid/org/codehaus/plexus/plexus-container-default/1.0-alpha-9/plexus-container-default-1.0-alpha-9.pom
     [java] 1K downloaded  (plexus-container-default-1.0-alpha-9.pom)
     [java] Downloading: http://repository.sonatype.org:8081/content/groups/sonatype-grid/org/apache/maven/enforcer/enforcer-rules/1.0-alpha-4/enforcer-rules-1.0-alpha-4.pom
     [java] 3K downloaded  (enforcer-rules-1.0-alpha-4.pom)
     [java] Downloading: http://repository.sonatype.org:8081/content/groups/sonatype-grid/org/beanshell/bsh/2.0b4/bsh-2.0b4.pom
     [java] 1K downloaded  (bsh-2.0b4.pom)
     [java] Downloading: http://repository.sonatype.org:8081/content/groups/sonatype-grid/org/beanshell/beanshell/2.0b4/beanshell-2.0b4.pom
     [java] 1K downloaded  (beanshell-2.0b4.pom)
     [java] Downloading: http://repository.sonatype.org:8081/content/groups/sonatype-grid/org/beanshell/bsh/2.0b4/bsh-2.0b4.jar
     [java] Downloading: http://repository.sonatype.org:8081/content/groups/sonatype-grid/commons-lang/commons-lang/2.3/commons-lang-2.3.jar
     [java] Downloading: http://repository.sonatype.org:8081/content/groups/sonatype-grid/org/codehaus/plexus/plexus-utils/1.5.1/plexus-utils-1.5.1.jar
     [java] Downloading: http://repository.sonatype.org:8081/content/groups/sonatype-grid/org/apache/maven/enforcer/enforcer-api/1.0-alpha-4/enforcer-api-1.0-alpha-4.jar
     [java] 9K downloaded  (enforcer-api-1.0-alpha-4.jar)
     [java] Downloading: http://repository.sonatype.org:8081/content/groups/sonatype-grid/org/apache/maven/enforcer/enforcer-rules/1.0-alpha-4/enforcer-rules-1.0-alpha-4.jar
     [java] 275K downloaded  (bsh-2.0b4.jar)
     [java] 205K downloaded  (plexus-utils-1.5.1.jar)
     [java] 51K downloaded  (enforcer-rules-1.0-alpha-4.jar)
     [java] 239K downloaded  (commons-lang-2.3.jar)
     [java] Downloading: http://repository.sonatype.org:8081/content/groups/sonatype-grid/org/apache/maven/maven-artifact/2.0.9/maven-artifact-2.0.9.jar
     [java] 86K downloaded  (maven-artifact-2.0.9.jar)
     [java] Downloading: http://repository.sonatype.org:8081/content/groups/sonatype-grid/org/apache/maven/maven-plugin-api/2.0.9/maven-plugin-api-2.0.9.jar
     [java] 12K downloaded  (maven-plugin-api-2.0.9.jar)
     [java] Downloading: http://repository.sonatype.org:8081/content/groups/sonatype-grid/org/apache/maven/maven-project/2.0.9/maven-project-2.0.9.jar
     [java] 118K downloaded  (maven-project-2.0.9.jar)
     [java] Downloading: http://repository.sonatype.org:8081/content/groups/sonatype-grid/org/apache/maven/maven-core/2.0.9/maven-core-2.0.9.jar
     [java] 155K downloaded  (maven-core-2.0.9.jar)
     [java] [INFO] [enforcer:enforce {execution: enforce-jdk}]
     [java] [WARNING] Rule 0: org.apache.maven.plugins.enforcer.RequireJavaVersion failed
with message:
     [java] Detected JDK Version: 1.4.2-16 is not in the allowed range [1.5.0,].
     [java] [INFO] ------------------------------------------------------------------------
     [java] [ERROR] BUILD ERROR
     [java] [INFO] ------------------------------------------------------------------------
     [java] [INFO] Some Enforcer rules have failed. Look above for specific messages explaining
why the rule failed.
     [java] [INFO] ------------------------------------------------------------------------
     [java] [INFO] Trace
     [java] org.apache.maven.lifecycle.LifecycleExecutionException: Some Enforcer rules have
failed. Look above for specific messages explaining why the rule failed.
     [java] 	at org.apache.maven.lifecycle.DefaultLifecycleExecutor.executeGoals(DefaultLifecycleExecutor.java:703)
     [java] 	at org.apache.maven.lifecycle.DefaultLifecycleExecutor.executeGoalWithLifecycle(DefaultLifecycleExecutor.java:540)
     [java] 	at org.apache.maven.lifecycle.DefaultLifecycleExecutor.executeGoal(DefaultLifecycleExecutor.java:519)
     [java] 	at org.apache.maven.lifecycle.DefaultLifecycleExecutor.executeGoalAndHandleFailures(DefaultLifecycleExecutor.java:371)
     [java] 	at org.apache.maven.lifecycle.DefaultLifecycleExecutor.executeTaskSegments(DefaultLifecycleExecutor.java:332)
     [java] 	at org.apache.maven.lifecycle.DefaultLifecycleExecutor.execute(DefaultLifecycleExecutor.java:181)
     [java] 	at org.apache.maven.DefaultMaven.doExecute(DefaultMaven.java:356)
     [java] 	at org.apache.maven.DefaultMaven.execute(DefaultMaven.java:137)
     [java] 	at org.apache.maven.cli.MavenCli.main(MavenCli.java:356)
     [java] 	at org.apache.maven.cli.MavenCli.main(MavenCli.java:97)
     [java] Caused by: org.apache.maven.plugin.MojoExecutionException: Some Enforcer rules
have failed. Look above for specific messages explaining why the rule failed.
     [java] 	at org.apache.maven.plugins.enforcer.EnforceMojo.execute(EnforceMojo.java:217)
     [java] 	at org.apache.maven.plugin.DefaultPluginManager.executeMojo(DefaultPluginManager.java:483)
     [java] 	at org.apache.maven.lifecycle.DefaultLifecycleExecutor.executeGoals(DefaultLifecycleExecutor.java:678)
     [java] 	... 9 more
     [java] [INFO] ------------------------------------------------------------------------
     [java] [INFO] Total time: 6 seconds
     [java] [INFO] Finished at: Tue Apr 21 11:23:55 GMT-06:00 2009
     [java] [INFO] Final Memory: 11M/20M
     [java] [INFO] ------------------------------------------------------------------------

BUILD FAILED
/home/hudson/workspace/Maven-2.1.x-bootstrap/jdk/1.4/label/ubuntu/maven-2.1.x/build.xml:187:
Java returned: 1

Total time: 29 seconds


Mime
View raw message