maven-notifications mailing list archives

Site index · List index
Message view « Date » · « Thread »
Top « Date » · « Thread »
From Hudson <Hud...@sonatype.org>
Subject Build failed in Hudson: Maven-2.2.x-bootstrap » 1.5,osx #7
Date Fri, 29 May 2009 02:10:18 GMT
See http://grid.sonatype.org/ci/job/Maven-2.2.x-bootstrap/./jdk=1.5,label=osx/7/changes

Changes:

[Benjamin Bentmann] [MNG-4179] [regression] Artifact download hangs upon transfer failure

------------------------------------------
[...truncated 3985 lines...]
     [exec] mng3271DefaultReportsSuppression(itMNG3271).................OK (22.8 s)
     [exec] mng3221InfiniteForking(itMNG3221a)..........................OK (186.1 s)
     [exec] mng3221InfiniteForking(itMNG3221b)..........................OK (125.2 s)
     [exec] mng3268MultipleDashPCommandLine(MultipleProfileParams)......OK (44.5 s)
     [exec] mng3259DepsDroppedInMultiModuleBuild(itMNG3259).............OK (161.1 s)
     [exec] mng3220ImportScope(itMNG3220a)..............................OK (13.3 s)
     [exec] mng3220ImportScope(itMNG3220b)..............................OK (14.6 s)
     [exec] mng3217InterPluginDependency(itMNG3217).....................OK (20.0 s)
     [exec] mng3139UseCachedMetadataOfBlacklistedRepo(itMNG3139)........OK (41.1 s)
     [exec] mng3118TestClassPathOrder(it)...............................OK (22.7 s)
     [exec] mng3106ProfileMultipleActivators(ProfilesWithMultipleActivators)..OK (21.5 s)
     [exec] mng3099SettingsProfilesWithNoPom(itMNG3099).................OK (98.6 s)
     [exec] mng3057VersionExprTransformations(itMNG3057)................OK (28.4 s)
     [exec] mng3052DepRepoAggregation(itMNG3052)........................OK (23.5 s)
     [exec] mng3023ReactorDependencyResolution(itMNG3023A)..............OK (23.6 s)
     [exec] mng3023ReactorDependencyResolution(itMNG3023B)..............OK (23.6 s)
     [exec] mng3023ReactorDependencyResolution(itMNG3023C)..............OK (53.7 s)
     [exec] mng3012CoreClassImport(itMNG3012)...........................OK (22.4 s)
     [exec] mng2972OverridePluginDependency(itLifecycleInvocation)......OK (16.2 s)
     [exec] mng2972OverridePluginDependency(itCommandLineInvocation)....OK (17.6 s)
     [exec] mng2926PluginPrefixOrder(itMNG2926).........................OK (36.7 s)
     [exec] mng2921ActiveAttachedArtifacts(itMNG2921)...................OK (27.5 s)
     [exec] mng2892HideCorePlexusUtils(itMNG2892).......................OK (22.4 s)
     [exec] mng2883LegacyRepoOffline(ParentUnresolvable)................OK (42.3 s)
     [exec] mng2883LegacyRepoOffline(DependencyUnresolvable)............OK (52.7 s)
     [exec] mng2883LegacyRepoOffline(PluginUnresolvable)................OK (50.5 s)
     [exec] mng2878DefaultReportXmlImport(itMNG2878)....................OK (23.9 s)
     [exec] mng2871PrePackageSubartifactResolution(itMNG2871)...........SKIPPED - version
2.2.1-SNAPSHOT not in range [3.0-alpha-1,)
     [exec] mng2865MirrorWildcard(itFileRepo)...........................OK (16.7 s)
     [exec] mng2865MirrorWildcard(itLocalhostRepo)......................OK (19.5 s)
     [exec] mng2865MirrorWildcard(itExternalRepo).......................OK (21.9 s)
     [exec] mng2865MirrorWildcard(itCentralRepo)........................OK (22.4 s)
     [exec] mng2861RelocationsAndRanges(itMNG2861)......................OK (29.6 s)
     [exec] mng2843PluginConfigPropertiesInjection(itMNG2843)...........OK (24.1 s)
     [exec] mng2831CustomArtifactHandlerAndCustomLifecycle(itMNG2831)...OK (27.1 s)
     [exec] mng2820PomComments(it)......................................OK (26.9 s)
     [exec] mng2790LastUpdatedMetadata(itMNG2790).......................OK (46.9 s)
     [exec] mng2749ExtensionAvailableToPlugin(itMNG2749)................OK (19.8 s)
     [exec] mng2744checksumVerification(itMNG2744)......................OK (17.4 s)
     [exec] mng2739RequiredRepositoryElements(itMNG2739_RepositoryId)...OK (12.0 s)
     [exec] mng2739RequiredRepositoryElements(itMNG2739_RepositoryUrl)..OK (13.0 s)
     [exec] mng2720SiblingClasspathArtifacts(IT)........................OK (26.5 s)
     [exec] mng2695OfflinePluginSnapshots(itMNG2695)....................OK (38.2 s)
     [exec] mng2690MojoLoadingErrors(NoClassDefFromMojoLoad)............OK (19.2 s)
     [exec] mng2690MojoLoadingErrors(NoClassDefFromMojoConfiguration)...OK (27.9 s)
     [exec] mng2690MojoLoadingErrors(MojoComponentLookupException)......OK (19.5 s)
     [exec] mng2690MojoLoadingErrors(MojoRequirementComponentLookupException)..OK (20.8 s)
     [exec] mng2668UsePluginDependenciesForSorting(itMNG2668)...........OK (22.7 s)
     [exec] mng2605BogusProfileActivation(itMNG2605)....................OK (18.5 s)
     [exec] mng2591MergeInheritedPluginConfig(itNoProfile)..............OK (21.2 s)
     [exec] mng2591MergeInheritedPluginConfig(itWithProfile)............OK (22.5 s)
     [exec] mng2562Timestamp(itMNG2562).................................OK (21.8 s)
     [exec] mng2539PluginDependenciesComeFromPluginRepos(itMNG2539).....OK (19.8 s)
     [exec] mng2432PluginPrefixOrder(itMNG2432).........................OK (17.4 s)
     [exec] mng2387InactiveProxy(it)....................................OK (19.9 s)
     [exec] mng2362DeployedPomEncoding(it)..............................OK (28.4 s)
     [exec] mng2339BadProjectInterpolation(itMNG2339a)..................OK (24.4 s)
     [exec] mng2339BadProjectInterpolation(itMNG2339b)..................OK (46.9 s)
     [exec] mng2318LocalParentResolution(itMNG2318).....................OK (14.7 s)
     [exec] mng2309ProfileInjectionOrder(itMNG2309).....................OK (20.1 s)
     [exec] mng2293CustomPluginParamImpl(itMNG2293).....................OK (25.3 s)
     [exec] mng2277AggregatorAndResolutionPlugins(itMNG2277)............OK (23.8 s)
     [exec] mng2254PomEncoding(itMNG2254)...............................OK (23.8 s)
     [exec] mng2234ActiveProfilesFromSettings(itMNG2234)................OK (22.5 s)
     [exec] mng2228ComponentInjection(itMNG2228)........................OK (22.8 s)
     [exec] mng2201PluginConfigInterpolation(itMNG2201).................OK (25.2 s)
     [exec] mng2196ParentResolution(itMNG2196)..........................OK (15.3 s)
     [exec] mng2174PluginDepsManagedByParentProfile(itMNG2174)..........OK (23.5 s)
     [exec] mng2136ActiveByDefaultProfile(itMNG2136)....................OK (19.0 s)
     [exec] mng2130ParentLookupFromReactorCache(itMNG2130)..............OK (15.7 s)
     [exec] mng2124PomInterpolationWithParentValues(itMNG2124)..........OK (25.0 s)
     [exec] mng2123VersionRangeDependency(itMNG2123)....................OK (25.7 s)
     [exec] mng2068ReactorRelativeParents(itInheritedIdFields)..........OK (17.4 s)
     [exec] mng2068ReactorRelativeParents(itExplicitIdFields)...........OK (17.1 s)
     [exec] mng2068ReactorRelativeParents(itComplex)....................OK (17.2 s)
     [exec] mng2054PluginExecutionInheritance(itMNG2054)................OK (22.5 s)
     [exec] mng2052InterpolateWithSettingsProfileProperties(itMNG2052)..OK (19.8 s)
     [exec] mng2045testJarDependenciesBrokenInReactor(itMNG2045)........OK (29.0 s)
     [exec] mng2006ChildPathAwareUrlInheritance(itMNG2006)..............OK (18.9 s)
     [exec] mng1999DefaultReportsInheritance(itInheritSuppression)......OK (22.3 s)
     [exec] mng1999DefaultReportsInheritance(itOverrideSuppression).....OK (81.0 s)
     [exec] mng1995InterpolateBooleanModelElements(itMNG1995)...........SKIPPED - version
2.2.1-SNAPSHOT not in range [3.0-alpha-1,)
     [exec] mng1992SystemPropOverridesPomProp(itMNG1992)................OK (20.2 s)
     [exec] mng1957JdkActivationWithVersionRange(itMNG1957).............OK (18.9 s)
     [exec] mng1908LegacySnapshotUpdate(itMNG1908)......................OK (19.2 s)
     [exec] mng1830ShowVersion(Version).................................OK (13.4 s)
     [exec] mng1703PluginMgmtDepInheritance(itMNG1703)..................OK (20.3 s)
     [exec] mng1493NonStandardModulePomNames(itMNG1493).................OK (14.8 s)
     [exec] mng1491ReactorArtifactIdCollision(itMNG1491)................OK (14.1 s)
     [exec] mng1415QuotedSystemProperties(itMNG1415)....................OK (19.9 s)
     [exec] mng1412DependenciesOrder(itMNG1412).........................OK (19.1 s)
     [exec] mng1349ChecksumFormats(itMNG1349)...........................OK (21.2 s)
     [exec] mng1323AntrunDependencies(itMNG1323)........................SKIPPED - version
2.2.1-SNAPSHOT not in range [3.0-alpha-1,)
     [exec] mng1233WarDepWithProvidedScope(itMNG1233)...................OK (20.3 s)
     [exec] mng1088ReactorPluginResolution(itMNG1088)...................OK (17.9 s)
     [exec] mng1052PluginMngtConfig(itMNG1052)..........................OK (22.9 s)
     [exec] mng1021EqualAttachmentBuildNumber(itMNG1021)................OK (26.0 s)
     [exec] mng0985NonExecutedPluginMngtGoals(itMNG0985)................OK (11.8 s)
     [exec] mng0956ComponentInjectionViaProjectLevelPluginDep(itMNG0956)..OK (18.7 s)
     [exec] mng0947OptionalDependency(it)...............................OK (20.2 s)
     [exec] mng0870ReactorAwarePluginDiscovery(itMNG0870)...............OK (20.2 s)
     [exec] mng0866EvaluateDefaultValue(itMNG866).......................OK (20.2 s)
     [exec] mng0848SystemPropOverridesDefaultValue(itMNG848)............OK (21.5 s)
     [exec] mng0836PluginParentResolution(itMNG836).....................OK (20.8 s)
     [exec] mng0823MojoContextPassing(itMNG0823)........................OK (20.9 s)
     [exec] mng0820ConflictResolution(itMNG0820)........................OK (18.3 s)
     [exec] mng0818WarDepsNotTransitive(itMNG0818)......................OK (19.8 s)
     [exec] mng0814ExplicitProfileActivation(itMNG814)..................OK (20.1 s)
     [exec] mng0786ProfileAwareReactor(itMNG0786).......................OK (23.0 s)
     [exec] mng0781PluginConfigVsExecConfig(itMNG0781)..................OK (20.0 s)
     [exec] mng0773SettingsProfileReactorPollution(itMNG773)............OK (12.8 s)
     [exec] mng0768OfflineMode(itMNG768)................................OK (53.7 s)
     [exec] mng0761MissingSnapshotDistRepo(itMNG761)....................OK (24.4 s)
     [exec] mng0731LegacyRepoLayout(itMNG731)...........................OK (28.7 s)
     [exec] mng0680ParentBasedir(itMNG680)..............................OK (24.5 s)
     [exec] mng0674PluginParameterAlias(itMNG674).......................OK (27.3 s)
     [exec] mng0666IgnoreLegacyPom(itMNG666)............................OK (20.9 s)
     [exec] mng0557UserSettingsCliOption(itMNG557)......................OK (20.1 s)
     [exec] mng0553SettingsAuthzEncryption(itBasic).....................OK (26.6 s)
     [exec] mng0553SettingsAuthzEncryption(itRelocation)................OK (24.0 s)
     [exec] mng0522PluginMgmtConfig(itMNG522)...........................OK (28.5 s)
     [exec] mng0507ArtifactRelocation(itMNG507).........................OK (25.7 s)
     [exec] mng0505VersionRange(itMNG505)...............................OK (21.6 s)
     [exec] mng0496IgnoreUnknownPluginParameters(itMNG496)..............OK (23.9 s)
     [exec] mng0479OverrideCentralRepo(itMNG479)........................OK (41.6 s)
     [exec] mng0471CustomLifecycle(itMNG471)............................OK (27.8 s)
     [exec] mng0469ReportConfig(itReportConfigOverridesBuildDefaults)...OK (23.7 s)
     [exec] mng0469ReportConfig(itBuildConfigDominantDuringBuild).......OK (24.8 s)
     [exec] mng0469ReportConfig(itBuildConfigIrrelevantForReports)......OK (27.8 s)
     [exec] mng0449PluginVersionResolution(itLifecycleInvocation).......OK (21.5 s)
     [exec] mng0449PluginVersionResolution(itCliInvocation).............OK (20.6 s)
     [exec] mng0377PluginLookupFromPrefix(itMNG377).....................OK (20.8 s)
     [exec] mng0294MergeGlobalAndUserSettings(itMNG294).................OK (21.0 s)
     [exec] mng0282NonReactorExecWhenProjectIndependent(itMNG282).......OK (24.4 s)
     [exec] mng0249ResolveDepsFromReactor(itMNG0249)....................OK (28.6 s)
     [exec] mng0095ReactorFailureBehavior(itFailFast)...................OK (25.7 s)
     [exec] mng0095ReactorFailureBehavior(itFailNever)..................OK (26.6 s)
     [exec] mng0095ReactorFailureBehavior(itFailAtEnd)..................OK (28.1 s)
     [exec] 0144LifecycleExecutionOrder(it0144).........................OK (54.4 s)
     [exec] 0143TransitiveDependencyScopes(itCompileScope)..............OK (24.1 s)
     [exec] 0143TransitiveDependencyScopes(itProvidedScope).............OK (22.8 s)
     [exec] 0143TransitiveDependencyScopes(itRuntimeScope)..............OK (23.0 s)
     [exec] 0143TransitiveDependencyScopes(itTestScope).................OK (21.9 s)
     [exec] 0142DirectDependencyScopes(it0142)..........................OK (21.6 s)
     [exec] 0140(it0140)................................................OK (23.3 s)
     [exec] 0139(it0139)................................................OK (24.5 s)
     [exec] 0138PluginLifecycle(it0138).................................OK (38.9 s)
     [exec] 0137EarLifecycle(it0137)....................................OK (37.6 s)
     [exec] 0136RarLifecycle(it0136)....................................OK (36.8 s)
     [exec] 0135EjbLifecycle(it0135)....................................OK (34.2 s)
     [exec] 0134WarLifecycle(it0134)....................................OK (34.1 s)
     [exec] 0133JarLifecycle(it0133)....................................OK (45.1 s)
     [exec] 0132PomLifecycle(it0132)....................................OK (29.1 s)
     [exec] 0131SiteLifecycle(it0131)...................................OK (25.6 s)
     [exec] 0130CleanLifecycle(it0130)..................................OK (26.0 s)
     [exec] 0113ServerAuthzAvailableToWagonMgrInPlugin(it0113)..........OK (21.4 s)
     [exec] 0090(it0090)................................................OK (25.3 s)
     [exec] 0087(it0087)................................................OK (22.8 s)
     [exec] 0086(it0086)................................................OK (27.8 s)
     [exec] 0085(it0085)................................................OK (21.3 s)
     [exec] 0072(it0072)................................................OK (26.6 s)
     [exec] 0071(it0071)................................................OK (26.3 s)
     [exec] 0064(it0064)................................................OK (22.8 s)
     [exec] 0063(it0063)................................................OK (25.2 s)
     [exec] 0056(it0056)................................................OK (25.8 s)
     [exec] 0052(it0052)................................................OK (34.1 s)
     [exec] 0051(it0051)................................................OK (36.8 s)
     [exec] 0041(it0041)................................................OK (30.0 s)
     [exec] 0040(it0040)................................................OK (24.2 s)
     [exec] 0039(it0039)................................................OK (27.4 s)
     [exec] 0038(it0038)................................................OK (24.7 s)
     [exec] 0037(it0037)................................................OK (23.5 s)
     [exec] 0036(it0036)................................................OK (23.7 s)
     [exec] 0032(it0032)................................................OK (15.8 s)
     [exec] 0030(it0030)................................................OK (83.6 s)
     [exec] 0025(it0025)................................................OK (27.0 s)
     [exec] 0024(it0024)................................................OK (24.3 s)
     [exec] 0023(it0023)................................................OK (24.8 s)
     [exec] 0021(it0021)................................................OK (21.5 s)
     [exec] 0019(it0019)................................................OK (30.4 s)
     [exec] 0018(it0018)................................................OK (57.6 s)
     [exec] 0012(it0012)................................................OK (31.5 s)
     [exec] 0011(it0011)................................................OK (22.0 s)
     [exec] 0010(it0010)................................................OK (21.8 s)
     [exec] 0009(it0009)................................................OK (25.9 s)
     [exec] 0008(it0008)................................................OK (26.8 s)
     [exec] Tests run: 375, Failures: 1, Errors: 0, Skipped: 0, Time elapsed: 13,921.786 sec
<<< FAILURE!
     [exec] testIt(org.apache.maven.it.MavenITmng4167PluginAndCoordXFormPOMTest)  Time elapsed:
62.977 sec  <<< FAILURE!
     [exec] junit.framework.AssertionFailedError
     [exec] 	at junit.framework.Assert.fail(Assert.java:47)
     [exec] 	at junit.framework.Assert.assertTrue(Assert.java:20)
     [exec] 	at junit.framework.Assert.assertFalse(Assert.java:34)
     [exec] 	at junit.framework.Assert.assertFalse(Assert.java:41)
     [exec] 	at org.apache.maven.it.MavenITmng4167PluginAndCoordXFormPOMTest.testIt(MavenITmng4167PluginAndCoordXFormPOMTest.java:70)
     [exec] 
     [exec] 
     [exec] Results :
     [exec] 
     [exec] Failed tests: 
     [exec]   testIt(org.apache.maven.it.MavenITmng4167PluginAndCoordXFormPOMTest)
     [exec] 
     [exec] Tests run: 375, Failures: 1, Errors: 0, Skipped: 0
     [exec] 
     [exec] [INFO] ------------------------------------------------------------------------
     [exec] [ERROR] BUILD FAILURE
     [exec] [INFO] ------------------------------------------------------------------------
     [exec] [INFO] There are test failures.
     [exec] 
     [exec] Please refer to /private/tmp/maven-integration-tests-2.2.x/core-it-suite/target/surefire-reports
for the individual test results.
     [exec] [INFO] ------------------------------------------------------------------------
     [exec] [INFO] Trace
     [exec] org.apache.maven.BuildFailureException: There are test failures.
     [exec] 
     [exec] Please refer to /private/tmp/maven-integration-tests-2.2.x/core-it-suite/target/surefire-reports
for the individual test results.
     [exec] 	at org.apache.maven.lifecycle.DefaultLifecycleExecutor.executeGoals(DefaultLifecycleExecutor.java:699)
     [exec] 	at org.apache.maven.lifecycle.DefaultLifecycleExecutor.executeGoalWithLifecycle(DefaultLifecycleExecutor.java:540)
     [exec] 	at org.apache.maven.lifecycle.DefaultLifecycleExecutor.executeGoal(DefaultLifecycleExecutor.java:519)
     [exec] 	at org.apache.maven.lifecycle.DefaultLifecycleExecutor.executeGoalAndHandleFailures(DefaultLifecycleExecutor.java:371)
     [exec] 	at org.apache.maven.lifecycle.DefaultLifecycleExecutor.executeTaskSegments(DefaultLifecycleExecutor.java:332)
     [exec] 	at org.apache.maven.lifecycle.DefaultLifecycleExecutor.execute(DefaultLifecycleExecutor.java:181)
     [exec] 	at org.apache.maven.DefaultMaven.doExecute(DefaultMaven.java:356)
     [exec] 	at org.apache.maven.DefaultMaven.execute(DefaultMaven.java:137)
     [exec] 	at org.apache.maven.cli.MavenCli.main(MavenCli.java:356)
     [exec] 	at sun.reflect.NativeMethodAccessorImpl.invoke0(Native Method)
     [exec] 	at sun.reflect.NativeMethodAccessorImpl.invoke(NativeMethodAccessorImpl.java:39)
     [exec] 	at sun.reflect.DelegatingMethodAccessorImpl.invoke(DelegatingMethodAccessorImpl.java:25)
     [exec] 	at java.lang.reflect.Method.invoke(Method.java:585)
     [exec] 	at org.codehaus.classworlds.Launcher.launchEnhanced(Launcher.java:315)
     [exec] 	at org.codehaus.classworlds.Launcher.launch(Launcher.java:255)
     [exec] 	at org.codehaus.classworlds.Launcher.mainWithExitCode(Launcher.java:430)
     [exec] 	at org.codehaus.classworlds.Launcher.main(Launcher.java:375)
     [exec] Caused by: org.apache.maven.plugin.MojoFailureException: There are test failures.
     [exec] 
     [exec] Please refer to /private/tmp/maven-integration-tests-2.2.x/core-it-suite/target/surefire-reports
for the individual test results.
     [exec] 	at org.apache.maven.plugin.surefire.SurefirePlugin.execute(SurefirePlugin.java:575)
     [exec] 	at org.apache.maven.plugin.DefaultPluginManager.executeMojo(DefaultPluginManager.java:483)
     [exec] 	at org.apache.maven.lifecycle.DefaultLifecycleExecutor.executeGoals(DefaultLifecycleExecutor.java:678)
     [exec] 	... 16 more
     [exec] [INFO] ------------------------------------------------------------------------
     [exec] [INFO] Total time: 244 minutes 6 seconds
     [exec] [INFO] Finished at: Thu May 28 21:09:16 CDT 2009
     [exec] [INFO] Final Memory: 32M/81M
     [exec] [INFO] ------------------------------------------------------------------------

BUILD FAILED
http://grid.sonatype.org/ci/job/Maven-2.2.x-bootstrap/./jdk=1.5,label=osx/ws/maven-2.2.x/build.xml
:291: exec returned: 1

Total time: 280 minutes 7 seconds
Archiving artifacts


Mime
View raw message