maven-notifications mailing list archives

Site index · List index
Message view « Date » · « Thread »
Top « Date » · « Thread »
From Hudson <Hud...@sonatype.org>
Subject Build failed in Hudson: maven-shared » 1.5,ubuntu #79
Date Mon, 04 May 2009 10:25:42 GMT
See http://grid.sonatype.org/ci/job/maven-shared/./jdk=1.5,label=ubuntu/79/changes

Changes:

[Herve Boutemy] [MPIR-136] avoid quote handling in a link

------------------------------------------
[...truncated 4018 lines...]
[INFO] ------------------------------------------------------------------------
[INFO] Reactor Summary:
[INFO] ------------------------------------------------------------------------
[INFO] Maven Shared Components ............................... SUCCESS [7.148s]
[INFO] Maven Shared I/O API .................................. SUCCESS [5.008s]
[INFO] Maven File Management API ............................. SUCCESS [5.299s]
[INFO] Maven Ant ............................................. SUCCESS [2.025s]
[INFO] Maven Applications Shared Configuration ............... SUCCESS [1.081s]
[INFO] Maven Shared Application Configuration Model .......... SUCCESS [4.156s]
[INFO] Maven Shared Application Configuration Web Components . SUCCESS [3.373s]
[INFO] Maven Archiver ........................................ SUCCESS [4.935s]
[INFO] Maven Common Artifact Filters ......................... SUCCESS [4.590s]
[INFO] Maven Dependency Analyzer ............................. SUCCESS [20.627s]
[INFO] Maven Dependency Tree ................................. SUCCESS [3.603s]
[INFO] Maven Downloader ...................................... SUCCESS [0.935s]
[INFO] Maven Doxia Integration Tools ......................... SUCCESS [3.944s]
[INFO] Maven Filtering ....................................... SUCCESS [4.522s]
[INFO] Maven Invoker ......................................... SUCCESS [15.235s]
[INFO] Maven Model Converter ................................. SUCCESS [4.215s]
[INFO] Maven OSGi integration ................................ SUCCESS [2.161s]
[INFO] Maven Reporting Implementation ........................ SUCCESS [39.903s]
[INFO] Maven Repository Builder .............................. SUCCESS [2.669s]
[INFO] Maven Runtime ......................................... SUCCESS [25.818s]
[INFO] Maven Script Support Root ............................. SUCCESS [0.169s]
[INFO] Maven Ant Mojo Support ................................ FAILED [6.251s]
[INFO] Maven Beanshell Mojo Support .......................... FAILED [1.142s]
[INFO] Maven JAR Utilities ................................... SUCCESS [6.098s]
[INFO] Maven Shared Monitor API .............................. SUCCESS [0.913s]
[INFO] Maven Verifier Component .............................. SUCCESS [2.105s]
[INFO] Maven Shared Web UI tests ............................. SUCCESS [1.205s]
[INFO] ------------------------------------------------------------------------
[INFO] Error for project: Maven Ant Mojo Support (during deploy)
[INFO] ------------------------------------------------------------------------
[INFO] Failed to resolve artifact.

GroupId: org.apache.maven
ArtifactId: maven-parent
Version: 9-SNAPSHOT

Reason: Unable to download the artifact from any repository

  org.apache.maven:maven-parent:pom:9-SNAPSHOT

from the specified remote repositories:
  Nexus (http://repository.sonatype.org:8081/content/groups/sonatype-grid)



[INFO] ------------------------------------------------------------------------
[INFO] Trace
org.apache.maven.lifecycle.LifecycleExecutionException: Unable to get dependency information:
Unable to read the metadata file for artifact 'org.apache.maven:maven-project:jar': Cannot
find parent: org.apache.maven:maven-parent for project: null:maven:pom:2.1-SNAPSHOT for project
null:maven:pom:2.1-SNAPSHOT
  org.apache.maven:maven-project:jar:2.1-SNAPSHOT

from the specified remote repositories:
  central (http://Nexus),
  apache.snapshots (http://repository.apache.org/snapshots)

Path to dependency: 
	1) org.apache.maven:maven-script-ant:jar:2.1-SNAPSHOT


	at org.apache.maven.lifecycle.DefaultLifecycleExecutor.executeGoals(DefaultLifecycleExecutor.java:693)
	at org.apache.maven.lifecycle.DefaultLifecycleExecutor.executeGoalWithLifecycle(DefaultLifecycleExecutor.java:538)
	at org.apache.maven.lifecycle.DefaultLifecycleExecutor.executeGoal(DefaultLifecycleExecutor.java:517)
	at org.apache.maven.lifecycle.DefaultLifecycleExecutor.executeGoalAndHandleFailures(DefaultLifecycleExecutor.java:369)
	at org.apache.maven.lifecycle.DefaultLifecycleExecutor.executeTaskSegments(DefaultLifecycleExecutor.java:330)
	at org.apache.maven.lifecycle.DefaultLifecycleExecutor.execute(DefaultLifecycleExecutor.java:181)
	at org.apache.maven.DefaultMaven.doExecute(DefaultMaven.java:336)
	at org.apache.maven.DefaultMaven.execute(DefaultMaven.java:129)
	at org.apache.maven.cli.MavenCli.main(MavenCli.java:302)
	at sun.reflect.NativeMethodAccessorImpl.invoke0(Native Method)
	at sun.reflect.NativeMethodAccessorImpl.invoke(NativeMethodAccessorImpl.java:39)
	at sun.reflect.DelegatingMethodAccessorImpl.invoke(DelegatingMethodAccessorImpl.java:25)
	at java.lang.reflect.Method.invoke(Method.java:585)
	at org.codehaus.classworlds.Launcher.launchEnhanced(Launcher.java:315)
	at org.codehaus.classworlds.Launcher.launch(Launcher.java:255)
	at org.codehaus.classworlds.Launcher.mainWithExitCode(Launcher.java:430)
	at org.codehaus.classworlds.Launcher.main(Launcher.java:375)
Caused by: org.apache.maven.artifact.resolver.ArtifactResolutionException: Unable to get dependency
information: Unable to read the metadata file for artifact 'org.apache.maven:maven-project:jar':
Cannot find parent: org.apache.maven:maven-parent for project: null:maven:pom:2.1-SNAPSHOT
for project null:maven:pom:2.1-SNAPSHOT
  org.apache.maven:maven-project:jar:2.1-SNAPSHOT

from the specified remote repositories:
  central (http://Nexus),
  apache.snapshots (http://repository.apache.org/snapshots)

Path to dependency: 
	1) org.apache.maven:maven-script-ant:jar:2.1-SNAPSHOT


	at org.apache.maven.artifact.resolver.DefaultArtifactCollector.recurse(DefaultArtifactCollector.java:419)
	at org.apache.maven.artifact.resolver.DefaultArtifactCollector.collect(DefaultArtifactCollector.java:74)
	at org.apache.maven.artifact.resolver.DefaultArtifactResolver.resolveTransitively(DefaultArtifactResolver.java:300)
	at org.apache.maven.artifact.resolver.DefaultArtifactResolver.resolveTransitively(DefaultArtifactResolver.java:288)
	at org.apache.maven.plugin.DefaultPluginManager.resolveTransitiveDependencies(DefaultPluginManager.java:1440)
	at org.apache.maven.plugin.DefaultPluginManager.executeMojo(DefaultPluginManager.java:410)
	at org.apache.maven.lifecycle.DefaultLifecycleExecutor.executeGoals(DefaultLifecycleExecutor.java:676)
	... 16 more
Caused by: org.apache.maven.artifact.metadata.ArtifactMetadataRetrievalException: Unable to
read the metadata file for artifact 'org.apache.maven:maven-project:jar': Cannot find parent:
org.apache.maven:maven-parent for project: null:maven:pom:2.1-SNAPSHOT for project null:maven:pom:2.1-SNAPSHOT
	at org.apache.maven.project.artifact.MavenMetadataSource.retrieveRelocatedProject(MavenMetadataSource.java:200)
	at org.apache.maven.project.artifact.MavenMetadataSource.retrieveRelocatedArtifact(MavenMetadataSource.java:94)
	at org.apache.maven.artifact.resolver.DefaultArtifactCollector.recurse(DefaultArtifactCollector.java:386)
	... 22 more
Caused by: org.apache.maven.project.ProjectBuildingException: Cannot find parent: org.apache.maven:maven-parent
for project: null:maven:pom:2.1-SNAPSHOT for project null:maven:pom:2.1-SNAPSHOT
	at org.apache.maven.project.DefaultMavenProjectBuilder.assembleLineage(DefaultMavenProjectBuilder.java:1398)
	at org.apache.maven.project.DefaultMavenProjectBuilder.assembleLineage(DefaultMavenProjectBuilder.java:1415)
	at org.apache.maven.project.DefaultMavenProjectBuilder.buildInternal(DefaultMavenProjectBuilder.java:824)
	at org.apache.maven.project.DefaultMavenProjectBuilder.buildFromRepository(DefaultMavenProjectBuilder.java:256)
	at org.apache.maven.project.artifact.MavenMetadataSource.retrieveRelocatedProject(MavenMetadataSource.java:163)
	... 24 more
Caused by: org.apache.maven.project.ProjectBuildingException: POM 'org.apache.maven:maven-parent'
not found in repository: Unable to download the artifact from any repository

  org.apache.maven:maven-parent:pom:9-SNAPSHOT

from the specified remote repositories:
  Nexus (http://repository.sonatype.org:8081/content/groups/sonatype-grid)

 for project org.apache.maven:maven-parent
	at org.apache.maven.project.DefaultMavenProjectBuilder.findModelFromRepository(DefaultMavenProjectBuilder.java:606)
	at org.apache.maven.project.DefaultMavenProjectBuilder.assembleLineage(DefaultMavenProjectBuilder.java:1394)
	... 28 more
Caused by: org.apache.maven.artifact.resolver.ArtifactNotFoundException: Unable to download
the artifact from any repository

  org.apache.maven:maven-parent:pom:9-SNAPSHOT

from the specified remote repositories:
  Nexus (http://repository.sonatype.org:8081/content/groups/sonatype-grid)


	at org.apache.maven.artifact.resolver.DefaultArtifactResolver.resolve(DefaultArtifactResolver.java:212)
	at org.apache.maven.artifact.resolver.DefaultArtifactResolver.resolve(DefaultArtifactResolver.java:74)
	at org.apache.maven.project.DefaultMavenProjectBuilder.findModelFromRepository(DefaultMavenProjectBuilder.java:559)
	... 29 more
Caused by: org.apache.maven.wagon.ResourceDoesNotExistException: Unable to download the artifact
from any repository
	at org.apache.maven.artifact.manager.DefaultWagonManager.getArtifact(DefaultWagonManager.java:350)
	at org.apache.maven.artifact.resolver.DefaultArtifactResolver.resolve(DefaultArtifactResolver.java:200)
	... 31 more
[INFO] ------------------------------------------------------------------------
[INFO] Error for project: Maven Beanshell Mojo Support (during deploy)
[INFO] ------------------------------------------------------------------------
[INFO] Failed to resolve artifact.

GroupId: org.apache.maven
ArtifactId: maven-parent
Version: 9-SNAPSHOT

Reason: Unable to download the artifact from any repository

  org.apache.maven:maven-parent:pom:9-SNAPSHOT

from the specified remote repositories:
  Nexus (http://repository.sonatype.org:8081/content/groups/sonatype-grid)



[INFO] ------------------------------------------------------------------------
[INFO] Trace
org.apache.maven.lifecycle.LifecycleExecutionException: Unable to get dependency information:
Unable to read the metadata file for artifact 'org.apache.maven:maven-plugin-api:jar': Cannot
find parent: org.apache.maven:maven-parent for project: null:maven:pom:2.1-SNAPSHOT for project
null:maven:pom:2.1-SNAPSHOT
  org.apache.maven:maven-plugin-api:jar:2.1-SNAPSHOT

from the specified remote repositories:
  central (http://Nexus),
  apache.snapshots (http://repository.apache.org/snapshots)

Path to dependency: 
	1) org.apache.maven:maven-script-beanshell:jar:2.1-SNAPSHOT


	at org.apache.maven.lifecycle.DefaultLifecycleExecutor.executeGoals(DefaultLifecycleExecutor.java:693)
	at org.apache.maven.lifecycle.DefaultLifecycleExecutor.executeGoalWithLifecycle(DefaultLifecycleExecutor.java:538)
	at org.apache.maven.lifecycle.DefaultLifecycleExecutor.executeGoal(DefaultLifecycleExecutor.java:517)
	at org.apache.maven.lifecycle.DefaultLifecycleExecutor.executeGoalAndHandleFailures(DefaultLifecycleExecutor.java:369)
	at org.apache.maven.lifecycle.DefaultLifecycleExecutor.executeTaskSegments(DefaultLifecycleExecutor.java:330)
	at org.apache.maven.lifecycle.DefaultLifecycleExecutor.execute(DefaultLifecycleExecutor.java:181)
	at org.apache.maven.DefaultMaven.doExecute(DefaultMaven.java:336)
	at org.apache.maven.DefaultMaven.execute(DefaultMaven.java:129)
	at org.apache.maven.cli.MavenCli.main(MavenCli.java:302)
	at sun.reflect.NativeMethodAccessorImpl.invoke0(Native Method)
	at sun.reflect.NativeMethodAccessorImpl.invoke(NativeMethodAccessorImpl.java:39)
	at sun.reflect.DelegatingMethodAccessorImpl.invoke(DelegatingMethodAccessorImpl.java:25)
	at java.lang.reflect.Method.invoke(Method.java:585)
	at org.codehaus.classworlds.Launcher.launchEnhanced(Launcher.java:315)
	at org.codehaus.classworlds.Launcher.launch(Launcher.java:255)
	at org.codehaus.classworlds.Launcher.mainWithExitCode(Launcher.java:430)
	at org.codehaus.classworlds.Launcher.main(Launcher.java:375)
Caused by: org.apache.maven.artifact.resolver.ArtifactResolutionException: Unable to get dependency
information: Unable to read the metadata file for artifact 'org.apache.maven:maven-plugin-api:jar':
Cannot find parent: org.apache.maven:maven-parent for project: null:maven:pom:2.1-SNAPSHOT
for project null:maven:pom:2.1-SNAPSHOT
  org.apache.maven:maven-plugin-api:jar:2.1-SNAPSHOT

from the specified remote repositories:
  central (http://Nexus),
  apache.snapshots (http://repository.apache.org/snapshots)

Path to dependency: 
	1) org.apache.maven:maven-script-beanshell:jar:2.1-SNAPSHOT


	at org.apache.maven.artifact.resolver.DefaultArtifactCollector.recurse(DefaultArtifactCollector.java:419)
	at org.apache.maven.artifact.resolver.DefaultArtifactCollector.collect(DefaultArtifactCollector.java:74)
	at org.apache.maven.artifact.resolver.DefaultArtifactResolver.resolveTransitively(DefaultArtifactResolver.java:300)
	at org.apache.maven.artifact.resolver.DefaultArtifactResolver.resolveTransitively(DefaultArtifactResolver.java:288)
	at org.apache.maven.plugin.DefaultPluginManager.resolveTransitiveDependencies(DefaultPluginManager.java:1440)
	at org.apache.maven.plugin.DefaultPluginManager.executeMojo(DefaultPluginManager.java:410)
	at org.apache.maven.lifecycle.DefaultLifecycleExecutor.executeGoals(DefaultLifecycleExecutor.java:676)
	... 16 more
Caused by: org.apache.maven.artifact.metadata.ArtifactMetadataRetrievalException: Unable to
read the metadata file for artifact 'org.apache.maven:maven-plugin-api:jar': Cannot find parent:
org.apache.maven:maven-parent for project: null:maven:pom:2.1-SNAPSHOT for project null:maven:pom:2.1-SNAPSHOT
	at org.apache.maven.project.artifact.MavenMetadataSource.retrieveRelocatedProject(MavenMetadataSource.java:200)
	at org.apache.maven.project.artifact.MavenMetadataSource.retrieveRelocatedArtifact(MavenMetadataSource.java:94)
	at org.apache.maven.artifact.resolver.DefaultArtifactCollector.recurse(DefaultArtifactCollector.java:386)
	... 22 more
Caused by: org.apache.maven.project.ProjectBuildingException: Cannot find parent: org.apache.maven:maven-parent
for project: null:maven:pom:2.1-SNAPSHOT for project null:maven:pom:2.1-SNAPSHOT
	at org.apache.maven.project.DefaultMavenProjectBuilder.assembleLineage(DefaultMavenProjectBuilder.java:1398)
	at org.apache.maven.project.DefaultMavenProjectBuilder.assembleLineage(DefaultMavenProjectBuilder.java:1415)
	at org.apache.maven.project.DefaultMavenProjectBuilder.buildInternal(DefaultMavenProjectBuilder.java:824)
	at org.apache.maven.project.DefaultMavenProjectBuilder.buildFromRepository(DefaultMavenProjectBuilder.java:256)
	at org.apache.maven.project.artifact.MavenMetadataSource.retrieveRelocatedProject(MavenMetadataSource.java:163)
	... 24 more
Caused by: org.apache.maven.project.ProjectBuildingException: POM 'org.apache.maven:maven-parent'
not found in repository: Unable to download the artifact from any repository

  org.apache.maven:maven-parent:pom:9-SNAPSHOT

from the specified remote repositories:
  Nexus (http://repository.sonatype.org:8081/content/groups/sonatype-grid)

 for project org.apache.maven:maven-parent
	at org.apache.maven.project.DefaultMavenProjectBuilder.findModelFromRepository(DefaultMavenProjectBuilder.java:606)
	at org.apache.maven.project.DefaultMavenProjectBuilder.assembleLineage(DefaultMavenProjectBuilder.java:1394)
	... 28 more
Caused by: org.apache.maven.artifact.resolver.ArtifactNotFoundException: Unable to download
the artifact from any repository

  org.apache.maven:maven-parent:pom:9-SNAPSHOT

from the specified remote repositories:
  Nexus (http://repository.sonatype.org:8081/content/groups/sonatype-grid)


	at org.apache.maven.artifact.resolver.DefaultArtifactResolver.resolve(DefaultArtifactResolver.java:212)
	at org.apache.maven.artifact.resolver.DefaultArtifactResolver.resolve(DefaultArtifactResolver.java:74)
	at org.apache.maven.project.DefaultMavenProjectBuilder.findModelFromRepository(DefaultMavenProjectBuilder.java:559)
	... 29 more
Caused by: org.apache.maven.wagon.ResourceDoesNotExistException: Unable to download the artifact
from any repository
	at org.apache.maven.artifact.manager.DefaultWagonManager.getArtifact(DefaultWagonManager.java:350)
	at org.apache.maven.artifact.resolver.DefaultArtifactResolver.resolve(DefaultArtifactResolver.java:200)
	... 31 more
[INFO] ------------------------------------------------------------------------
[INFO] BUILD ERRORS
[INFO] ------------------------------------------------------------------------
[INFO] Total time: 3 minutes 
[INFO] Finished at: Mon May 04 04:25:41 GMT-06:00 2009
[INFO] Final Memory: 59M/97M
[INFO] ------------------------------------------------------------------------


Mime
View raw message