maven-notifications mailing list archives

Site index · List index
Message view « Date » · « Thread »
Top « Date » · « Thread »
From Hudson <Hud...@sonatype.org>
Subject Build failed in Hudson: Maven 2.2.x » 1.5,windows #3
Date Sat, 02 May 2009 05:22:09 GMT
See http://grid.sonatype.org/ci/job/Maven%202.2.x/./jdk=1.5,label=windows/3/changes

Changes:

[John Casey] [maven-release-plugin] prepare for next development iteration

[John Casey] [maven-release-plugin] prepare release maven-2.2.0-RC1

------------------------------------------
[...truncated 758 lines...]
[INFO] [resources:testResources]
[INFO] Using encoding: 'UTF-8' to copy filtered resources.
[INFO] [compiler:testCompile]
[INFO] No sources to compile
[INFO] [surefire:test]
[INFO] Surefire report directory: C:\home\hudson\workspace\Maven 2.2.x\jdk\1.5\label\windows\maven-2.2.x\maven-repository-metadata\target\surefire-reports

-------------------------------------------------------
 T E S T S
-------------------------------------------------------
There are no tests to run.

Results :

Tests run: 0, Failures: 0, Errors: 0, Skipped: 0

[INFO] [jar:jar]
[INFO] Building jar: C:\home\hudson\workspace\Maven 2.2.x\jdk\1.5\label\windows\maven-2.2.x\maven-repository-metadata\target\maven-repository-metadata-2.2.0-RC2-SNAPSHOT.jar
[INFO] [install:install]
[INFO] Installing C:\home\hudson\workspace\Maven 2.2.x\jdk\1.5\label\windows\maven-2.2.x\maven-repository-metadata\target\maven-repository-metadata-2.2.0-RC2-SNAPSHOT.jar
to C:\opt\repos\maven-2.2.x\org\apache\maven\maven-repository-metadata\2.2.0-RC2-SNAPSHOT\maven-repository-metadata-2.2.0-RC2-SNAPSHOT.jar
[INFO] ------------------------------------------------------------------------
[INFO] Building Maven Artifact Manager
[INFO]    task-segment: [clean, install]
[INFO] ------------------------------------------------------------------------
[INFO] [clean:clean]
[INFO] Deleting directory C:\home\hudson\workspace\Maven 2.2.x\jdk\1.5\label\windows\maven-2.2.x\maven-artifact-manager\target
[INFO] Deleting directory C:\home\hudson\workspace\Maven 2.2.x\jdk\1.5\label\windows\maven-2.2.x\maven-artifact-manager\target\classes
[INFO] Deleting directory C:\home\hudson\workspace\Maven 2.2.x\jdk\1.5\label\windows\maven-2.2.x\maven-artifact-manager\target\test-classes
[INFO] Deleting directory C:\home\hudson\workspace\Maven 2.2.x\jdk\1.5\label\windows\maven-2.2.x\maven-artifact-manager\target\site
Downloading: http://repository.sonatype.org:8081/content/groups/sonatype-grid/org/apache/maven/maven-repository-metadata/2.2.0-RC1/maven-repository-metadata-2.2.0-RC1.pom
[INFO] Unable to find resource 'org.apache.maven:maven-repository-metadata:pom:2.2.0-RC1'
in repository central (http://Nexus)
Downloading: http://repository.sonatype.org:8081/content/groups/sonatype-grid/org/apache/maven/wagon/wagon-file/1.0-beta-5/wagon-file-1.0-beta-5.pom
1K downloaded  (wagon-file-1.0-beta-5.pom)
Downloading: http://repository.sonatype.org:8081/content/groups/sonatype-grid/org/apache/maven/wagon/wagon-providers/1.0-beta-5/wagon-providers-1.0-beta-5.pom
2K downloaded  (wagon-providers-1.0-beta-5.pom)
Downloading: http://repository.sonatype.org:8081/content/groups/sonatype-grid/org/apache/maven/wagon/wagon/1.0-beta-5/wagon-1.0-beta-5.pom
10K downloaded  (wagon-1.0-beta-5.pom)
Downloading: http://repository.sonatype.org:8081/content/groups/sonatype-grid/org/apache/maven/wagon/wagon-provider-api/1.0-beta-5/wagon-provider-api-1.0-beta-5.pom
1K downloaded  (wagon-provider-api-1.0-beta-5.pom)
Downloading: http://repository.sonatype.org:8081/content/groups/sonatype-grid/org/apache/maven/wagon/wagon-http/1.0-beta-5/wagon-http-1.0-beta-5.pom
3K downloaded  (wagon-http-1.0-beta-5.pom)
Downloading: http://repository.sonatype.org:8081/content/groups/sonatype-grid/org/apache/maven/wagon/wagon-http-shared/1.0-beta-5/wagon-http-shared-1.0-beta-5.pom
2K downloaded  (wagon-http-shared-1.0-beta-5.pom)
Downloading: http://repository.sonatype.org:8081/content/groups/sonatype-grid/nekohtml/xercesMinimal/1.9.6.2/xercesMinimal-1.9.6.2.pom
390b downloaded  (xercesMinimal-1.9.6.2.pom)
Downloading: http://repository.sonatype.org:8081/content/groups/sonatype-grid/nekohtml/nekohtml/1.9.6.2/nekohtml-1.9.6.2.pom
704b downloaded  (nekohtml-1.9.6.2.pom)
Downloading: http://repository.sonatype.org:8081/content/groups/sonatype-grid/commons-httpclient/commons-httpclient/3.1/commons-httpclient-3.1.pom
7K downloaded  (commons-httpclient-3.1.pom)
Downloading: http://repository.sonatype.org:8081/content/groups/sonatype-grid/commons-codec/commons-codec/1.2/commons-codec-1.2.pom
3K downloaded  (commons-codec-1.2.pom)
Downloading: http://repository.sonatype.org:8081/content/groups/sonatype-grid/org/apache/maven/maven-artifact/2.2.0-RC1/maven-artifact-2.2.0-RC1.pom
[INFO] Unable to find resource 'org.apache.maven:maven-artifact:pom:2.2.0-RC1' in repository
central (http://Nexus)
Downloading: http://repository.sonatype.org:8081/content/groups/sonatype-grid/backport-util-concurrent/backport-util-concurrent/3.1/backport-util-concurrent-3.1.pom
880b downloaded  (backport-util-concurrent-3.1.pom)
Downloading: http://repository.sonatype.org:8081/content/groups/sonatype-grid/easymock/easymock/1.2_Java1.3/easymock-1.2_Java1.3.pom
192b downloaded  (easymock-1.2_Java1.3.pom)
Downloading: http://repository.sonatype.org:8081/content/groups/sonatype-grid/edu/umd/cs/mtc/multithreadedtc-jdk14/1.01/multithreadedtc-jdk14-1.01.pom
1K downloaded  (multithreadedtc-jdk14-1.01.pom)
Downloading: http://repository.sonatype.org:8081/content/groups/sonatype-grid/net/sf/retrotranslator/retrotranslator-runtime/1.2.7/retrotranslator-runtime-1.2.7.pom
1K downloaded  (retrotranslator-runtime-1.2.7.pom)
Downloading: http://repository.sonatype.org:8081/content/groups/sonatype-grid/commons-logging/commons-logging/1.0.4/commons-logging-1.0.4.jar
Downloading: http://repository.sonatype.org:8081/content/groups/sonatype-grid/org/apache/maven/wagon/wagon-file/1.0-beta-5/wagon-file-1.0-beta-5.jar
Downloading: http://repository.sonatype.org:8081/content/groups/sonatype-grid/nekohtml/xercesMinimal/1.9.6.2/xercesMinimal-1.9.6.2.jar
Downloading: http://repository.sonatype.org:8081/content/groups/sonatype-grid/commons-codec/commons-codec/1.2/commons-codec-1.2.jar
Downloading: http://repository.sonatype.org:8081/content/groups/sonatype-grid/org/apache/maven/maven-repository-metadata/2.2.0-RC1/maven-repository-metadata-2.2.0-RC1.jar
38K downloaded  (xercesMinimal-1.9.6.2.jar)
10K downloaded  (wagon-file-1.0-beta-5.jar)
37K downloaded  (commons-logging-1.0.4.jar)
[INFO] Unable to find resource 'org.apache.maven:maven-repository-metadata:jar:2.2.0-RC1'
in repository central (http://Nexus)
Downloading: http://repository.sonatype.org:8081/content/groups/sonatype-grid/commons-httpclient/commons-httpclient/3.1/commons-httpclient-3.1.jar
29K downloaded  (commons-codec-1.2.jar)
Downloading: http://repository.sonatype.org:8081/content/groups/sonatype-grid/backport-util-concurrent/backport-util-concurrent/3.1/backport-util-concurrent-3.1.jar
Downloading: http://repository.sonatype.org:8081/content/groups/sonatype-grid/easymock/easymock/1.2_Java1.3/easymock-1.2_Java1.3.jar
Downloading: http://repository.sonatype.org:8081/content/groups/sonatype-grid/edu/umd/cs/mtc/multithreadedtc-jdk14/1.01/multithreadedtc-jdk14-1.01.jar
Downloading: http://repository.sonatype.org:8081/content/groups/sonatype-grid/net/sf/retrotranslator/retrotranslator-runtime/1.2.7/retrotranslator-runtime-1.2.7.jar
35K downloaded  (easymock-1.2_Java1.3.jar)
299K downloaded  (retrotranslator-runtime-1.2.7.jar)
297K downloaded  (commons-httpclient-3.1.jar)
19K downloaded  (multithreadedtc-jdk14-1.01.jar)
323K downloaded  (backport-util-concurrent-3.1.jar)
Downloading: http://repository.sonatype.org:8081/content/groups/sonatype-grid/org/apache/maven/maven-artifact/2.2.0-RC1/maven-artifact-2.2.0-RC1.jar
Downloading: http://repository.sonatype.org:8081/content/groups/sonatype-grid/nekohtml/nekohtml/1.9.6.2/nekohtml-1.9.6.2.jar
Downloading: http://repository.sonatype.org:8081/content/groups/sonatype-grid/org/apache/maven/wagon/wagon-provider-api/1.0-beta-5/wagon-provider-api-1.0-beta-5.jar
[INFO] Unable to find resource 'org.apache.maven:maven-artifact:jar:2.2.0-RC1' in repository
central (http://Nexus)
109K downloaded  (nekohtml-1.9.6.2.jar)
51K downloaded  (wagon-provider-api-1.0-beta-5.jar)
Downloading: http://repository.sonatype.org:8081/content/groups/sonatype-grid/org/apache/maven/wagon/wagon-http/1.0-beta-5/wagon-http-1.0-beta-5.jar
10K downloaded  (wagon-http-1.0-beta-5.jar)
Downloading: http://repository.sonatype.org:8081/content/groups/sonatype-grid/org/apache/maven/wagon/wagon-http-shared/1.0-beta-5/wagon-http-shared-1.0-beta-5.jar
19K downloaded  (wagon-http-shared-1.0-beta-5.jar)
[INFO] ------------------------------------------------------------------------
[ERROR] BUILD ERROR
[INFO] ------------------------------------------------------------------------
[INFO] Failed to resolve artifact.

Missing:
----------
1) org.apache.maven:maven-repository-metadata:jar:2.2.0-RC1

  Try downloading the file manually from the project website.

  Then, install it using the command: 
      mvn install:install-file -DgroupId=org.apache.maven -DartifactId=maven-repository-metadata
-Dversion=2.2.0-RC1 -Dpackaging=jar -Dfile=/path/to/file

  Alternatively, if you host your own repository you can deploy the file there: 
      mvn deploy:deploy-file -DgroupId=org.apache.maven -DartifactId=maven-repository-metadata
-Dversion=2.2.0-RC1 -Dpackaging=jar -Dfile=/path/to/file -Durl=[url] -DrepositoryId=[id]

  Path to dependency: 
  	1) org.apache.maven:maven-artifact-manager:jar:2.2.0-RC2-SNAPSHOT
  	2) org.apache.maven:maven-repository-metadata:jar:2.2.0-RC1

2) org.apache.maven:maven-artifact:jar:2.2.0-RC1

  Try downloading the file manually from the project website.

  Then, install it using the command: 
      mvn install:install-file -DgroupId=org.apache.maven -DartifactId=maven-artifact -Dversion=2.2.0-RC1
-Dpackaging=jar -Dfile=/path/to/file

  Alternatively, if you host your own repository you can deploy the file there: 
      mvn deploy:deploy-file -DgroupId=org.apache.maven -DartifactId=maven-artifact -Dversion=2.2.0-RC1
-Dpackaging=jar -Dfile=/path/to/file -Durl=[url] -DrepositoryId=[id]

  Path to dependency: 
  	1) org.apache.maven:maven-artifact-manager:jar:2.2.0-RC2-SNAPSHOT
  	2) org.apache.maven:maven-artifact:jar:2.2.0-RC1

----------
2 required artifacts are missing.

for artifact: 
  org.apache.maven:maven-artifact-manager:jar:2.2.0-RC2-SNAPSHOT

from the specified remote repositories:
  Nexus (http://repository.sonatype.org:8081/content/groups/sonatype-grid)



[INFO] ------------------------------------------------------------------------
[INFO] Trace
org.apache.maven.lifecycle.LifecycleExecutionException: Missing:
----------
1) org.apache.maven:maven-repository-metadata:jar:2.2.0-RC1

  Try downloading the file manually from the project website.

  Then, install it using the command: 
      mvn install:install-file -DgroupId=org.apache.maven -DartifactId=maven-repository-metadata
-Dversion=2.2.0-RC1 -Dpackaging=jar -Dfile=/path/to/file

  Alternatively, if you host your own repository you can deploy the file there: 
      mvn deploy:deploy-file -DgroupId=org.apache.maven -DartifactId=maven-repository-metadata
-Dversion=2.2.0-RC1 -Dpackaging=jar -Dfile=/path/to/file -Durl=[url] -DrepositoryId=[id]

  Path to dependency: 
  	1) org.apache.maven:maven-artifact-manager:jar:2.2.0-RC2-SNAPSHOT
  	2) org.apache.maven:maven-repository-metadata:jar:2.2.0-RC1

2) org.apache.maven:maven-artifact:jar:2.2.0-RC1

  Try downloading the file manually from the project website.

  Then, install it using the command: 
      mvn install:install-file -DgroupId=org.apache.maven -DartifactId=maven-artifact -Dversion=2.2.0-RC1
-Dpackaging=jar -Dfile=/path/to/file

  Alternatively, if you host your own repository you can deploy the file there: 
      mvn deploy:deploy-file -DgroupId=org.apache.maven -DartifactId=maven-artifact -Dversion=2.2.0-RC1
-Dpackaging=jar -Dfile=/path/to/file -Durl=[url] -DrepositoryId=[id]

  Path to dependency: 
  	1) org.apache.maven:maven-artifact-manager:jar:2.2.0-RC2-SNAPSHOT
  	2) org.apache.maven:maven-artifact:jar:2.2.0-RC1

----------
2 required artifacts are missing.

for artifact: 
  org.apache.maven:maven-artifact-manager:jar:2.2.0-RC2-SNAPSHOT

from the specified remote repositories:
  Nexus (http://repository.sonatype.org:8081/content/groups/sonatype-grid)


	at org.apache.maven.lifecycle.DefaultLifecycleExecutor.executeGoals(DefaultLifecycleExecutor.java:695)
	at org.apache.maven.lifecycle.DefaultLifecycleExecutor.executeGoalWithLifecycle(DefaultLifecycleExecutor.java:540)
	at org.apache.maven.lifecycle.DefaultLifecycleExecutor.executeGoal(DefaultLifecycleExecutor.java:519)
	at org.apache.maven.lifecycle.DefaultLifecycleExecutor.executeGoalAndHandleFailures(DefaultLifecycleExecutor.java:371)
	at org.apache.maven.lifecycle.DefaultLifecycleExecutor.executeTaskSegments(DefaultLifecycleExecutor.java:332)
	at org.apache.maven.lifecycle.DefaultLifecycleExecutor.execute(DefaultLifecycleExecutor.java:181)
	at org.apache.maven.DefaultMaven.doExecute(DefaultMaven.java:356)
	at org.apache.maven.DefaultMaven.execute(DefaultMaven.java:137)
	at org.apache.maven.cli.MavenCli.main(MavenCli.java:356)
	at sun.reflect.NativeMethodAccessorImpl.invoke0(Native Method)
	at sun.reflect.NativeMethodAccessorImpl.invoke(NativeMethodAccessorImpl.java:39)
	at sun.reflect.DelegatingMethodAccessorImpl.invoke(DelegatingMethodAccessorImpl.java:25)
	at java.lang.reflect.Method.invoke(Method.java:585)
	at org.codehaus.classworlds.Launcher.launchEnhanced(Launcher.java:315)
	at org.codehaus.classworlds.Launcher.launch(Launcher.java:255)
	at org.codehaus.classworlds.Launcher.mainWithExitCode(Launcher.java:430)
	at org.codehaus.classworlds.Launcher.main(Launcher.java:375)
Caused by: org.apache.maven.artifact.resolver.MultipleArtifactsNotFoundException: Missing:
----------
1) org.apache.maven:maven-repository-metadata:jar:2.2.0-RC1

  Try downloading the file manually from the project website.

  Then, install it using the command: 
      mvn install:install-file -DgroupId=org.apache.maven -DartifactId=maven-repository-metadata
-Dversion=2.2.0-RC1 -Dpackaging=jar -Dfile=/path/to/file

  Alternatively, if you host your own repository you can deploy the file there: 
      mvn deploy:deploy-file -DgroupId=org.apache.maven -DartifactId=maven-repository-metadata
-Dversion=2.2.0-RC1 -Dpackaging=jar -Dfile=/path/to/file -Durl=[url] -DrepositoryId=[id]

  Path to dependency: 
  	1) org.apache.maven:maven-artifact-manager:jar:2.2.0-RC2-SNAPSHOT
  	2) org.apache.maven:maven-repository-metadata:jar:2.2.0-RC1

2) org.apache.maven:maven-artifact:jar:2.2.0-RC1

  Try downloading the file manually from the project website.

  Then, install it using the command: 
      mvn install:install-file -DgroupId=org.apache.maven -DartifactId=maven-artifact -Dversion=2.2.0-RC1
-Dpackaging=jar -Dfile=/path/to/file

  Alternatively, if you host your own repository you can deploy the file there: 
      mvn deploy:deploy-file -DgroupId=org.apache.maven -DartifactId=maven-artifact -Dversion=2.2.0-RC1
-Dpackaging=jar -Dfile=/path/to/file -Durl=[url] -DrepositoryId=[id]

  Path to dependency: 
  	1) org.apache.maven:maven-artifact-manager:jar:2.2.0-RC2-SNAPSHOT
  	2) org.apache.maven:maven-artifact:jar:2.2.0-RC1

----------
2 required artifacts are missing.

for artifact: 
  org.apache.maven:maven-artifact-manager:jar:2.2.0-RC2-SNAPSHOT

from the specified remote repositories:
  Nexus (http://repository.sonatype.org:8081/content/groups/sonatype-grid)


	at org.apache.maven.artifact.resolver.DefaultArtifactResolver.resolveTransitively(DefaultArtifactResolver.java:360)
	at org.apache.maven.artifact.resolver.DefaultArtifactResolver.resolveTransitively(DefaultArtifactResolver.java:304)
	at org.apache.maven.plugin.DefaultPluginManager.resolveTransitiveDependencies(DefaultPluginManager.java:1492)
	at org.apache.maven.plugin.DefaultPluginManager.executeMojo(DefaultPluginManager.java:435)
	at org.apache.maven.lifecycle.DefaultLifecycleExecutor.executeGoals(DefaultLifecycleExecutor.java:678)
	... 16 more
[INFO] ------------------------------------------------------------------------
[INFO] Total time: 4 minutes 15 seconds
[INFO] Finished at: Fri May 01 22:21:17 PDT 2009
[INFO] Final Memory: 26M/47M
[INFO] ------------------------------------------------------------------------
[locks-and-latches] Releasing all the locks
[locks-and-latches] All the locks released


Mime
View raw message