maven-notifications mailing list archives

Site index · List index
Message view « Date » · « Thread »
Top « Date » · « Thread »
From Hudson <Hud...@sonatype.org>
Subject Build failed in Hudson: Maven-2.1.x-bootstrap » 1.5,osx #167
Date Thu, 28 May 2009 22:10:24 GMT
See http://grid.sonatype.org/ci/job/Maven-2.1.x-bootstrap/./jdk=1.5,label=osx/167/changes

Changes:

[Benjamin Bentmann] [MNG-4179] [regression] Artifact download hangs upon transfer failure

o Merged from r779768

------------------------------------------
[...truncated 5002 lines...]
     [exec] [INFO] [resources:resources]
     [exec] [INFO] Using 'UTF-8' encoding to copy filtered resources.
     [exec] [INFO] skip non existing resourceDirectory /private/tmp/maven-integration-tests-2.1.x/core-it-support/core-it-plugins/maven-it-plugin-core-stubs/maven-plugin-plugin/src/main/resources
     [exec] [INFO] Copying 3 resources
     [exec] [INFO] [compiler:compile]
     [exec] [INFO] Compiling 3 source files to /private/tmp/maven-integration-tests-2.1.x/core-it-support/core-it-plugins/maven-it-plugin-core-stubs/maven-plugin-plugin/target/classes
     [exec] [INFO] [resources:testResources]
     [exec] [INFO] Using 'UTF-8' encoding to copy filtered resources.
     [exec] [INFO] skip non existing resourceDirectory /private/tmp/maven-integration-tests-2.1.x/core-it-support/core-it-plugins/maven-it-plugin-core-stubs/maven-plugin-plugin/src/test/resources
     [exec] [INFO] Copying 3 resources
     [exec] [INFO] [compiler:testCompile]
     [exec] [INFO] Not compiling test sources
     [exec] [INFO] [surefire:test]
     [exec] [INFO] Tests are skipped.
     [exec] [INFO] [jar:jar]
     [exec] [INFO] Building jar: /private/tmp/maven-integration-tests-2.1.x/core-it-support/core-it-plugins/maven-it-plugin-core-stubs/maven-plugin-plugin/target/maven-plugin-plugin-0.1-stub-SNAPSHOT.jar
     [exec] [INFO] [plugin:addPluginArtifactMetadata]
     [exec] [INFO] [install:install]
     [exec] [INFO] Writing transformed POM using encoding: UTF-8
     [exec] [INFO] Installing /private/tmp/maven-integration-tests-2.1.x/core-it-support/core-it-plugins/maven-it-plugin-core-stubs/maven-plugin-plugin/target/maven-plugin-plugin-0.1-stub-SNAPSHOT.jar
to /opt/repos/bootstrap-maven-2.1.x/org/apache/maven/plugins/maven-plugin-plugin/0.1-stub-SNAPSHOT/maven-plugin-plugin-0.1-stub-SNAPSHOT.jar
     [exec] [INFO] [plugin:updateRegistry]
     [exec] [INFO] ------------------------------------------------------------------------
     [exec] [INFO] Building Maven Integration Test Plugin :: Maven RAR Plugin Stub
     [exec] [INFO]    task-segment: [clean, install]
     [exec] [INFO] ------------------------------------------------------------------------
     [exec] [INFO] [clean:clean]
     [exec] [INFO] [plugin:descriptor]
     [exec] [INFO] Using 2 extractors.
     [exec] [INFO] Applying extractor for language: java
     [exec] [INFO] Extractor for language: java found 1 mojo descriptors.
     [exec] [INFO] Applying extractor for language: bsh
     [exec] [INFO] Extractor for language: bsh found 0 mojo descriptors.
     [exec] [INFO] [remote-resources:process {execution: default}]
     [exec] [INFO] [resources:resources]
     [exec] [INFO] Using 'UTF-8' encoding to copy filtered resources.
     [exec] [INFO] skip non existing resourceDirectory /private/tmp/maven-integration-tests-2.1.x/core-it-support/core-it-plugins/maven-it-plugin-core-stubs/maven-rar-plugin/src/main/resources
     [exec] [INFO] Copying 3 resources
     [exec] [INFO] [compiler:compile]
     [exec] [INFO] Compiling 1 source file to /private/tmp/maven-integration-tests-2.1.x/core-it-support/core-it-plugins/maven-it-plugin-core-stubs/maven-rar-plugin/target/classes
     [exec] [INFO] [resources:testResources]
     [exec] [INFO] Using 'UTF-8' encoding to copy filtered resources.
     [exec] [INFO] skip non existing resourceDirectory /private/tmp/maven-integration-tests-2.1.x/core-it-support/core-it-plugins/maven-it-plugin-core-stubs/maven-rar-plugin/src/test/resources
     [exec] [INFO] Copying 3 resources
     [exec] [INFO] [compiler:testCompile]
     [exec] [INFO] Not compiling test sources
     [exec] [INFO] [surefire:test]
     [exec] [INFO] Tests are skipped.
     [exec] [INFO] [jar:jar]
     [exec] [INFO] Building jar: /private/tmp/maven-integration-tests-2.1.x/core-it-support/core-it-plugins/maven-it-plugin-core-stubs/maven-rar-plugin/target/maven-rar-plugin-0.1-stub-SNAPSHOT.jar
     [exec] [INFO] [plugin:addPluginArtifactMetadata]
     [exec] [INFO] [install:install]
     [exec] [INFO] Writing transformed POM using encoding: UTF-8
     [exec] [INFO] Installing /private/tmp/maven-integration-tests-2.1.x/core-it-support/core-it-plugins/maven-it-plugin-core-stubs/maven-rar-plugin/target/maven-rar-plugin-0.1-stub-SNAPSHOT.jar
to /opt/repos/bootstrap-maven-2.1.x/org/apache/maven/plugins/maven-rar-plugin/0.1-stub-SNAPSHOT/maven-rar-plugin-0.1-stub-SNAPSHOT.jar
     [exec] [INFO] [plugin:updateRegistry]
     [exec] [INFO] ------------------------------------------------------------------------
     [exec] [INFO] Building Maven Integration Test Plugin :: Maven Resources Plugin Stub
     [exec] [INFO]    task-segment: [clean, install]
     [exec] [INFO] ------------------------------------------------------------------------
     [exec] [INFO] [clean:clean]
     [exec] [INFO] [plugin:descriptor]
     [exec] [INFO] Using 2 extractors.
     [exec] [INFO] Applying extractor for language: java
     [exec] [INFO] Extractor for language: java found 2 mojo descriptors.
     [exec] [INFO] Applying extractor for language: bsh
     [exec] [INFO] Extractor for language: bsh found 0 mojo descriptors.
     [exec] [INFO] [remote-resources:process {execution: default}]
     [exec] [INFO] [resources:resources]
     [exec] [INFO] Using 'UTF-8' encoding to copy filtered resources.
     [exec] [INFO] skip non existing resourceDirectory /private/tmp/maven-integration-tests-2.1.x/core-it-support/core-it-plugins/maven-it-plugin-core-stubs/maven-resources-plugin/src/main/resources
     [exec] [INFO] Copying 3 resources
     [exec] [INFO] [compiler:compile]
     [exec] [INFO] Compiling 2 source files to /private/tmp/maven-integration-tests-2.1.x/core-it-support/core-it-plugins/maven-it-plugin-core-stubs/maven-resources-plugin/target/classes
     [exec] [INFO] [resources:testResources]
     [exec] [INFO] Using 'UTF-8' encoding to copy filtered resources.
     [exec] [INFO] skip non existing resourceDirectory /private/tmp/maven-integration-tests-2.1.x/core-it-support/core-it-plugins/maven-it-plugin-core-stubs/maven-resources-plugin/src/test/resources
     [exec] [INFO] Copying 3 resources
     [exec] [INFO] [compiler:testCompile]
     [exec] [INFO] Not compiling test sources
     [exec] [INFO] [surefire:test]
     [exec] [INFO] Tests are skipped.
     [exec] [INFO] [jar:jar]
     [exec] [INFO] Building jar: /private/tmp/maven-integration-tests-2.1.x/core-it-support/core-it-plugins/maven-it-plugin-core-stubs/maven-resources-plugin/target/maven-resources-plugin-0.1-stub-SNAPSHOT.jar
     [exec] [INFO] [plugin:addPluginArtifactMetadata]
     [exec] [INFO] [install:install]
     [exec] [INFO] Writing transformed POM using encoding: UTF-8
     [exec] [INFO] Installing /private/tmp/maven-integration-tests-2.1.x/core-it-support/core-it-plugins/maven-it-plugin-core-stubs/maven-resources-plugin/target/maven-resources-plugin-0.1-stub-SNAPSHOT.jar
to /opt/repos/bootstrap-maven-2.1.x/org/apache/maven/plugins/maven-resources-plugin/0.1-stub-SNAPSHOT/maven-resources-plugin-0.1-stub-SNAPSHOT.jar
     [exec] [INFO] [plugin:updateRegistry]
     [exec] [INFO] ------------------------------------------------------------------------
     [exec] [INFO] Building Maven Integration Test Plugin :: Maven Site Plugin Stub
     [exec] [INFO]    task-segment: [clean, install]
     [exec] [INFO] ------------------------------------------------------------------------
     [exec] [INFO] [clean:clean]
     [exec] [INFO] [plugin:descriptor]
     [exec] [INFO] Using 2 extractors.
     [exec] [INFO] Applying extractor for language: java
     [exec] [INFO] Extractor for language: java found 3 mojo descriptors.
     [exec] [INFO] Applying extractor for language: bsh
     [exec] [INFO] Extractor for language: bsh found 0 mojo descriptors.
     [exec] [INFO] [remote-resources:process {execution: default}]
     [exec] [INFO] [resources:resources]
     [exec] [INFO] Using 'UTF-8' encoding to copy filtered resources.
     [exec] [INFO] skip non existing resourceDirectory /private/tmp/maven-integration-tests-2.1.x/core-it-support/core-it-plugins/maven-it-plugin-core-stubs/maven-site-plugin/src/main/resources
     [exec] [INFO] Copying 3 resources
     [exec] [INFO] [compiler:compile]
     [exec] [INFO] Compiling 3 source files to /private/tmp/maven-integration-tests-2.1.x/core-it-support/core-it-plugins/maven-it-plugin-core-stubs/maven-site-plugin/target/classes
     [exec] [INFO] [resources:testResources]
     [exec] [INFO] Using 'UTF-8' encoding to copy filtered resources.
     [exec] [INFO] skip non existing resourceDirectory /private/tmp/maven-integration-tests-2.1.x/core-it-support/core-it-plugins/maven-it-plugin-core-stubs/maven-site-plugin/src/test/resources
     [exec] [INFO] Copying 3 resources
     [exec] [INFO] [compiler:testCompile]
     [exec] [INFO] Not compiling test sources
     [exec] [INFO] [surefire:test]
     [exec] [INFO] Tests are skipped.
     [exec] [INFO] [jar:jar]
     [exec] [INFO] Building jar: /private/tmp/maven-integration-tests-2.1.x/core-it-support/core-it-plugins/maven-it-plugin-core-stubs/maven-site-plugin/target/maven-site-plugin-0.1-stub-SNAPSHOT.jar
     [exec] [INFO] [plugin:addPluginArtifactMetadata]
     [exec] [INFO] [install:install]
     [exec] [INFO] Writing transformed POM using encoding: UTF-8
     [exec] [INFO] Installing /private/tmp/maven-integration-tests-2.1.x/core-it-support/core-it-plugins/maven-it-plugin-core-stubs/maven-site-plugin/target/maven-site-plugin-0.1-stub-SNAPSHOT.jar
to /opt/repos/bootstrap-maven-2.1.x/org/apache/maven/plugins/maven-site-plugin/0.1-stub-SNAPSHOT/maven-site-plugin-0.1-stub-SNAPSHOT.jar
     [exec] [INFO] [plugin:updateRegistry]
     [exec] [INFO] ------------------------------------------------------------------------
     [exec] [INFO] Building Maven Integration Test Plugin :: Maven Source Plugin Stub
     [exec] [INFO]    task-segment: [clean, install]
     [exec] [INFO] ------------------------------------------------------------------------
     [exec] [INFO] [clean:clean]
     [exec] [INFO] [plugin:descriptor]
     [exec] [INFO] Using 2 extractors.
     [exec] [INFO] Applying extractor for language: java
     [exec] [INFO] Extractor for language: java found 1 mojo descriptors.
     [exec] [INFO] Applying extractor for language: bsh
     [exec] [INFO] Extractor for language: bsh found 0 mojo descriptors.
     [exec] [INFO] [remote-resources:process {execution: default}]
     [exec] [INFO] [resources:resources]
     [exec] [INFO] Using 'UTF-8' encoding to copy filtered resources.
     [exec] [INFO] skip non existing resourceDirectory /private/tmp/maven-integration-tests-2.1.x/core-it-support/core-it-plugins/maven-it-plugin-core-stubs/maven-source-plugin/src/main/resources
     [exec] [INFO] Copying 3 resources
     [exec] [INFO] [compiler:compile]
     [exec] [INFO] Compiling 1 source file to /private/tmp/maven-integration-tests-2.1.x/core-it-support/core-it-plugins/maven-it-plugin-core-stubs/maven-source-plugin/target/classes
     [exec] [INFO] [resources:testResources]
     [exec] [INFO] Using 'UTF-8' encoding to copy filtered resources.
     [exec] [INFO] skip non existing resourceDirectory /private/tmp/maven-integration-tests-2.1.x/core-it-support/core-it-plugins/maven-it-plugin-core-stubs/maven-source-plugin/src/test/resources
     [exec] [INFO] Copying 3 resources
     [exec] [INFO] [compiler:testCompile]
     [exec] [INFO] Not compiling test sources
     [exec] [INFO] [surefire:test]
     [exec] [INFO] Tests are skipped.
     [exec] [INFO] [jar:jar]
     [exec] [INFO] Building jar: /private/tmp/maven-integration-tests-2.1.x/core-it-support/core-it-plugins/maven-it-plugin-core-stubs/maven-source-plugin/target/maven-source-plugin-0.1-stub-SNAPSHOT.jar
     [exec] [INFO] [plugin:addPluginArtifactMetadata]
     [exec] [INFO] [install:install]
     [exec] [INFO] Writing transformed POM using encoding: UTF-8
     [exec] [INFO] Installing /private/tmp/maven-integration-tests-2.1.x/core-it-support/core-it-plugins/maven-it-plugin-core-stubs/maven-source-plugin/target/maven-source-plugin-0.1-stub-SNAPSHOT.jar
to /opt/repos/bootstrap-maven-2.1.x/org/apache/maven/plugins/maven-source-plugin/0.1-stub-SNAPSHOT/maven-source-plugin-0.1-stub-SNAPSHOT.jar
     [exec] [INFO] [plugin:updateRegistry]
     [exec] [INFO] ------------------------------------------------------------------------
     [exec] [INFO] Building Maven Integration Test Plugin :: Maven Surefire Plugin Stub
     [exec] [INFO]    task-segment: [clean, install]
     [exec] [INFO] ------------------------------------------------------------------------
     [exec] [INFO] [clean:clean]
     [exec] [INFO] [plugin:descriptor]
     [exec] [INFO] Using 2 extractors.
     [exec] [INFO] Applying extractor for language: java
     [exec] [INFO] Extractor for language: java found 1 mojo descriptors.
     [exec] [INFO] Applying extractor for language: bsh
     [exec] [INFO] Extractor for language: bsh found 0 mojo descriptors.
     [exec] [INFO] [remote-resources:process {execution: default}]
     [exec] [INFO] [resources:resources]
     [exec] [INFO] Using 'UTF-8' encoding to copy filtered resources.
     [exec] [INFO] skip non existing resourceDirectory /private/tmp/maven-integration-tests-2.1.x/core-it-support/core-it-plugins/maven-it-plugin-core-stubs/maven-surefire-plugin/src/main/resources
     [exec] [INFO] Copying 3 resources
     [exec] [INFO] [compiler:compile]
     [exec] [INFO] Compiling 1 source file to /private/tmp/maven-integration-tests-2.1.x/core-it-support/core-it-plugins/maven-it-plugin-core-stubs/maven-surefire-plugin/target/classes
     [exec] [INFO] [resources:testResources]
     [exec] [INFO] Using 'UTF-8' encoding to copy filtered resources.
     [exec] [INFO] skip non existing resourceDirectory /private/tmp/maven-integration-tests-2.1.x/core-it-support/core-it-plugins/maven-it-plugin-core-stubs/maven-surefire-plugin/src/test/resources
     [exec] [INFO] Copying 3 resources
     [exec] [INFO] [compiler:testCompile]
     [exec] [INFO] Not compiling test sources
     [exec] [INFO] [surefire:test]
     [exec] [INFO] Tests are skipped.
     [exec] [INFO] [jar:jar]
     [exec] [INFO] Building jar: /private/tmp/maven-integration-tests-2.1.x/core-it-support/core-it-plugins/maven-it-plugin-core-stubs/maven-surefire-plugin/target/maven-surefire-plugin-0.1-stub-SNAPSHOT.jar
     [exec] [INFO] [plugin:addPluginArtifactMetadata]
     [exec] [INFO] [install:install]
     [exec] [INFO] Writing transformed POM using encoding: UTF-8
     [exec] [INFO] Installing /private/tmp/maven-integration-tests-2.1.x/core-it-support/core-it-plugins/maven-it-plugin-core-stubs/maven-surefire-plugin/target/maven-surefire-plugin-0.1-stub-SNAPSHOT.jar
to /opt/repos/bootstrap-maven-2.1.x/org/apache/maven/plugins/maven-surefire-plugin/0.1-stub-SNAPSHOT/maven-surefire-plugin-0.1-stub-SNAPSHOT.jar
     [exec] [INFO] ------------------------------------------------------------------------
     [exec] [ERROR] BUILD ERROR
     [exec] [INFO] ------------------------------------------------------------------------
     [exec] [INFO] Error installing artifact's metadata: Error installing metadata: Error
updating group repository metadata
     [exec] 
     [exec] input contained no data
     [exec] [INFO] ------------------------------------------------------------------------
     [exec] [INFO] Trace
     [exec] org.apache.maven.lifecycle.LifecycleExecutionException: Error installing artifact's
metadata: Error installing metadata: Error updating group repository metadata
     [exec] 	at org.apache.maven.lifecycle.DefaultLifecycleExecutor.executeGoals(DefaultLifecycleExecutor.java:703)
     [exec] 	at org.apache.maven.lifecycle.DefaultLifecycleExecutor.executeGoalWithLifecycle(DefaultLifecycleExecutor.java:540)
     [exec] 	at org.apache.maven.lifecycle.DefaultLifecycleExecutor.executeGoal(DefaultLifecycleExecutor.java:519)
     [exec] 	at org.apache.maven.lifecycle.DefaultLifecycleExecutor.executeGoalAndHandleFailures(DefaultLifecycleExecutor.java:371)
     [exec] 	at org.apache.maven.lifecycle.DefaultLifecycleExecutor.executeTaskSegments(DefaultLifecycleExecutor.java:332)
     [exec] 	at org.apache.maven.lifecycle.DefaultLifecycleExecutor.execute(DefaultLifecycleExecutor.java:181)
     [exec] 	at org.apache.maven.DefaultMaven.doExecute(DefaultMaven.java:356)
     [exec] 	at org.apache.maven.DefaultMaven.execute(DefaultMaven.java:137)
     [exec] 	at org.apache.maven.cli.MavenCli.main(MavenCli.java:356)
     [exec] 	at sun.reflect.NativeMethodAccessorImpl.invoke0(Native Method)
     [exec] 	at sun.reflect.NativeMethodAccessorImpl.invoke(NativeMethodAccessorImpl.java:39)
     [exec] 	at sun.reflect.DelegatingMethodAccessorImpl.invoke(DelegatingMethodAccessorImpl.java:25)
     [exec] 	at java.lang.reflect.Method.invoke(Method.java:585)
     [exec] 	at org.codehaus.classworlds.Launcher.launchEnhanced(Launcher.java:315)
     [exec] 	at org.codehaus.classworlds.Launcher.launch(Launcher.java:255)
     [exec] 	at org.codehaus.classworlds.Launcher.mainWithExitCode(Launcher.java:430)
     [exec] 	at org.codehaus.classworlds.Launcher.main(Launcher.java:375)
     [exec] Caused by: org.apache.maven.plugin.MojoExecutionException: Error installing artifact's
metadata: Error installing metadata: Error updating group repository metadata
     [exec] 	at org.apache.maven.plugin.install.InstallMojo.execute(InstallMojo.java:143)
     [exec] 	at org.apache.maven.plugin.DefaultPluginManager.executeMojo(DefaultPluginManager.java:483)
     [exec] 	at org.apache.maven.lifecycle.DefaultLifecycleExecutor.executeGoals(DefaultLifecycleExecutor.java:678)
     [exec] 	... 16 more
     [exec] Caused by: org.apache.maven.artifact.installer.ArtifactInstallationException:
Error installing artifact's metadata: Error installing metadata: Error updating group repository
metadata
     [exec] 	at org.apache.maven.artifact.installer.DefaultArtifactInstaller.install(DefaultArtifactInstaller.java:123)
     [exec] 	at org.apache.maven.plugin.install.InstallMojo.execute(InstallMojo.java:105)
     [exec] 	... 18 more
     [exec] Caused by: org.apache.maven.artifact.repository.metadata.RepositoryMetadataInstallationException:
Error installing metadata: Error updating group repository metadata
     [exec] 	at org.apache.maven.artifact.repository.metadata.DefaultRepositoryMetadataManager.install(DefaultRepositoryMetadataManager.java:462)
     [exec] 	at org.apache.maven.artifact.installer.DefaultArtifactInstaller.install(DefaultArtifactInstaller.java:111)
     [exec] 	... 19 more
     [exec] Caused by: org.apache.maven.artifact.repository.metadata.RepositoryMetadataStoreException:
Error updating group repository metadata
     [exec] 	at org.apache.maven.artifact.repository.metadata.AbstractRepositoryMetadata.storeInLocalRepository(AbstractRepositoryMetadata.java:72)
     [exec] 	at org.apache.maven.artifact.repository.metadata.DefaultRepositoryMetadataManager.install(DefaultRepositoryMetadataManager.java:458)
     [exec] 	... 20 more
     [exec] Caused by: java.io.EOFException: input contained no data
     [exec] 	at hidden.org.codehaus.plexus.util.xml.pull.MXParser.fillBuf(MXParser.java:2982)
     [exec] 	at hidden.org.codehaus.plexus.util.xml.pull.MXParser.more(MXParser.java:3025)
     [exec] 	at hidden.org.codehaus.plexus.util.xml.pull.MXParser.parseProlog(MXParser.java:1410)
     [exec] 	at hidden.org.codehaus.plexus.util.xml.pull.MXParser.nextImpl(MXParser.java:1395)
     [exec] 	at hidden.org.codehaus.plexus.util.xml.pull.MXParser.next(MXParser.java:1093)
     [exec] 	at org.apache.maven.artifact.repository.metadata.io.xpp3.MetadataXpp3Reader.read(MetadataXpp3Reader.java:949)
     [exec] 	at org.apache.maven.artifact.repository.metadata.AbstractRepositoryMetadata.updateRepositoryMetadata(AbstractRepositoryMetadata.java:98)
     [exec] 	at org.apache.maven.artifact.repository.metadata.AbstractRepositoryMetadata.storeInLocalRepository(AbstractRepositoryMetadata.java:68)
     [exec] 	... 21 more
     [exec] [INFO] ------------------------------------------------------------------------
     [exec] [INFO] Total time: 4 minutes 26 seconds
     [exec] [INFO] Finished at: Thu May 28 17:09:37 CDT 2009
     [exec] [INFO] Final Memory: 27M/53M
     [exec] [INFO] ------------------------------------------------------------------------

BUILD FAILED
http://grid.sonatype.org/ci/job/Maven-2.1.x-bootstrap/./jdk=1.5,label=osx/ws/maven-2.1.x/build.xml
:291: exec returned: 1

Total time: 40 minutes 53 seconds
Archiving artifacts


Mime
View raw message